*: [iurt] This is iurt version 0.9.4
D: [iurt] [iurt] load config: /home/iurt/.iurt.cauldron.conf
D: [iurt] [iurt] load config: /etc/iurt/build/cauldron.conf
D: [iurt] [iurt] Setting PERL_EXTUTILS_AUTOINSTALL to --skipdeps
D: [iurt] [iurt] Setting PERL_AUTOINSTALL to --skipdeps
I: [iurt] [iurt] local spool: /home/iurt/iurt/cauldron/core/release/20261006070939.ns80.duvel.2034853-x86_64
I: [iurt] [iurt] Packages to build: 1
D: [iurt] [iurt] using 0.20261006071003 as chroot extension
D: [iurt] [iurt] using local user iurt, id 501
I: [iurt] [iurt] Remove existing chroot
D: [iurt] [iurt] ... dir /home/iurt/chroot_tmp all prefix chroot_cauldron.x86_64
D: [iurt] [iurt] running with pid 833087
N: [iurt] [iurt] Build package @2375899:clojure-core-specs-alpha-0.5.81-2.mga11.src.rpm [1/1]
D: [iurt] [iurt] Not reusing old chroot
I: [iurt] [iurt] Install new chroot
D: [iurt] [iurt] ... in /home/iurt/chroot_tmp/iurt/chroot_cauldron.x86_64.0.20261006071003
D: [iurt] [iurt] clean chroot
N: [iurt] [iurt] creating chroot
D: [iurt_root_command] Running iurt_root_command --mkdir -p /home/iurt/chroot_tmp/iurt/chroot_cauldron.x86_64.0.20261006071003.tmp.7Z3Rvf
D: [iurt_root_command] Creating the path
D: [iurt_root_command] Success!
D: [iurt] [iurt] decompressing /var/log/qa from /home/iurt/chroot_cauldron.x86_64.tar in /home/iurt/chroot_tmp/iurt/chroot_cauldron.x86_64.0.20261006071003.tmp.7Z3Rvf
D: [iurt_root_command] Running iurt_root_command --untar /home/iurt/chroot_cauldron.x86_64.tar /home/iurt/chroot_tmp/iurt/chroot_cauldron.x8...
D: [iurt_root_command] Uncompress tarball
D: [iurt_root_command] Success!
D: [iurt_root_command] Running iurt_root_command --mkdir -m 1023 /home/iurt/chroot_tmp/iurt/chroot_cauldron.x86_64.0.20261006071003.tmp.7Z3R...
D: [iurt_root_command] Creating the path
D: [iurt_root_command] Success!
/bin/cp: cannot create special file '/home/iurt/chroot_tmp/iurt/chroot_cauldron.x86_64.0.20261006071003.tmp.7Z3Rvf/tmp/tmp.jaa9X7/dev/null': Operation not permitted
--2026-10-06 09:10:03-- http://repository.mageia.org/distrib/cauldron/x86_64/media/core/release/media_info/20261006-053413-synthesis.hdlist.cz
Resolving repository.mageia.org (repository.mageia.org)... 212.85.158.153
Connecting to repository.mageia.org (repository.mageia.org)|212.85.158.153|:80... connected.
HTTP request sent, awaiting response... 200 OK
Length: 3432510 (3.3M)
Saving to: '/home/iurt/chroot_tmp/iurt/chroot_cauldron.x86_64.0.20261006071003.tmp.7Z3Rvf/tmp/tmp.jaa9X7/tmp/.urpmi-501/partial/20261006-053413-synthesis.hdlist.cz'
0K .......... .......... .......... .......... .......... 1% 121M 0s
50K .......... .......... .......... .......... .......... 2% 115M 0s
100K .......... .......... .......... .......... .......... 4% 123M 0s
150K .......... .......... .......... .......... .......... 5% 120M 0s
200K .......... .......... .......... .......... .......... 7% 117M 0s
250K .......... .......... .......... .......... .......... 8% 111M 0s
300K .......... .......... .......... .......... .......... 10% 115M 0s
350K .......... .......... .......... .......... .......... 11% 106M 0s
400K .......... .......... .......... .......... .......... 13% 121M 0s
450K .......... .......... .......... .......... .......... 14% 114M 0s
500K .......... .......... .......... .......... .......... 16% 95.1M 0s
550K .......... .......... .......... .......... .......... 17% 120M 0s
600K .......... .......... .......... .......... .......... 19% 111M 0s
650K .......... .......... .......... .......... .......... 20% 116M 0s
700K .......... .......... .......... .......... .......... 22% 117M 0s
750K .......... .......... .......... .......... .......... 23% 103M 0s
800K .......... .......... .......... .......... .......... 25% 121M 0s
850K .......... .......... .......... .......... .......... 26% 111M 0s
900K .......... .......... .......... .......... .......... 28% 115M 0s
950K .......... .......... .......... .......... .......... 29% 111M 0s
1000K .......... .......... .......... .......... .......... 31% 115M 0s
1050K .......... .......... .......... .......... .......... 32% 113M 0s
1100K .......... .......... .......... .......... .......... 34% 113M 0s
1150K .......... .......... .......... .......... .......... 35% 118M 0s
1200K .......... .......... .......... .......... .......... 37% 92.6M 0s
1250K .......... .......... .......... .......... .......... 38% 118M 0s
1300K .......... .......... .......... .......... .......... 40% 111M 0s
1350K .......... .......... .......... .......... .......... 41% 114M 0s
1400K .......... .......... .......... .......... .......... 43% 113M 0s
1450K .......... .......... .......... .......... .......... 44% 116M 0s
1500K .......... .......... .......... .......... .......... 46% 116M 0s
1550K .......... .......... .......... .......... .......... 47% 113M 0s
1600K .......... .......... .......... .......... .......... 49% 111M 0s
1650K .......... .......... .......... .......... .......... 50% 111M 0s
1700K .......... .......... .......... .......... .......... 52% 118M 0s
1750K .......... .......... .......... .......... .......... 53% 113M 0s
1800K .......... .......... .......... .......... .......... 55% 104M 0s
1850K .......... .......... .......... .......... .......... 56% 120M 0s
1900K .......... .......... .......... .......... .......... 58% 98.7M 0s
1950K .......... .......... .......... .......... .......... 59% 114M 0s
2000K .......... .......... .......... .......... .......... 61% 116M 0s
2050K .......... .......... .......... .......... .......... 62% 114M 0s
2100K .......... .......... .......... .......... .......... 64% 109M 0s
2150K .......... .......... .......... .......... .......... 65% 116M 0s
2200K .......... .......... .......... .......... .......... 67% 104M 0s
2250K .......... .......... .......... .......... .......... 68% 114M 0s
2300K .......... .......... .......... .......... .......... 70% 126M 0s
2350K .......... .......... .......... .......... .......... 71% 107M 0s
2400K .......... .......... .......... .......... .......... 73% 118M 0s
2450K .......... .......... .......... .......... .......... 74% 114M 0s
2500K .......... .......... .......... .......... .......... 76% 113M 0s
2550K .......... .......... .......... .......... .......... 77% 115M 0s
2600K .......... .......... .......... .......... .......... 79% 96.5M 0s
2650K .......... .......... .......... .......... .......... 80% 110M 0s
2700K .......... .......... .......... .......... .......... 82% 109M 0s
2750K .......... .......... .......... .......... .......... 83% 127M 0s
2800K .......... .......... .......... .......... .......... 85% 109M 0s
2850K .......... .......... .......... .......... .......... 86% 116M 0s
2900K .......... .......... .......... .......... .......... 88% 111M 0s
2950K .......... .......... .......... .......... .......... 89% 108M 0s
3000K .......... .......... .......... .......... .......... 90% 119M 0s
3050K .......... .......... .......... .......... .......... 92% 112M 0s
3100K .......... .......... .......... .......... .......... 93% 113M 0s
3150K .......... .......... .......... .......... .......... 95% 117M 0s
3200K .......... .......... .......... .......... .......... 96% 115M 0s
3250K .......... .......... .......... .......... .......... 98% 115M 0s
3300K .......... .......... .......... .......... .......... 99% 99.2M 0s
3350K .. 100% 3.84T=0.03s
2026-10-06 09:10:03 (113 MB/s) - '/home/iurt/chroot_tmp/iurt/chroot_cauldron.x86_64.0.20261006071003.tmp.7Z3Rvf/tmp/tmp.jaa9X7/tmp/.urpmi-501/partial/20261006-053413-synthesis.hdlist.cz' saved [3432510/3432510]
--2026-10-06 09:10:03-- http://repository.mageia.org/distrib/cauldron/x86_64/media/core/updates/media_info/20260817-180200-synthesis.hdlist.cz
Resolving repository.mageia.org (repository.mageia.org)... 212.85.158.153
Connecting to repository.mageia.org (repository.mageia.org)|212.85.158.153|:80... connected.
HTTP request sent, awaiting response... 200 OK
Length: 32
Saving to: '/home/iurt/chroot_tmp/iurt/chroot_cauldron.x86_64.0.20261006071003.tmp.7Z3Rvf/tmp/tmp.jaa9X7/tmp/.urpmi-501/partial/20260817-180200-synthesis.hdlist.cz'
0K 100% 6.62M=0s
2026-10-06 09:10:03 (6.62 MB/s) - '/home/iurt/chroot_tmp/iurt/chroot_cauldron.x86_64.0.20261006071003.tmp.7Z3Rvf/tmp/tmp.jaa9X7/tmp/.urpmi-501/partial/20260817-180200-synthesis.hdlist.cz' saved [32/32]
N: [iurt] [iurt] chroot tarball is already up-to-date
D: [iurt_root_command] Running iurt_root_command --rm -r /home/iurt/chroot_tmp/iurt/chroot_cauldron.x86_64.0.20261006071003.tmp.7Z3Rvf
D: [iurt_root_command] Removing files
D: [iurt_root_command] removing /home/iurt/chroot_tmp/iurt/chroot_cauldron.x86_64.0.20261006071003.tmp.7Z3Rvf
D: [iurt_root_command] Success!
D: [iurt_root_command] Running iurt_root_command --rm -r /home/iurt/chroot_tmp/iurt/chroot_cauldron.x86_64.0.20261006071003
D: [iurt_root_command] Removing files
D: [iurt_root_command] removing /home/iurt/chroot_tmp/iurt/chroot_cauldron.x86_64.0.20261006071003
D: [iurt_root_command] Success!
D: [iurt_root_command] Running iurt_root_command --mkdir -p /home/iurt/chroot_tmp/iurt/chroot_cauldron.x86_64.0.20261006071003
D: [iurt_root_command] Creating the path
D: [iurt_root_command] Success!
D: [iurt_root_command] Running iurt_root_command --untar /home/iurt/chroot_cauldron.x86_64.tar /home/iurt/chroot_tmp/iurt/chroot_cauldron.x8...
D: [iurt_root_command] Uncompress tarball
D: [iurt_root_command] Success!
N: [iurt] [iurt] chroot recreated in /home/iurt/chroot_tmp/iurt/chroot_cauldron.x86_64.0.20261006071003 (from /home/iurt/chroot_cauldron.x86_64.tar)
D: [iurt_root_command] Running iurt_root_command --netns_create /home/iurt/chroot_tmp/iurt/chroot_cauldron.x86_64.0.20261006071003
D: [iurt_root_command] Create network namespace for given chroot
D: [iurt_root_command] Success!
D: [iurt_root_command] Running iurt_root_command --cp /tmp/rpmmacros.yjgDde /home/iurt/chroot_tmp/iurt/chroot_cauldron.x86_64.0.202610060710...
D: [iurt_root_command] Copying files
D: [iurt_root_command] copying /tmp/rpmmacros.yjgDde -> /home/iurt/chroot_tmp/iurt/chroot_cauldron.x86_64.0.20261006071003/etc/rpm/macros
D: [iurt_root_command] Success!
D: [iurt_root_command] Running iurt_root_command --bindmount /proc /home/iurt/chroot_tmp/iurt/chroot_cauldron.x86_64.0.20261006071003/proc
D: [iurt_root_command] Bind mounting
D: [iurt_root_command] Success!
D: [iurt_root_command] Running iurt_root_command --bindmount /dev/pts /home/iurt/chroot_tmp/iurt/chroot_cauldron.x86_64.0.20261006071003/dev...
D: [iurt_root_command] Bind mounting
D: [iurt_root_command] Success!
D: [iurt_root_command] Running iurt_root_command --tmpfs /home/iurt/chroot_tmp/iurt/chroot_cauldron.x86_64.0.20261006071003/dev/shm
D: [iurt_root_command] Mount tmpfs
D: [iurt_root_command] Success!
I: [iurt] [iurt] add chroot media: http://repository.mageia.org/distrib//cauldron/x86_64
D: [iurt] [iurt] Using timeout of 600 seconds.
D: [iurt] [iurt] /usr/bin/sudo /usr/sbin/iurt_root_command --urpmi-addmedia -v --urpmi-root /home/iurt/chroot_tmp/iurt/chroot_cauldron.x86_64.0.20261006071003 core_release http://repository.mageia.org/distrib//cauldron/x86_64/media/core/release
D: [iurt] [iurt] Command exited with 0.
MEDIA core_release
(core_release)
D: [iurt] [iurt] creating user iurt in chroot /home/iurt/chroot_tmp/iurt/chroot_cauldron.x86_64.0.20261006071003
D: [iurt_root_command] Running iurt_root_command --useradd /home/iurt/chroot_tmp/iurt/chroot_cauldron.x86_64.0.20261006071003 iurt 501
D: [iurt_root_command] Useradd
useradd warning: iurt's uid 501 outside of the UID_MIN 1000 and UID_MAX 60000 range.
D: [iurt_root_command] Success!
N: [iurt] [iurt] recreate srpm: @2375899:clojure-core-specs-alpha-0.5.81-2.mga11.src.rpm
D: [iurt] [iurt] Using timeout of 600 seconds.
D: [iurt] [iurt] perl command
D: [iurt_root_command] Running iurt_root_command --cp /home/iurt/iurt/cauldron/core/release/20261006070939.ns80.duvel.2034853-x86_64//@23758...
D: [iurt_root_command] Copying files
D: [iurt_root_command] copying /home/iurt/iurt/cauldron/core/release/20261006070939.ns80.duvel.2034853-x86_64//@2375899:clojure-core-specs-alpha-0.5.81-2.mga11.src.rpm -> /home/iurt/chroot_tmp/iurt/chroot_cauldron.x86_64.0.20261006071003/home/iurt/rpmbuild/SRPMS/
D: [iurt_root_command] Success!
D: [iurt] [iurt] Command exited with 0.
D: [iurt] [iurt] recreating src.rpm...
D: [iurt] [iurt] Using timeout of 600 seconds.
D: [iurt] [iurt] /usr/bin/sudo /usr/sbin/iurt_root_command --chroot /home/iurt/chroot_tmp/iurt/chroot_cauldron.x86_64.0.20261006071003 su iurt -c "rpm -i /home/iurt/rpmbuild/SRPMS/@2375899:clojure-core-specs-alpha-0.5.81-2.mga11.src.rpm"
D: [iurt] [iurt] Command exited with 0.
D: [iurt] [iurt] calling callback for install_@2375899:clojure-core-specs-alpha-0.5.81-2.mga11.src.rpm
D: [iurt] [iurt] Using timeout of 600 seconds.
D: [iurt] [iurt] /usr/bin/sudo /usr/sbin/iurt_root_command --chroot /home/iurt/chroot_tmp/iurt/chroot_cauldron.x86_64.0.20261006071003 su iurt -c "rpmspec -q --qf %{NVR}.src.rpm --srpm /home/iurt/rpmbuild/SPECS/clojure-core-specs-alpha.spec | tail -n1 > /home/iurt/rpmbuild/SPECS/clojure-core-specs-alpha.spec.srpm_name"
D: [iurt] [iurt] Forking to monitor log size
D: [iurt] [iurt] Command exited with 0.
D: [iurt_root_command] Running iurt_root_command --rm /home/iurt/chroot_tmp/iurt/chroot_cauldron.x86_64.0.20261006071003/home/iurt/rpmbuild/...
D: [iurt_root_command] Removing files
D: [iurt_root_command] removing /home/iurt/chroot_tmp/iurt/chroot_cauldron.x86_64.0.20261006071003/home/iurt/rpmbuild/SRPMS/@2375899:clojure-core-specs-alpha-0.5.81-2.mga11.src.rpm
D: [iurt_root_command] Success!
D: [iurt] [iurt] Using timeout of 600 seconds.
D: [iurt] [iurt] /usr/bin/sudo /usr/sbin/iurt_root_command --chroot /home/iurt/chroot_tmp/iurt/chroot_cauldron.x86_64.0.20261006071003 su iurt -c "rpmbuild --target x86_64 --nodeps -bs /home/iurt/rpmbuild/SPECS/clojure-core-specs-alpha.spec"
D: [iurt] [iurt] Forking to monitor log size
D: [iurt] [iurt] Command exited with 0.
D: [iurt_root_command] Running iurt_root_command --ln /home/iurt/chroot_tmp/iurt/chroot_cauldron.x86_64.0.20261006071003/home/iurt/rpmbuild/...
D: [iurt_root_command] Linking files
D: [iurt_root_command] Success!
N: [iurt] [iurt] new srpm: @2375899:clojure-core-specs-alpha-0.5.81-2.mga11.src.rpm
I: [iurt] [iurt] updating packages in /home/iurt/chroot_tmp/iurt/chroot_cauldron.x86_64.0.20261006071003
D: [iurt] [iurt] Using timeout of 600 seconds.
D: [iurt] [iurt] /usr/bin/sudo /usr/sbin/iurt_root_command --urpmi --urpmi-root /home/iurt/chroot_tmp/iurt/chroot_cauldron.x86_64.0.20261006071003 --auto-update --auto
D: [iurt] [iurt] Command exited with 0.
I: [iurt] [iurt] Install build dependencies for @2375899:clojure-core-specs-alpha-0.5.81-2.mga11.src.rpm
D: [iurt] [iurt] installing /home/iurt/chroot_tmp/iurt/chroot_cauldron.x86_64.0.20261006071003/home/iurt/rpmbuild/SRPMS//@2375899:clojure-core-specs-alpha-0.5.81-2.mga11.src.rpm
I: [iurt] [iurt] install dependencies using urpmi
D: [iurt] [iurt] Using timeout of 3600 seconds.
D: [iurt] [iurt] /usr/bin/sudo /usr/sbin/iurt_root_command --urpmi -v --no-verify-rpm --tune-rpm=all --nolock --auto --no-recommends --ignoresize --noclean --urpmi-root /home/iurt/chroot_tmp/iurt/chroot_cauldron.x86_64.0.20261006071003 --buildrequires /home/iurt/chroot_tmp/iurt/chroot_cauldron.x86_64.0.20261006071003/home/iurt/rpmbuild/SRPMS//@2375899:clojure-core-specs-alpha-0.5.81-2.mga11.src.rpm
D: [iurt] [iurt] Forking to monitor log size
D: [iurt] [iurt] Command exited with 0.
D: [iurt] [iurt] calling callback for install_deps_@2375899:clojure-core-specs-alpha-0.5.81-2.mga11.src.rpm
D: [iurt] [iurt] missing_deps is empty, aborting.
D: [iurt] [iurt] output had: __ D: [iurt_root_command] urpmi
error: Too many levels of recursion in macro expansion. It is likely caused by recursive macro declaration.
examining synthesis file [/home/iurt/chroot_tmp/iurt/chroot_cauldron.x86_64.0.20261006071003/var/lib/urpmi/synthesis.hdlist.core_release.cz]
would install instead of upgrade package kernel-desktop-6.18.44-1.mga11-1-1.mga11.x86_64
would install instead of upgrade package kernel-desktop-6.18.55-1.mga11-1-1.mga11.x86_64
would install instead of upgrade package kernel-desktop-devel-6.18.44-1.mga11-1-1.mga11.x86_64
would install instead of upgrade package kernel-desktop-devel-6.18.55-1.mga11-1-1.mga11.x86_64
would install instead of upgrade package kernel-server-6.18.44-1.mga11-1-1.mga11.x86_64
would install instead of upgrade package kernel-server-6.18.55-1.mga11-1-1.mga11.x86_64
would install instead of upgrade package kernel-server-devel-6.18.44-1.mga11-1-1.mga11.x86_64
would install instead of upgrade package kernel-server-devel-6.18.55-1.mga11-1-1.mga11.x86_64
would install instead of upgrade package kernel-linus-6.18.55-1.mga11.x86_64
would install instead of upgrade package kernel-linus-devel-6.18.55-1.mga11.x86_64
retrieving rpm files from medium "core_release"...
http://repository.mageia.org/distrib/cauldron/x86_64/media/core/release/lib64freetype6-2.14.3-2.mga11.x86_64.rpm
http://repository.mageia.org/distrib/cauldron/x86_64/media/core/release/lib64nspr4-4.40.0-1.mga11.x86_64.rpm
http://repository.mageia.org/distrib/cauldron/x86_64/media/core/release/lib64xi6-1.8.3-1.mga11.x86_64.rpm
http://repository.mageia.org/distrib/cauldron/x86_64/media/core/release/lib64xau6-1.0.12-2.mga10.x86_64.rpm
http://repository.mageia.org/distrib/cauldron/x86_64/media/core/release/lib64lcms2_2-2.19.1-1.mga11.x86_64.rpm
http://repository.mageia.org/distrib/cauldron/x86_64/media/core/release/dola-gleaner-1.1.1-1.mga11.noarch.rpm
http://repository.mageia.org/distrib/cauldron/x86_64/media/core/release/lib64xext6-1.3.7-1.mga11.x86_64.rpm
http://repository.mageia.org/distrib/cauldron/x86_64/media/core/release/lib64png16_16-1.6.58-1.mga11.x86_64.rpm
http://repository.mageia.org/distrib/cauldron/x86_64/media/core/release/lib64xcb1-1.17.0-2.mga10.x86_64.rpm
http://repository.mageia.org/distrib/cauldron/x86_64/media/core/release/lib64xcomposite1-0.4.7-1.mga11.x86_64.rpm
http://repository.mageia.org/distrib/cauldron/x86_64/media/core/release/java-25-openjdk-25.0.4.1.1-4.mga11.x86_64.rpm
http://repository.mageia.org/distrib/cauldron/x86_64/media/core/release/apache-commons-codec-1.19.0-1.mga11.noarch.rpm
http://repository.mageia.org/distrib/cauldron/x86_64/media/core/release/java-25-openjdk-devel-25.0.4.1.1-4.mga11.x86_64.rpm
http://repository.mageia.org/distrib/cauldron/x86_64/media/core/release/publicsuffix-list-20260624-1.mga11.noarch.rpm
http://repository.mageia.org/distrib/cauldron/x86_64/media/core/release/fontconfig-2.18.3-1.mga11.x86_64.rpm
http://repository.mageia.org/distrib/cauldron/x86_64/media/core/release/lib64pixman1_0-0.46.4-1.mga10.x86_64.rpm
http://repository.mageia.org/distrib/cauldron/x86_64/media/core/release/rootcerts-java-20260714.00-1.mga11.noarch.rpm
http://repository.mageia.org/distrib/cauldron/x86_64/media/core/release/x11-font-bitstream-type1-1.0.4-2.mga10.noarch.rpm
http://repository.mageia.org/distrib/cauldron/x86_64/media/core/release/python3-lxml-6.0.2-1.mga10.x86_64.rpm
http://repository.mageia.org/distrib/cauldron/x86_64/media/core/release/lib64xrender1-0.9.12-2.mga10.x86_64.rpm
http://repository.mageia.org/distrib/cauldron/x86_64/media/core/release/fonts-filesystem-2.0.5-7.mga10.noarch.rpm
http://repository.mageia.org/distrib/cauldron/x86_64/media/core/release/copy-jdk-configs-4.1-3.mga10.noarch.rpm
http://repository.mageia.org/distrib/cauldron/x86_64/media/core/release/libalsa-data-1.2.16.1-1.mga11.noarch.rpm
http://repository.mageia.org/distrib/cauldron/x86_64/media/core/release/dola-transformer-1.0.2-1.mga11.noarch.rpm
http://repository.mageia.org/distrib/cauldron/x86_64/media/core/release/lib64jpeg8-3.2.0-1.mga11.x86_64.rpm
http://repository.mageia.org/distrib/cauldron/x86_64/media/core/release/java-25-openjdk-headless-25.0.4.1.1-4.mga11.x86_64.rpm
http://repository.mageia.org/distrib/cauldron/x86_64/media/core/release/javapackages-filesystem-6.5.1-8.mga11.noarch.rpm
http://repository.mageia.org/distrib/cauldron/x86_64/media/core/release/nss-3.130.0-1.mga11.x86_64.rpm
http://repository.mageia.org/distrib/cauldron/x86_64/media/core/release/lib64xtst6-1.2.5-3.mga11.x86_64.rpm
http://repository.mageia.org/distrib/cauldron/x86_64/media/core/release/lib64gif7-5.2.2-5.mga11.x86_64.rpm
http://repository.mageia.org/distrib/cauldron/x86_64/media/core/release/lib64nss3-3.130.0-1.mga11.x86_64.rpm
http://repository.mageia.org/distrib/cauldron/x86_64/media/core/release/timezone-java-2025b-1.mga10.noarch.rpm
http://repository.mageia.org/distrib/cauldron/x86_64/media/core/release/lksctp-tools-1.0.21-2.mga10.x86_64.rpm
http://repository.mageia.org/distrib/cauldron/x86_64/media/core/release/lib64fontconfig1-2.18.3-1.mga11.x86_64.rpm
http://repository.mageia.org/distrib/cauldron/x86_64/media/core/release/mkfontscale-1.2.4-1.mga11.x86_64.rpm
http://repository.mageia.org/distrib/cauldron/x86_64/media/core/release/lib64sctp1-1.0.21-2.mga10.x86_64.rpm
http://repository.mageia.org/distrib/cauldron/x86_64/media/core/release/lib64alsa2-1.2.16.1-1.mga11.x86_64.rpm
http://repository.mageia.org/distrib/cauldron/x86_64/media/core/release/lib64x11_6-1.8.13-1.mga11.x86_64.rpm
http://repository.mageia.org/distrib/cauldron/x86_64/media/core/release/lib64xdmcp6-1.1.5-2.mga10.x86_64.rpm
http://repository.mageia.org/distrib/cauldron/x86_64/media/core/release/lib64fontenc1-1.1.9-1.mga11.x86_64.rpm
http://repository.mageia.org/distrib/cauldron/x86_64/media/core/release/lib64xcb-shm0-1.17.0-2.mga10.x86_64.rpm
http://repository.mageia.org/distrib/cauldron/x86_64/media/core/release/x11-font-type1-1.0.0-19.mga10.noarch.rpm
http://repository.mageia.org/distrib/cauldron/x86_64/media/core/release/x11-font-xfree86-type1-1.0.5-2.mga10.noarch.rpm
http://repository.mageia.org/distrib/cauldron/x86_64/media/core/release/lib64harfbuzz0-14.5.0-1.mga11.x86_64.rpm
http://repository.mageia.org/distrib/cauldron/x86_64/media/core/release/lua-5.4.8-1.mga10.x86_64.rpm
http://repository.mageia.org/distrib/cauldron/x86_64/media/core/release/httpcomponents-core-4.4.16-4.mga11.noarch.rpm
http://repository.mageia.org/distrib/cauldron/x86_64/media/core/release/lib64xcb-render0-1.17.0-2.mga10.x86_64.rpm
http://repository.mageia.org/distrib/cauldron/x86_64/media/core/release/lib64cairo2-1.18.6-1.mga11.x86_64.rpm
http://repository.mageia.org/distrib/cauldron/x86_64/media/core/release/lua-posix-35.0-5.mga10.x86_64.rpm
http://repository.mageia.org/distrib/cauldron/x86_64/media/core/release/lib64graphite2_3-1.3.15-1.mga11.x86_64.rpm
retrieved lib64freetype6-2.14.3-2.mga11.x86_64.rpm lib64nspr4-4.40.0-1.mga11.x86_64.rpm lib64xi6-1.8.3-1.mga11.x86_64.rpm lib64xau6-1.0.12-2.mga10.x86_64.rpm lib64lcms2_2-2.19.1-1.mga11.x86_64.rpm dola-gleaner-1.1.1-1.mga11.noarch.rpm lib64xext6-1.3.7-1.mga11.x86_64.rpm lib64png16_16-1.6.58-1.mga11.x86_64.rpm lib64xcb1-1.17.0-2.mga10.x86_64.rpm lib64xcomposite1-0.4.7-1.mga11.x86_64.rpm java-25-openjdk-25.0.4.1.1-4.mga11.x86_64.rpm apache-commons-codec-1.19.0-1.mga11.noarch.rpm java-25-openjdk-devel-25.0.4.1.1-4.mga11.x86_64.rpm publicsuffix-list-20260624-1.mga11.noarch.rpm fontconfig-2.18.3-1.mga11.x86_64.rpm lib64pixman1_0-0.46.4-1.mga10.x86_64.rpm rootcerts-java-20260714.00-1.mga11.noarch.rpm x11-font-bitstream-type1-1.0.4-2.mga10.noarch.rpm python3-lxml-6.0.2-1.mga10.x86_64.rpm lib64xrender1-0.9.12-2.mga10.x86_64.rpm fonts-filesystem-2.0.5-7.mga10.noarch.rpm copy-jdk-configs-4.1-3.mga10.noarch.rpm libalsa-data-1.2.16.1-1.mga11.noarch.rpm dola-transformer-1.0.2-1.mga11.noarch.rpm lib64jpeg8-3.2.0-1.mga11.x86_64.rpm java-25-openjdk-headless-25.0.4.1.1-4.mga11.x86_64.rpm javapackages-filesystem-6.5.1-8.mga11.noarch.rpm nss-3.130.0-1.mga11.x86_64.rpm lib64xtst6-1.2.5-3.mga11.x86_64.rpm lib64gif7-5.2.2-5.mga11.x86_64.rpm lib64nss3-3.130.0-1.mga11.x86_64.rpm timezone-java-2025b-1.mga10.noarch.rpm lksctp-tools-1.0.21-2.mga10.x86_64.rpm lib64fontconfig1-2.18.3-1.mga11.x86_64.rpm mkfontscale-1.2.4-1.mga11.x86_64.rpm lib64sctp1-1.0.21-2.mga10.x86_64.rpm lib64alsa2-1.2.16.1-1.mga11.x86_64.rpm lib64x11_6-1.8.13-1.mga11.x86_64.rpm lib64xdmcp6-1.1.5-2.mga10.x86_64.rpm lib64fontenc1-1.1.9-1.mga11.x86_64.rpm lib64xcb-shm0-1.17.0-2.mga10.x86_64.rpm x11-font-type1-1.0.0-19.mga10.noarch.rpm x11-font-xfree86-type1-1.0.5-2.mga10.noarch.rpm lib64harfbuzz0-14.5.0-1.mga11.x86_64.rpm lua-5.4.8-1.mga10.x86_64.rpm httpcomponents-core-4.4.16-4.mga11.noarch.rpm lib64xcb-render0-1.17.0-2.mga10.x86_64.rpm lib64cairo2-1.18.6-1.mga11.x86_64.rpm lua-posix-35.0-5.mga10.x86_64.rpm lib64graphite2_3-1.3.15-1.mga11.x86_64.rpm
...retrieving done
installing lib64pixman1_0-0.46.4-1.mga10.x86_64.rpm fontconfig-2.18.3-1.mga11.x86_64.rpm rootcerts-java-20260714.00-1.mga11.noarch.rpm publicsuffix-list-20260624-1.mga11.noarch.rpm libalsa-data-1.2.16.1-1.mga11.noarch.rpm java-25-openjdk-headless-25.0.4.1.1-4.mga11.x86_64.rpm lib64jpeg8-3.2.0-1.mga11.x86_64.rpm dola-transformer-1.0.2-1.mga11.noarch.rpm x11-font-bitstream-type1-1.0.4-2.mga10.noarch.rpm copy-jdk-configs-4.1-3.mga10.noarch.rpm python3-lxml-6.0.2-1.mga10.x86_64.rpm lib64xrender1-0.9.12-2.mga10.x86_64.rpm fonts-filesystem-2.0.5-7.mga10.noarch.rpm lib64xau6-1.0.12-2.mga10.x86_64.rpm lib64lcms2_2-2.19.1-1.mga11.x86_64.rpm lib64freetype6-2.14.3-2.mga11.x86_64.rpm lib64xi6-1.8.3-1.mga11.x86_64.rpm lib64nspr4-4.40.0-1.mga11.x86_64.rpm java-25-openjdk-25.0.4.1.1-4.mga11.x86_64.rpm lib64xcomposite1-0.4.7-1.mga11.x86_64.rpm java-25-openjdk-devel-25.0.4.1.1-4.mga11.x86_64.rpm apache-commons-codec-1.19.0-1.mga11.noarch.rpm lib64png16_16-1.6.58-1.mga11.x86_64.rpm lib64xext6-1.3.7-1.mga11.x86_64.rpm dola-gleaner-1.1.1-1.mga11.noarch.rpm lib64xcb1-1.17.0-2.mga10.x86_64.rpm lib64harfbuzz0-14.5.0-1.mga11.x86_64.rpm x11-font-xfree86-type1-1.0.5-2.mga10.noarch.rpm lua-5.4.8-1.mga10.x86_64.rpm lib64xdmcp6-1.1.5-2.mga10.x86_64.rpm x11-font-type1-1.0.0-19.mga10.noarch.rpm lib64xcb-shm0-1.17.0-2.mga10.x86_64.rpm lib64fontenc1-1.1.9-1.mga11.x86_64.rpm lib64graphite2_3-1.3.15-1.mga11.x86_64.rpm httpcomponents-core-4.4.16-4.mga11.noarch.rpm lua-posix-35.0-5.mga10.x86_64.rpm lib64cairo2-1.18.6-1.mga11.x86_64.rpm lib64xcb-render0-1.17.0-2.mga10.x86_64.rpm lib64xtst6-1.2.5-3.mga11.x86_64.rpm javapackages-filesystem-6.5.1-8.mga11.noarch.rpm nss-3.130.0-1.mga11.x86_64.rpm lib64alsa2-1.2.16.1-1.mga11.x86_64.rpm lib64sctp1-1.0.21-2.mga10.x86_64.rpm lib64x11_6-1.8.13-1.mga11.x86_64.rpm timezone-java-2025b-1.mga10.noarch.rpm lib64nss3-3.130.0-1.mga11.x86_64.rpm lib64gif7-5.2.2-5.mga11.x86_64.rpm mkfontscale-1.2.4-1.mga11.x86_64.rpm lib64fontconfig1-2.18.3-1.mga11.x86_64.rpm lksctp-tools-1.0.21-2.mga10.x86_64.rpm from /home/iurt/chroot_tmp/iurt/chroot_cauldron.x86_64.0.20261006071003/var/cache/urpmi/rpms
starting installing packages
created transaction for installing on /home/iurt/chroot_tmp/iurt/chroot_cauldron.x86_64.0.20261006071003 (remove=0, install=0, upgrade=50)
Preparing... #############################################
1/152: lib64png16_16 #############################################
2/152: javapackages-filesystem
#############################################
3/152: lib64nspr4 #############################################
4/152: nss #############################################
5/152: lib64nss3 #############################################
shell-init: error retrieving current directory: getcwd: cannot access parent directories: No such file or directory
shell-init: error retrieving current directory: getcwd: cannot access parent directories: No such file or directory
6/152: lib64jpeg8 #############################################
7/152: lib64gif7 #############################################
8/152: timezone-java #############################################
9/152: lib64sctp1 #############################################
10/152: lksctp-tools #############################################
11/152: lua-posix #############################################
12/152: lib64graphite2_3 #############################################
13/152: lib64fontenc1 #############################################
14/152: lib64xdmcp6 #############################################
15/152: lua #############################################
16/152: copy-jdk-configs #############################################
17/152: lib64lcms2_2 #############################################
18/152: lib64xau6 #############################################
19/152: lib64xcb1 #############################################
20/152: lib64x11_6 #############################################
shell-init: error retrieving current directory: getcwd: cannot access parent directories: No such file or directory
21/152: lib64xext6 #############################################
22/152: lib64xrender1 #############################################
23/152: lib64xi6 #############################################
24/152: lib64xtst6 #############################################
25/152: lib64xcomposite1 #############################################
26/152: lib64xcb-shm0 #############################################
27/152: lib64xcb-render0 #############################################
28/152: fonts-filesystem #############################################
29/152: libalsa-data #############################################
shell-init: error retrieving current directory: getcwd: cannot access parent directories: No such file or directory
30/152: lib64alsa2 #############################################
31/152: rootcerts-java #############################################
32/152: lib64pixman1_0 #############################################
33/152: lib64cairo2 #############################################
34/152: lib64harfbuzz0 #############################################
35/152: lib64freetype6 #############################################
36/152: lib64fontconfig1 #############################################
37/152: fontconfig #############################################
shell-init: error retrieving current directory: getcwd: cannot access parent directories: No such file or directory
38/152: mkfontscale #############################################
39/152: x11-font-bitstream-type1
#############################################
shell-init: error retrieving current directory: getcwd: cannot access parent directories: No such file or directory
40/152: x11-font-xfree86-type1
#############################################
shell-init: error retrieving current directory: getcwd: cannot access parent directories: No such file or directory
41/152: x11-font-type1 #############################################
42/152: java-25-openjdk-headless
#############################################
shell-init: error retrieving current directory: getcwd: cannot access parent directories: No such file or directory
43/152: java-25-openjdk #############################################
shell-init: error retrieving current directory: getcwd: cannot access parent directories: No such file or directory
44/152: java-25-openjdk-devel #############################################
shell-init: error retrieving current directory: getcwd: cannot access parent directories: No such file or directory
45/152: apache-commons-codec #############################################
46/152: httpcomponents-core #############################################
47/152: dola-gleaner #############################################
48/152: python3-lxml #############################################
49/152: dola-transformer #############################################
50/152: publicsuffix-list #############################################
shell-init: error retrieving current directory: getcwd: cannot access parent directories: No such file or directory
shell-init: error retrieving current directory: getcwd: cannot access parent directories: No such file or directory
shell-init: error retrieving current directory: getcwd: cannot access parent directories: No such file or directory
shell-init: error retrieving current directory: getcwd: cannot access parent directories: No such file or directory
shell-init: error retrieving current directory: getcwd: cannot access parent directories: No such file or directory
shell-init: error retrieving current directory: getcwd: cannot access parent directories: No such file or directory
shell-init: error retrieving current directory: getcwd: cannot access parent directories: No such file or directory
shell-init: error retrieving current directory: getcwd: cannot access parent directories: No such file or directory
shell-init: error retrieving current directory: getcwd: cannot access parent directories: No such file or directory
retrieving rpm files from medium "core_release"...
http://repository.mageia.org/distrib/cauldron/x86_64/media/core/release/jakarta-inject1.0-1.0.5-4.mga11.noarch.rpm
http://repository.mageia.org/distrib/cauldron/x86_64/media/core/release/plexus-containers-component-annotations-2.2.0-4.mga11.noarch.rpm
http://repository.mageia.org/distrib/cauldron/x86_64/media/core/release/maven-file-management-3.2.0-1.mga11.noarch.rpm
http://repository.mageia.org/distrib/cauldron/x86_64/media/core/release/jline-3.30.4-3.mga11.x86_64.rpm
http://repository.mageia.org/distrib/cauldron/x86_64/media/core/release/maven-resolver2-2.0.9-1.mga11.noarch.rpm
http://repository.mageia.org/distrib/cauldron/x86_64/media/core/release/plexus-cipher-2.0-5.mga11.noarch.rpm
http://repository.mageia.org/distrib/cauldron/x86_64/media/core/release/plexus-utils4-4.0.2-1.mga11.noarch.rpm
http://repository.mageia.org/distrib/cauldron/x86_64/media/core/release/byte-buddy-agent-1.18.7-1.mga11.noarch.rpm
http://repository.mageia.org/distrib/cauldron/x86_64/media/core/release/maven-shared-utils-3.4.2-3.mga11.noarch.rpm
http://repository.mageia.org/distrib/cauldron/x86_64/media/core/release/sisu-1.0.0-2.mga11.noarch.rpm
http://repository.mageia.org/distrib/cauldron/x86_64/media/core/release/google-gson-2.12.1-1.mga11.noarch.rpm
http://repository.mageia.org/distrib/cauldron/x86_64/media/core/release/maven4-lib-4.0.0~rc.4-1.mga11.noarch.rpm
http://repository.mageia.org/distrib/cauldron/x86_64/media/core/release/objectweb-asm-9.10.1-1.mga11.noarch.rpm
http://repository.mageia.org/distrib/cauldron/x86_64/media/core/release/maven4-openjdk25-4.0.0~rc.4-1.mga11.noarch.rpm
http://repository.mageia.org/distrib/cauldron/x86_64/media/core/release/junit-4.13.2-6.mga11.noarch.rpm
http://repository.mageia.org/distrib/cauldron/x86_64/media/core/release/opentest4j-1.3.0-4.mga11.noarch.rpm
http://repository.mageia.org/distrib/cauldron/x86_64/media/core/release/maven-lib-3.9.11-4.mga11.noarch.rpm
http://repository.mageia.org/distrib/cauldron/x86_64/media/core/release/jdom2-2.0.6.1-4.mga11.noarch.rpm
http://repository.mageia.org/distrib/cauldron/x86_64/media/core/release/javapackages-tools-6.5.1-8.mga11.noarch.rpm
http://repository.mageia.org/distrib/cauldron/x86_64/media/core/release/plexus-sec-dispatcher4-4.1.0-1.mga11.noarch.rpm
http://repository.mageia.org/distrib/cauldron/x86_64/media/core/release/byte-buddy-1.18.7-1.mga11.noarch.rpm
http://repository.mageia.org/distrib/cauldron/x86_64/media/core/release/jakarta-annotations-1.3.5-19.mga11.noarch.rpm
http://repository.mageia.org/distrib/cauldron/x86_64/media/core/release/jsr-305-3.0.2-5.mga11.noarch.rpm
http://repository.mageia.org/distrib/cauldron/x86_64/media/core/release/plexus-xml-4.0.4-2.mga11.noarch.rpm
http://repository.mageia.org/distrib/cauldron/x86_64/media/core/release/maven4-4.0.0~rc.4-1.mga11.noarch.rpm
http://repository.mageia.org/distrib/cauldron/x86_64/media/core/release/plexus-utils-3.6.1-2.mga11.noarch.rpm
http://repository.mageia.org/distrib/cauldron/x86_64/media/core/release/plexus-interactivity-1.3-1.mga11.noarch.rpm
http://repository.mageia.org/distrib/cauldron/x86_64/media/core/release/apache-commons-cli-1.10.0-1.mga11.noarch.rpm
http://repository.mageia.org/distrib/cauldron/x86_64/media/core/release/kojan-xml-1.0.1-1.mga11.noarch.rpm
http://repository.mageia.org/distrib/cauldron/x86_64/media/core/release/objenesis-3.5-1.mga11.noarch.rpm
http://repository.mageia.org/distrib/cauldron/x86_64/media/core/release/slf4j-1.7.36-3.mga11.noarch.rpm
http://repository.mageia.org/distrib/cauldron/x86_64/media/core/release/google-guice-5.1.0-4.mga11.noarch.rpm
http://repository.mageia.org/distrib/cauldron/x86_64/media/core/release/maven-wagon-3.5.3-3.mga11.noarch.rpm
http://repository.mageia.org/distrib/cauldron/x86_64/media/core/release/httpcomponents-client-4.5.14-3.mga11.noarch.rpm
http://repository.mageia.org/distrib/cauldron/x86_64/media/core/release/jansi-2.4.3-1.mga11.x86_64.rpm
http://repository.mageia.org/distrib/cauldron/x86_64/media/core/release/maven-resolver-1.9.27-1.mga11.noarch.rpm
http://repository.mageia.org/distrib/cauldron/x86_64/media/core/release/jcl-over-slf4j2-2.0.17-1.mga11.noarch.rpm
http://repository.mageia.org/distrib/cauldron/x86_64/media/core/release/hamcrest-3.0-1.mga11.noarch.rpm
http://repository.mageia.org/distrib/cauldron/x86_64/media/core/release/apache-commons-io-2.20.0-1.mga11.noarch.rpm
http://repository.mageia.org/distrib/cauldron/x86_64/media/core/release/aopalliance-1.0-22.mga11.noarch.rpm
http://repository.mageia.org/distrib/cauldron/x86_64/media/core/release/stax2-api-4.3.0-1.mga11.noarch.rpm
http://repository.mageia.org/distrib/cauldron/x86_64/media/core/release/build-helper-maven-plugin-3.6.1-1.mga11.noarch.rpm
http://repository.mageia.org/distrib/cauldron/x86_64/media/core/release/plexus-sec-dispatcher-2.0-6.mga11.noarch.rpm
http://repository.mageia.org/distrib/cauldron/x86_64/media/core/release/slf4j2-2.0.17-1.mga11.noarch.rpm
http://repository.mageia.org/distrib/cauldron/x86_64/media/core/release/guava-33.5.0-1.mga11.noarch.rpm
http://repository.mageia.org/distrib/cauldron/x86_64/media/core/release/plexus-classworlds-2.12.0-1.mga11.noarch.rpm
http://repository.mageia.org/distrib/cauldron/x86_64/media/core/release/plexus-interpolation-1.28-1.mga11.noarch.rpm
http://repository.mageia.org/distrib/cauldron/x86_64/media/core/release/woodstox-core-7.1.0-1.mga11.noarch.rpm
http://repository.mageia.org/distrib/cauldron/x86_64/media/core/release/mockito-5.8.0-3.mga11.noarch.rpm
http://repository.mageia.org/distrib/cauldron/x86_64/media/core/release/jcl-over-slf4j-1.7.36-3.mga11.noarch.rpm
retrieved jakarta-inject1.0-1.0.5-4.mga11.noarch.rpm plexus-containers-component-annotations-2.2.0-4.mga11.noarch.rpm maven-file-management-3.2.0-1.mga11.noarch.rpm jline-3.30.4-3.mga11.x86_64.rpm maven-resolver2-2.0.9-1.mga11.noarch.rpm plexus-cipher-2.0-5.mga11.noarch.rpm plexus-utils4-4.0.2-1.mga11.noarch.rpm byte-buddy-agent-1.18.7-1.mga11.noarch.rpm maven-shared-utils-3.4.2-3.mga11.noarch.rpm sisu-1.0.0-2.mga11.noarch.rpm google-gson-2.12.1-1.mga11.noarch.rpm maven4-lib-4.0.0~rc.4-1.mga11.noarch.rpm objectweb-asm-9.10.1-1.mga11.noarch.rpm maven4-openjdk25-4.0.0~rc.4-1.mga11.noarch.rpm junit-4.13.2-6.mga11.noarch.rpm opentest4j-1.3.0-4.mga11.noarch.rpm maven-lib-3.9.11-4.mga11.noarch.rpm jdom2-2.0.6.1-4.mga11.noarch.rpm javapackages-tools-6.5.1-8.mga11.noarch.rpm plexus-sec-dispatcher4-4.1.0-1.mga11.noarch.rpm byte-buddy-1.18.7-1.mga11.noarch.rpm jakarta-annotations-1.3.5-19.mga11.noarch.rpm jsr-305-3.0.2-5.mga11.noarch.rpm plexus-xml-4.0.4-2.mga11.noarch.rpm maven4-4.0.0~rc.4-1.mga11.noarch.rpm plexus-utils-3.6.1-2.mga11.noarch.rpm plexus-interactivity-1.3-1.mga11.noarch.rpm apache-commons-cli-1.10.0-1.mga11.noarch.rpm kojan-xml-1.0.1-1.mga11.noarch.rpm objenesis-3.5-1.mga11.noarch.rpm slf4j-1.7.36-3.mga11.noarch.rpm google-guice-5.1.0-4.mga11.noarch.rpm maven-wagon-3.5.3-3.mga11.noarch.rpm httpcomponents-client-4.5.14-3.mga11.noarch.rpm jansi-2.4.3-1.mga11.x86_64.rpm maven-resolver-1.9.27-1.mga11.noarch.rpm jcl-over-slf4j2-2.0.17-1.mga11.noarch.rpm hamcrest-3.0-1.mga11.noarch.rpm apache-commons-io-2.20.0-1.mga11.noarch.rpm aopalliance-1.0-22.mga11.noarch.rpm stax2-api-4.3.0-1.mga11.noarch.rpm build-helper-maven-plugin-3.6.1-1.mga11.noarch.rpm plexus-sec-dispatcher-2.0-6.mga11.noarch.rpm slf4j2-2.0.17-1.mga11.noarch.rpm guava-33.5.0-1.mga11.noarch.rpm plexus-classworlds-2.12.0-1.mga11.noarch.rpm plexus-interpolation-1.28-1.mga11.noarch.rpm woodstox-core-7.1.0-1.mga11.noarch.rpm mockito-5.8.0-3.mga11.noarch.rpm jcl-over-slf4j-1.7.36-3.mga11.noarch.rpm
...retrieving done
installing objectweb-asm-9.10.1-1.mga11.noarch.rpm maven-shared-utils-3.4.2-3.mga11.noarch.rpm google-gson-2.12.1-1.mga11.noarch.rpm sisu-1.0.0-2.mga11.noarch.rpm maven4-lib-4.0.0~rc.4-1.mga11.noarch.rpm byte-buddy-agent-1.18.7-1.mga11.noarch.rpm plexus-utils4-4.0.2-1.mga11.noarch.rpm plexus-cipher-2.0-5.mga11.noarch.rpm maven-resolver2-2.0.9-1.mga11.noarch.rpm jline-3.30.4-3.mga11.x86_64.rpm maven-file-management-3.2.0-1.mga11.noarch.rpm plexus-containers-component-annotations-2.2.0-4.mga11.noarch.rpm jakarta-inject1.0-1.0.5-4.mga11.noarch.rpm plexus-xml-4.0.4-2.mga11.noarch.rpm jakarta-annotations-1.3.5-19.mga11.noarch.rpm jsr-305-3.0.2-5.mga11.noarch.rpm byte-buddy-1.18.7-1.mga11.noarch.rpm plexus-sec-dispatcher4-4.1.0-1.mga11.noarch.rpm javapackages-tools-6.5.1-8.mga11.noarch.rpm jdom2-2.0.6.1-4.mga11.noarch.rpm maven-lib-3.9.11-4.mga11.noarch.rpm opentest4j-1.3.0-4.mga11.noarch.rpm junit-4.13.2-6.mga11.noarch.rpm maven4-openjdk25-4.0.0~rc.4-1.mga11.noarch.rpm jansi-2.4.3-1.mga11.x86_64.rpm httpcomponents-client-4.5.14-3.mga11.noarch.rpm maven-wagon-3.5.3-3.mga11.noarch.rpm google-guice-5.1.0-4.mga11.noarch.rpm slf4j-1.7.36-3.mga11.noarch.rpm objenesis-3.5-1.mga11.noarch.rpm kojan-xml-1.0.1-1.mga11.noarch.rpm apache-commons-cli-1.10.0-1.mga11.noarch.rpm plexus-interactivity-1.3-1.mga11.noarch.rpm plexus-utils-3.6.1-2.mga11.noarch.rpm maven4-4.0.0~rc.4-1.mga11.noarch.rpm jcl-over-slf4j-1.7.36-3.mga11.noarch.rpm mockito-5.8.0-3.mga11.noarch.rpm woodstox-core-7.1.0-1.mga11.noarch.rpm plexus-interpolation-1.28-1.mga11.noarch.rpm plexus-classworlds-2.12.0-1.mga11.noarch.rpm guava-33.5.0-1.mga11.noarch.rpm plexus-sec-dispatcher-2.0-6.mga11.noarch.rpm slf4j2-2.0.17-1.mga11.noarch.rpm build-helper-maven-plugin-3.6.1-1.mga11.noarch.rpm stax2-api-4.3.0-1.mga11.noarch.rpm apache-commons-io-2.20.0-1.mga11.noarch.rpm aopalliance-1.0-22.mga11.noarch.rpm jcl-over-slf4j2-2.0.17-1.mga11.noarch.rpm hamcrest-3.0-1.mga11.noarch.rpm maven-resolver-1.9.27-1.mga11.noarch.rpm from /home/iurt/chroot_tmp/iurt/chroot_cauldron.x86_64.0.20261006071003/var/cache/urpmi/rpms
starting installing packages
created transaction for installing on /home/iurt/chroot_tmp/iurt/chroot_cauldron.x86_64.0.20261006071003 (remove=0, install=0, upgrade=50)
Preparing... #############################################
51/152: slf4j #############################################
52/152: jakarta-inject1.0 #############################################
53/152: slf4j2 #############################################
54/152: httpcomponents-client #############################################
55/152: maven-wagon #############################################
56/152: objectweb-asm #############################################
57/152: guava #############################################
58/152: plexus-classworlds #############################################
59/152: jakarta-annotations #############################################
60/152: google-gson #############################################
61/152: plexus-containers-component-annotations
#############################################
62/152: plexus-utils4 #############################################
63/152: sisu #############################################
64/152: jcl-over-slf4j2 #############################################
65/152: plexus-cipher #############################################
66/152: aopalliance #############################################
67/152: apache-commons-io #############################################
68/152: stax2-api #############################################
69/152: plexus-interpolation #############################################
70/152: plexus-utils #############################################
71/152: apache-commons-cli #############################################
72/152: plexus-sec-dispatcher #############################################
73/152: woodstox-core #############################################
74/152: maven-shared-utils #############################################
75/152: maven-file-management #############################################
76/152: byte-buddy #############################################
77/152: plexus-sec-dispatcher4
#############################################
78/152: jcl-over-slf4j #############################################
79/152: hamcrest #############################################
80/152: junit #############################################
81/152: plexus-interactivity #############################################
82/152: objenesis #############################################
83/152: jansi #############################################
84/152: opentest4j #############################################
85/152: jdom2 #############################################
86/152: javapackages-tools #############################################
87/152: maven4-openjdk25 #############################################
88/152: jsr-305 #############################################
89/152: google-guice #############################################
90/152: maven-resolver #############################################
91/152: maven-lib #############################################
92/152: jline #############################################
93/152: byte-buddy-agent #############################################
94/152: mockito #############################################
95/152: maven-resolver2 #############################################
96/152: plexus-xml #############################################
97/152: maven4-lib #############################################
98/152: maven4 #############################################
shell-init: error retrieving current directory: getcwd: cannot access parent directories: No such file or directory
99/152: build-helper-maven-plugin
#############################################
100/152: kojan-xml #############################################
shell-init: error retrieving current directory: getcwd: cannot access parent directories: No such file or directory
shell-init: error retrieving current directory: getcwd: cannot access parent directories: No such file or directory
retrieving rpm files from medium "core_release"...
http://repository.mageia.org/distrib/cauldron/x86_64/media/core/release/lujavrite-1.2.3-2.mga11.x86_64.rpm
http://repository.mageia.org/distrib/cauldron/x86_64/media/core/release/maven-jar-plugin-3.3.0-3.mga11.noarch.rpm
http://repository.mageia.org/distrib/cauldron/x86_64/media/core/release/plexus-languages-1.5.2-1.mga11.noarch.rpm
http://repository.mageia.org/distrib/cauldron/x86_64/media/core/release/picocli-4.7.7-2.mga11.noarch.rpm
http://repository.mageia.org/distrib/cauldron/x86_64/media/core/release/apache-commons-lang3-3.19.0-2.mga11.noarch.rpm
http://repository.mageia.org/distrib/cauldron/x86_64/media/core/release/apache-commons-compress-1.28.0-2.mga11.noarch.rpm
http://repository.mageia.org/distrib/cauldron/x86_64/media/core/release/maven-surefire-provider-junit-3.2.2-5.mga11.noarch.rpm
http://repository.mageia.org/distrib/cauldron/x86_64/media/core/release/maven-filtering-3.3.2-1.mga11.noarch.rpm
http://repository.mageia.org/distrib/cauldron/x86_64/media/core/release/maven-3.9.11-4.mga11.noarch.rpm
http://repository.mageia.org/distrib/cauldron/x86_64/media/core/release/apache-commons-exec-1.6.0-1.mga11.noarch.rpm
http://repository.mageia.org/distrib/cauldron/x86_64/media/core/release/xmvn-mojo-4.3.0-2.mga11.noarch.rpm
http://repository.mageia.org/distrib/cauldron/x86_64/media/core/release/maven-surefire-plugin-3.2.2-5.mga11.noarch.rpm
http://repository.mageia.org/distrib/cauldron/x86_64/media/core/release/maven-plugin-annotations-3.9.0-3.mga11.noarch.rpm
http://repository.mageia.org/distrib/cauldron/x86_64/media/core/release/clojure-maven-plugin-1.9.3-1.mga11.noarch.rpm
http://repository.mageia.org/distrib/cauldron/x86_64/media/core/release/python3-javapackages-6.5.1-8.mga11.noarch.rpm
http://repository.mageia.org/distrib/cauldron/x86_64/media/core/release/ant-1.10.15-8.mga11.noarch.rpm
http://repository.mageia.org/distrib/cauldron/x86_64/media/core/release/xmvn5-core-5.1.0-1.mga11.noarch.rpm
http://repository.mageia.org/distrib/cauldron/x86_64/media/core/release/xz-java-1.12-1.mga11.noarch.rpm
http://repository.mageia.org/distrib/cauldron/x86_64/media/core/release/maven-common-artifact-filters-3.4.0-2.mga11.noarch.rpm
http://repository.mageia.org/distrib/cauldron/x86_64/media/core/release/xmvn5-tools-5.1.0-1.mga11.noarch.rpm
http://repository.mageia.org/distrib/cauldron/x86_64/media/core/release/maven-archiver-3.6.2-2.mga11.noarch.rpm
http://repository.mageia.org/distrib/cauldron/x86_64/media/core/release/plexus-archiver-4.12.0-1.mga11.noarch.rpm
http://repository.mageia.org/distrib/cauldron/x86_64/media/core/release/maven-surefire-3.2.2-5.mga11.noarch.rpm
http://repository.mageia.org/distrib/cauldron/x86_64/media/core/release/plexus-io-3.5.2-1.mga11.noarch.rpm
http://repository.mageia.org/distrib/cauldron/x86_64/media/core/release/maven-shared-incremental-1.1-30.mga11.noarch.rpm
http://repository.mageia.org/distrib/cauldron/x86_64/media/core/release/dola-1.3.2-6.mga11.noarch.rpm
http://repository.mageia.org/distrib/cauldron/x86_64/media/core/release/xmvn-toolchain-openjdk25-4.3.0-2.mga11.noarch.rpm
http://repository.mageia.org/distrib/cauldron/x86_64/media/core/release/maven-local-openjdk25-6.5.1-8.mga11.noarch.rpm
http://repository.mageia.org/distrib/cauldron/x86_64/media/core/release/javapackages-local-openjdk25-6.5.1-8.mga11.noarch.rpm
http://repository.mageia.org/distrib/cauldron/x86_64/media/core/release/plexus-build-api0-0.0.7-43.mga11.noarch.rpm
http://repository.mageia.org/distrib/cauldron/x86_64/media/core/release/beust-jcommander-1.82-4.mga11.noarch.rpm
http://repository.mageia.org/distrib/cauldron/x86_64/media/core/release/qdox-2.2.0-1.mga11.noarch.rpm
http://repository.mageia.org/distrib/cauldron/x86_64/media/core/release/maven-surefire-provider-testng-3.2.2-5.mga11.noarch.rpm
http://repository.mageia.org/distrib/cauldron/x86_64/media/core/release/ant-lib-1.10.15-8.mga11.noarch.rpm
http://repository.mageia.org/distrib/cauldron/x86_64/media/core/release/xmvn-tools-4.3.0-2.mga11.noarch.rpm
http://repository.mageia.org/distrib/cauldron/x86_64/media/core/release/maven-openjdk25-3.9.11-4.mga11.noarch.rpm
http://repository.mageia.org/distrib/cauldron/x86_64/media/core/release/xmvn-minimal-4.3.0-2.mga11.noarch.rpm
http://repository.mageia.org/distrib/cauldron/x86_64/media/core/release/xmvn-core-4.3.0-2.mga11.noarch.rpm
http://repository.mageia.org/distrib/cauldron/x86_64/media/core/release/xmvn5-minimal-5.1.0-1.mga11.noarch.rpm
http://repository.mageia.org/distrib/cauldron/x86_64/media/core/release/junit5-5.14.4-1.mga11.noarch.rpm
http://repository.mageia.org/distrib/cauldron/x86_64/media/core/release/maven-surefire-provider-junit5-3.2.2-5.mga11.noarch.rpm
http://repository.mageia.org/distrib/cauldron/x86_64/media/core/release/javapackages-common-6.5.1-8.mga11.noarch.rpm
http://repository.mageia.org/distrib/cauldron/x86_64/media/core/release/ant-openjdk25-1.10.15-8.mga11.noarch.rpm
http://repository.mageia.org/distrib/cauldron/x86_64/media/core/release/plexus-compiler-2.16.2-1.mga11.noarch.rpm
http://repository.mageia.org/distrib/cauldron/x86_64/media/core/release/maven-compiler-plugin-3.12.1-3.mga11.noarch.rpm
http://repository.mageia.org/distrib/cauldron/x86_64/media/core/release/xmvn5-mojo-5.1.0-1.mga11.noarch.rpm
http://repository.mageia.org/distrib/cauldron/x86_64/media/core/release/assertj-core-3.26.3-1.mga11.noarch.rpm
http://repository.mageia.org/distrib/cauldron/x86_64/media/core/release/maven-resources-plugin-3.3.1-3.mga11.noarch.rpm
http://repository.mageia.org/distrib/cauldron/x86_64/media/core/release/univocity-parsers-2.9.1-12.mga11.noarch.rpm
http://repository.mageia.org/distrib/cauldron/x86_64/media/core/release/xmvn-generator-2.1.1-1.mga11.noarch.rpm
retrieved lujavrite-1.2.3-2.mga11.x86_64.rpm maven-jar-plugin-3.3.0-3.mga11.noarch.rpm plexus-languages-1.5.2-1.mga11.noarch.rpm picocli-4.7.7-2.mga11.noarch.rpm apache-commons-lang3-3.19.0-2.mga11.noarch.rpm apache-commons-compress-1.28.0-2.mga11.noarch.rpm maven-surefire-provider-junit-3.2.2-5.mga11.noarch.rpm maven-filtering-3.3.2-1.mga11.noarch.rpm maven-3.9.11-4.mga11.noarch.rpm apache-commons-exec-1.6.0-1.mga11.noarch.rpm xmvn-mojo-4.3.0-2.mga11.noarch.rpm maven-surefire-plugin-3.2.2-5.mga11.noarch.rpm maven-plugin-annotations-3.9.0-3.mga11.noarch.rpm clojure-maven-plugin-1.9.3-1.mga11.noarch.rpm python3-javapackages-6.5.1-8.mga11.noarch.rpm ant-1.10.15-8.mga11.noarch.rpm xmvn5-core-5.1.0-1.mga11.noarch.rpm xz-java-1.12-1.mga11.noarch.rpm maven-common-artifact-filters-3.4.0-2.mga11.noarch.rpm xmvn5-tools-5.1.0-1.mga11.noarch.rpm maven-archiver-3.6.2-2.mga11.noarch.rpm plexus-archiver-4.12.0-1.mga11.noarch.rpm maven-surefire-3.2.2-5.mga11.noarch.rpm plexus-io-3.5.2-1.mga11.noarch.rpm maven-shared-incremental-1.1-30.mga11.noarch.rpm dola-1.3.2-6.mga11.noarch.rpm xmvn-toolchain-openjdk25-4.3.0-2.mga11.noarch.rpm maven-local-openjdk25-6.5.1-8.mga11.noarch.rpm javapackages-local-openjdk25-6.5.1-8.mga11.noarch.rpm plexus-build-api0-0.0.7-43.mga11.noarch.rpm beust-jcommander-1.82-4.mga11.noarch.rpm qdox-2.2.0-1.mga11.noarch.rpm maven-surefire-provider-testng-3.2.2-5.mga11.noarch.rpm ant-lib-1.10.15-8.mga11.noarch.rpm xmvn-tools-4.3.0-2.mga11.noarch.rpm maven-openjdk25-3.9.11-4.mga11.noarch.rpm xmvn-minimal-4.3.0-2.mga11.noarch.rpm xmvn-core-4.3.0-2.mga11.noarch.rpm xmvn5-minimal-5.1.0-1.mga11.noarch.rpm junit5-5.14.4-1.mga11.noarch.rpm maven-surefire-provider-junit5-3.2.2-5.mga11.noarch.rpm javapackages-common-6.5.1-8.mga11.noarch.rpm ant-openjdk25-1.10.15-8.mga11.noarch.rpm plexus-compiler-2.16.2-1.mga11.noarch.rpm maven-compiler-plugin-3.12.1-3.mga11.noarch.rpm xmvn5-mojo-5.1.0-1.mga11.noarch.rpm assertj-core-3.26.3-1.mga11.noarch.rpm maven-resources-plugin-3.3.1-3.mga11.noarch.rpm univocity-parsers-2.9.1-12.mga11.noarch.rpm xmvn-generator-2.1.1-1.mga11.noarch.rpm
...retrieving done
installing assertj-core-3.26.3-1.mga11.noarch.rpm univocity-parsers-2.9.1-12.mga11.noarch.rpm maven-resources-plugin-3.3.1-3.mga11.noarch.rpm xmvn-generator-2.1.1-1.mga11.noarch.rpm javapackages-common-6.5.1-8.mga11.noarch.rpm ant-openjdk25-1.10.15-8.mga11.noarch.rpm xmvn5-mojo-5.1.0-1.mga11.noarch.rpm maven-compiler-plugin-3.12.1-3.mga11.noarch.rpm plexus-compiler-2.16.2-1.mga11.noarch.rpm maven-surefire-provider-junit5-3.2.2-5.mga11.noarch.rpm junit5-5.14.4-1.mga11.noarch.rpm xmvn5-minimal-5.1.0-1.mga11.noarch.rpm maven-openjdk25-3.9.11-4.mga11.noarch.rpm xmvn-minimal-4.3.0-2.mga11.noarch.rpm xmvn-core-4.3.0-2.mga11.noarch.rpm ant-lib-1.10.15-8.mga11.noarch.rpm xmvn-tools-4.3.0-2.mga11.noarch.rpm maven-surefire-provider-testng-3.2.2-5.mga11.noarch.rpm beust-jcommander-1.82-4.mga11.noarch.rpm qdox-2.2.0-1.mga11.noarch.rpm javapackages-local-openjdk25-6.5.1-8.mga11.noarch.rpm plexus-build-api0-0.0.7-43.mga11.noarch.rpm maven-local-openjdk25-6.5.1-8.mga11.noarch.rpm dola-1.3.2-6.mga11.noarch.rpm xmvn-toolchain-openjdk25-4.3.0-2.mga11.noarch.rpm maven-shared-incremental-1.1-30.mga11.noarch.rpm plexus-io-3.5.2-1.mga11.noarch.rpm maven-surefire-3.2.2-5.mga11.noarch.rpm xmvn5-tools-5.1.0-1.mga11.noarch.rpm plexus-archiver-4.12.0-1.mga11.noarch.rpm maven-archiver-3.6.2-2.mga11.noarch.rpm xz-java-1.12-1.mga11.noarch.rpm maven-common-artifact-filters-3.4.0-2.mga11.noarch.rpm xmvn5-core-5.1.0-1.mga11.noarch.rpm clojure-maven-plugin-1.9.3-1.mga11.noarch.rpm python3-javapackages-6.5.1-8.mga11.noarch.rpm ant-1.10.15-8.mga11.noarch.rpm maven-plugin-annotations-3.9.0-3.mga11.noarch.rpm maven-surefire-plugin-3.2.2-5.mga11.noarch.rpm apache-commons-exec-1.6.0-1.mga11.noarch.rpm xmvn-mojo-4.3.0-2.mga11.noarch.rpm maven-filtering-3.3.2-1.mga11.noarch.rpm maven-3.9.11-4.mga11.noarch.rpm apache-commons-compress-1.28.0-2.mga11.noarch.rpm maven-surefire-provider-junit-3.2.2-5.mga11.noarch.rpm apache-commons-lang3-3.19.0-2.mga11.noarch.rpm picocli-4.7.7-2.mga11.noarch.rpm plexus-languages-1.5.2-1.mga11.noarch.rpm maven-jar-plugin-3.3.0-3.mga11.noarch.rpm lujavrite-1.2.3-2.mga11.x86_64.rpm from /home/iurt/chroot_tmp/iurt/chroot_cauldron.x86_64.0.20261006071003/var/cache/urpmi/rpms
starting installing packages
created transaction for installing on /home/iurt/chroot_tmp/iurt/chroot_cauldron.x86_64.0.20261006071003 (remove=0, install=0, upgrade=50)
Preparing... #############################################
101/152: apache-commons-lang3 #############################################
102/152: apache-commons-compress
#############################################
103/152: xmvn-core #############################################
104/152: xmvn5-core #############################################
105/152: maven #############################################
shell-init: error retrieving current directory: getcwd: cannot access parent directories: No such file or directory
106/152: maven-openjdk25 #############################################
107/152: picocli #############################################
108/152: plexus-compiler #############################################
109/152: ant-openjdk25 #############################################
110/152: xmvn5-tools #############################################
111/152: xmvn-minimal #############################################
112/152: xmvn5-mojo #############################################
113/152: xmvn5-minimal #############################################
114/152: xmvn-mojo #############################################
115/152: lujavrite #############################################
116/152: dola #############################################
117/152: xmvn-generator #############################################
118/152: apache-commons-exec #############################################
119/152: maven-plugin-annotations
#############################################
120/152: python3-javapackages #############################################
121/152: javapackages-common #############################################
122/152: maven-common-artifact-filters
#############################################
123/152: xz-java #############################################
124/152: plexus-io #############################################
125/152: plexus-archiver #############################################
126/152: maven-archiver #############################################
127/152: maven-jar-plugin #############################################
128/152: maven-shared-incremental
#############################################
129/152: xmvn-toolchain-openjdk25
#############################################
130/152: plexus-build-api0 #############################################
131/152: maven-filtering #############################################
132/152: maven-resources-plugin
#############################################
133/152: qdox #############################################
134/152: plexus-languages #############################################
135/152: maven-surefire #############################################
136/152: maven-surefire-provider-testng
#############################################
137/152: maven-surefire-provider-junit
#############################################
138/152: maven-compiler-plugin #############################################
139/152: beust-jcommander #############################################
140/152: xmvn-tools #############################################
141/152: javapackages-local-openjdk25
#############################################
142/152: ant-lib #############################################
143/152: univocity-parsers #############################################
144/152: assertj-core #############################################
145/152: junit5 #############################################
146/152: maven-surefire-provider-junit5
#############################################
147/152: maven-surefire-plugin #############################################
148/152: maven-local-openjdk25 #############################################
149/152: ant #############################################
150/152: clojure-maven-plugin #############################################
shell-init: error retrieving current directory: getcwd: cannot access parent directories: No such file or directory
shell-init: error retrieving current directory: getcwd: cannot access parent directories: No such file or directory
retrieving rpm files from medium "core_release"...
http://repository.mageia.org/distrib/cauldron/x86_64/media/core/release/clojure-tmp-1.12.4-1.mga11.noarch.rpm
http://repository.mageia.org/distrib/cauldron/x86_64/media/core/release/clojure-spec-alpha-0.6.249-1.mga11.noarch.rpm
retrieved clojure-tmp-1.12.4-1.mga11.noarch.rpm clojure-spec-alpha-0.6.249-1.mga11.noarch.rpm
...retrieving done
installing clojure-spec-alpha-0.6.249-1.mga11.noarch.rpm clojure-tmp-1.12.4-1.mga11.noarch.rpm from /home/iurt/chroot_tmp/iurt/chroot_cauldron.x86_64.0.20261006071003/var/cache/urpmi/rpms
starting installing packages
created transaction for installing on /home/iurt/chroot_tmp/iurt/chroot_cauldron.x86_64.0.20261006071003 (remove=0, install=0, upgrade=2)
Preparing... #############################################
151/152: clojure-tmp #############################################
152/152: clojure-spec-alpha #############################################
D: [iurt_root_command] Success!
__
I: [iurt] [iurt] installation successful
I: [iurt] [iurt] handling dynamic buildrequires
D: [iurt] [iurt] DynamicBuildRequires not required for @2375899:clojure-core-specs-alpha-0.5.81-2.mga11.src.rpm
D: [iurt] [iurt] Using timeout of 60 seconds.
D: [iurt] [iurt] rpm --root /home/iurt/chroot_tmp/iurt/chroot_cauldron.x86_64.0.20261006071003 -qa | sort
D: [iurt] [iurt] Forking to monitor log size
D: [iurt] [iurt] Command exited with 0.
N: [iurt] [iurt] Building @2375899:clojure-core-specs-alpha-0.5.81-2.mga11.src.rpm
D: [iurt] [iurt] Using timeout of 36000 seconds.
D: [iurt] [iurt] /usr/bin/sudo /usr/sbin/iurt_root_command --chroot /home/iurt/chroot_tmp/iurt/chroot_cauldron.x86_64.0.20261006071003 /bin/su - iurt -c "TMP=/home/iurt/tmp/ rpmbuild --target noarch --rebuild /home/iurt/rpmbuild/SRPMS/@2375899:clojure-core-specs-alpha-0.5.81-2.mga11.src.rpm"
D: [iurt] [iurt] Forking to monitor log size
D: [iurt] [iurt] Command exited with 256.
D: [iurt] [iurt] calling callback for build_@2375899:clojure-core-specs-alpha-0.5.81-2.mga11.src.rpm
E: [iurt] [iurt] ERROR: call_ret=1 kill= err=256 ()
F: [iurt] [iurt] See https://pkgsubmit.mageia.org/queue/build//cauldron/x86_64//log/@2375899:clojure-core-specs-alpha-0.5.81-2.mga11.src.rpm/
Command failed: /usr/bin/sudo /usr/sbin/iurt_root_command --chroot /home/iurt/chroot_tmp/iurt/chroot_cauldron.x86_64.0.20261006071003 /bin/su - iurt -c "TMP=/home/iurt/tmp/ rpmbuild --target noarch --rebuild /home/iurt/rpmbuild/SRPMS/@2375899:clojure-core-specs-alpha-0.5.81-2.mga11.src.rpm"
I: [iurt] [iurt] --------------- Command failed, full output follows ---------------
I: [iurt] [iurt] D: [iurt_root_command] chroot
Building target platforms: noarch
Building for target noarch
Installing /home/iurt/rpmbuild/SRPMS/@2375899:clojure-core-specs-alpha-0.5.81-2.mga11.src.rpm
Executing(%mkbuilddir): /bin/sh -e /home/iurt/rpmbuild/tmp/rpm-tmp.ZWH0vT
Executing(%prep): /bin/sh -e /home/iurt/rpmbuild/tmp/rpm-tmp.g4gac7
+ umask 022
+ cd /home/iurt/rpmbuild/BUILD/clojure-core-specs-alpha-0.5.81-build
+ '[' 1 -eq 1 ']'
+ '[' 1 -eq 1 ']'
+ '[' 1 -eq 1 ']'
+ cd /home/iurt/rpmbuild/BUILD/clojure-core-specs-alpha-0.5.81-build
+ rm -rf core.specs.alpha-0.5.81
+ /usr/lib/rpm/rpmuncompress -x /home/iurt/rpmbuild/SOURCES/v0.5.81.zip
+ STATUS=0
+ '[' 0 -ne 0 ']'
+ cd core.specs.alpha-0.5.81
+ /usr/bin/chmod -Rf a+rX,u+w,g-w,o-w .
+ /usr/bin/python3 /usr/share/java-utils/pom_editor.py pom_remove_parent pom.xml
+ /usr/bin/python3 /usr/share/java-utils/pom_editor.py pom_xpath_inject pom:project 'org.clojure'
+ /usr/bin/python3 /usr/share/java-utils/pom_editor.py pom_xpath_inject pom:project/pom:properties 'UTF-8'
+ /usr/bin/python3 /usr/share/java-utils/pom_editor.py pom_xpath_inject pom:project/pom:properties 'src/main/clojure'
+ /usr/bin/python3 /usr/share/java-utils/pom_editor.py pom_xpath_inject pom:project/pom:properties 'src/test/clojure'
+ /usr/bin/python3 /usr/share/java-utils/pom_editor.py pom_xpath_inject 'pom:execution[pom:id='\''clojure-compile'\'']' 'compile'
+ /usr/bin/python3 /usr/share/java-utils/pom_editor.py pom_xpath_inject 'pom:execution[pom:id='\''clojure-test'\'']' 'test'
+ /usr/bin/python3 /usr/share/java-utils/pom_editor.py pom_add_plugin org.codehaus.mojo:build-helper-maven-plugin:1.12 . $'\n\n \n \n add-clojure-source-dirs\n generate-sources\n \n add-source\n add-resource\n \n \n \n src/main/clojure\n \n \n \n src/main/clojure\n \n \n \n \n \n add-clojure-test-source-dirs\n generate-sources\n \n add-test-source\n add-test-resource\n \n \n \n src/test/clojure\n \n \n \n src/test/clojure\n \n \n \n \n '
+ RPM_EC=0
++ jobs -p
+ exit 0
Executing(%build): /bin/sh -e /home/iurt/rpmbuild/tmp/rpm-tmp.t21706
+ umask 022
+ cd /home/iurt/rpmbuild/BUILD/clojure-core-specs-alpha-0.5.81-build
+ CFLAGS='-O2 -g -pipe -Wformat -Werror=format-security -Wp,-U_FORTIFY_SOURCE,-D_FORTIFY_SOURCE=3 -specs=/usr/lib/rpm/redhat/redhat-hardened-cc1 -fstack-protector-strong -m64 -fasynchronous-unwind-tables -fstack-clash-protection -fcf-protection=full'
+ export CFLAGS
+ CXXFLAGS='-O2 -g -pipe -Wformat -Werror=format-security -Wp,-U_FORTIFY_SOURCE,-D_FORTIFY_SOURCE=3 -specs=/usr/lib/rpm/redhat/redhat-hardened-cc1 -fstack-protector-strong -m64 -fasynchronous-unwind-tables -fstack-clash-protection -fcf-protection=full'
+ export CXXFLAGS
+ FFLAGS='-O2 -g -pipe -Wformat -Werror=format-security -Wp,-U_FORTIFY_SOURCE,-D_FORTIFY_SOURCE=3 -specs=/usr/lib/rpm/redhat/redhat-hardened-cc1 -fstack-protector-strong -m64 -fasynchronous-unwind-tables -fstack-clash-protection -fcf-protection=full '
+ export FFLAGS
+ FCFLAGS='-O2 -g -pipe -Wformat -Werror=format-security -Wp,-U_FORTIFY_SOURCE,-D_FORTIFY_SOURCE=3 -specs=/usr/lib/rpm/redhat/redhat-hardened-cc1 -fstack-protector-strong -m64 -fasynchronous-unwind-tables -fstack-clash-protection -fcf-protection=full '
+ export FCFLAGS
+ VALAFLAGS=-g
+ export VALAFLAGS
+ RUSTFLAGS='-Copt-level=3 -Cdebuginfo=2 -Ccodegen-units=1 -Cstrip=none --cap-lints=warn'
+ export RUSTFLAGS
+ LDFLAGS='-Wl,--as-needed -Wl,--no-undefined -Wl,-z,relro -Wl,-z,now -Wl,-O1 -Wl,--build-id=sha1 -Wl,--enable-new-dtags -specs=/usr/lib/rpm/redhat/redhat-hardened-ld'
+ export LDFLAGS
+ LT_SYS_LIBRARY_PATH=/usr/lib:
+ export LT_SYS_LIBRARY_PATH
+ CC=gcc
+ export CC
+ CXX=g++
+ export CXX
+ cd core.specs.alpha-0.5.81
+ '[' 1 -eq 1 ']'
+ '[' 1 -eq 1 ']'
+ /usr/bin/python3 /usr/share/java-utils/mvn_build.py --xmvn-javadoc -f
Executing: xmvn --batch-mode --offline -Dmaven.test.skip=true package org.fedoraproject.xmvn:xmvn-mojo:install org.fedoraproject.xmvn:xmvn-mojo:javadoc org.fedoraproject.xmvn:xmvn-mojo:builddep
['xmvn', '--batch-mode', '--offline', '-Dmaven.test.skip=true', 'package', 'org.fedoraproject.xmvn:xmvn-mojo:install', 'org.fedoraproject.xmvn:xmvn-mojo:javadoc', 'org.fedoraproject.xmvn:xmvn-mojo:builddep']
SLF4J: Class path contains multiple SLF4J bindings.
SLF4J: Found binding in [jar:file:/usr/share/xmvn/lib/slf4j-api-1.7.36.jar!/org/slf4j/impl/StaticLoggerBinder.class]
SLF4J: Found binding in [jar:file:/usr/share/xmvn/lib/maven-slf4j-provider-3.9.11.jar!/org/slf4j/impl/StaticLoggerBinder.class]
SLF4J: See http://www.slf4j.org/codes.html#multiple_bindings for an explanation.
SLF4J: Actual binding is of type [org.slf4j.impl.SimpleLoggerFactory]
SLF4J: Class path contains multiple SLF4J bindings.
SLF4J: Found binding in [jar:file:/usr/share/xmvn/lib/slf4j-api-1.7.36.jar!/org/slf4j/impl/StaticLoggerBinder.class]
SLF4J: Found binding in [jar:file:/usr/share/xmvn/lib/maven-slf4j-provider-3.9.11.jar!/org/slf4j/impl/StaticLoggerBinder.class]
SLF4J: See http://www.slf4j.org/codes.html#multiple_bindings for an explanation.
SLF4J: Actual binding is of type [org.slf4j.impl.SimpleLoggerFactory]
WARNING: A terminally deprecated method in sun.misc.Unsafe has been called
WARNING: sun.misc.Unsafe::objectFieldOffset has been called by com.google.common.util.concurrent.AbstractFuture$UnsafeAtomicHelper (file:/usr/share/xmvn/lib/failureaccess-1.0.3.jar)
WARNING: Please consider reporting this to the maintainers of class com.google.common.util.concurrent.AbstractFuture$UnsafeAtomicHelper
WARNING: sun.misc.Unsafe::objectFieldOffset will be removed in a future release
[INFO] Scanning for projects...
[INFO]
[INFO] --------------------< org.clojure:core.specs.alpha >--------------------
[INFO] Building core.specs.alpha 0.5.81
[INFO] from pom.xml
[INFO] --------------------------------[ jar ]---------------------------------
[WARNING] The POM for org.clojure:core.specs.alpha:jar:0.4.74 is missing, no dependency information available
[INFO]
[INFO] ------------------------------------------------------------------------
[INFO] Skipping core.specs.alpha
[INFO] This project has been banned from the build due to previous failures.
[INFO] ------------------------------------------------------------------------
[INFO] ------------------------------------------------------------------------
[INFO] BUILD FAILURE
[INFO] ------------------------------------------------------------------------
[INFO] Total time: 0.481 s
[INFO] Finished at: 2026-10-06T07:10:31Z
[INFO] ------------------------------------------------------------------------
[ERROR] Failed to execute goal on project core.specs.alpha: Could not resolve dependencies for project org.clojure:core.specs.alpha:jar:0.5.81
[ERROR] dependency: org.clojure:core.specs.alpha:jar:0.4.74 (provided)
[ERROR] Cannot access central (https://repo.maven.apache.org/maven2) in offline mode and the artifact org.clojure:core.specs.alpha:jar:0.4.74 has not been downloaded from it before.
[ERROR] -> [Help 1]
[ERROR]
[ERROR] To see the full stack trace of the errors, re-run Maven with the -e switch.
[ERROR] Re-run Maven using the -X switch to enable full debug logging.
[ERROR]
[ERROR] For more information about the errors and possible solutions, please read the following articles:
[ERROR] [Help 1] http://cwiki.apache.org/confluence/display/MAVEN/DependencyResolutionException
error: Bad exit status from /home/iurt/rpmbuild/tmp/rpm-tmp.t21706 (%build)
RPM build errors:
Bad exit status from /home/iurt/rpmbuild/tmp/rpm-tmp.t21706 (%build)
I: [iurt_root_command] ERROR: chroot
I: [iurt] [iurt] --------------- end of command output ---------------
D: [iurt] [iurt] clean chroot
D: [iurt_root_command] Running iurt_root_command --netns_delete /home/iurt/chroot_tmp/iurt/chroot_cauldron.x86_64.0.20261006071003
D: [iurt_root_command] Delete network namespace for given chroot, killing all processes
D: [iurt_root_command] Success!
D: [iurt_root_command] Running iurt_root_command --umount /home/iurt/chroot_tmp/iurt/chroot_cauldron.x86_64.0.20261006071003/proc
D: [iurt_root_command] Unmounting
D: [iurt_root_command] Success!
D: [iurt_root_command] Running iurt_root_command --umount /home/iurt/chroot_tmp/iurt/chroot_cauldron.x86_64.0.20261006071003/dev/pts
D: [iurt_root_command] Unmounting
D: [iurt_root_command] Success!
D: [iurt_root_command] Running iurt_root_command --umount /home/iurt/chroot_tmp/iurt/chroot_cauldron.x86_64.0.20261006071003/dev/shm
D: [iurt_root_command] Unmounting
D: [iurt_root_command] Success!
[iurt] [iurt] cleaning /home/iurt/chroot_tmp/iurt/chroot_cauldron.x86_64.0.20261006071003
[iurt] [iurt] removing /home/iurt/chroot_tmp/iurt/chroot_cauldron.x86_64.0.20261006071003
D: [iurt_root_command] Running iurt_root_command --rm -r /home/iurt/chroot_tmp/iurt/chroot_cauldron.x86_64.0.20261006071003
D: [iurt_root_command] Removing files
D: [iurt_root_command] removing /home/iurt/chroot_tmp/iurt/chroot_cauldron.x86_64.0.20261006071003
D: [iurt_root_command] Success!