*: [iurt] This is iurt version 0.9.4
D: [iurt] [iurt] load config: /home/iurt/.iurt.cauldron.conf
D: [iurt] [iurt] load config: /etc/iurt/build/cauldron.conf
D: [iurt] [iurt] Setting PERL_EXTUTILS_AUTOINSTALL to --skipdeps
D: [iurt] [iurt] Setting PERL_AUTOINSTALL to --skipdeps
I: [iurt] [iurt] local spool: /home/iurt/iurt/cauldron/core/release/20261005140123.ns80.duvel.737650-x86_64
I: [iurt] [iurt] Packages to build: 1
D: [iurt] [iurt] using 0.20261005140203 as chroot extension
D: [iurt] [iurt] using local user iurt, id 517
I: [iurt] [iurt] Remove existing chroot
D: [iurt] [iurt] ... dir /home/iurt/chroot_tmp all prefix chroot_cauldron.x86_64
D: [iurt] [iurt] running with pid 1073432
N: [iurt] [iurt] Build package @2375454:clojure-spec-alpha-0.6.249-1.mga11.src.rpm [1/1]
D: [iurt] [iurt] Not reusing old chroot
I: [iurt] [iurt] Install new chroot
D: [iurt] [iurt] ... in /home/iurt/chroot_tmp/iurt/chroot_cauldron.x86_64.0.20261005140203
D: [iurt] [iurt] clean chroot
N: [iurt] [iurt] creating chroot
D: [iurt_root_command] Running iurt_root_command --mkdir -p /home/iurt/chroot_tmp/iurt/chroot_cauldron.x86_64.0.20261005140203.tmp.fZlyZE
D: [iurt_root_command] Creating the path
D: [iurt_root_command] Success!
D: [iurt] [iurt] decompressing /var/log/qa from /home/iurt/chroot_cauldron.x86_64.tar in /home/iurt/chroot_tmp/iurt/chroot_cauldron.x86_64.0.20261005140203.tmp.fZlyZE
D: [iurt_root_command] Running iurt_root_command --untar /home/iurt/chroot_cauldron.x86_64.tar /home/iurt/chroot_tmp/iurt/chroot_cauldron.x8...
D: [iurt_root_command] Uncompress tarball
D: [iurt_root_command] Success!
D: [iurt_root_command] Running iurt_root_command --mkdir -m 1023 /home/iurt/chroot_tmp/iurt/chroot_cauldron.x86_64.0.20261005140203.tmp.fZly...
D: [iurt_root_command] Creating the path
D: [iurt_root_command] Success!
/bin/cp: cannot create special file '/home/iurt/chroot_tmp/iurt/chroot_cauldron.x86_64.0.20261005140203.tmp.fZlyZE/tmp/tmp.NSwtnd/dev/null': Operation not permitted
% Total % Received % Xferd Average Speed Time Time Time Current
Dload Upload Total Spent Left Speed
0 0 0 0 0 0 0 0 --:--:-- --:--:-- --:--:-- 0
100 3322k 100 3322k 0 0 108M 0 --:--:-- --:--:-- --:--:-- 108M
% Total % Received % Xferd Average Speed Time Time Time Current
Dload Upload Total Spent Left Speed
0 0 0 0 0 0 0 0 --:--:-- --:--:-- --:--:-- 0
100 32 100 32 0 0 32000 0 --:--:-- --:--:-- --:--:-- 32000
N: [iurt] [iurt] chroot tarball is already up-to-date
D: [iurt_root_command] Running iurt_root_command --rm -r /home/iurt/chroot_tmp/iurt/chroot_cauldron.x86_64.0.20261005140203.tmp.fZlyZE
D: [iurt_root_command] Removing files
D: [iurt_root_command] removing /home/iurt/chroot_tmp/iurt/chroot_cauldron.x86_64.0.20261005140203.tmp.fZlyZE
D: [iurt_root_command] Success!
D: [iurt_root_command] Running iurt_root_command --rm -r /home/iurt/chroot_tmp/iurt/chroot_cauldron.x86_64.0.20261005140203
D: [iurt_root_command] Removing files
D: [iurt_root_command] removing /home/iurt/chroot_tmp/iurt/chroot_cauldron.x86_64.0.20261005140203
D: [iurt_root_command] Success!
D: [iurt_root_command] Running iurt_root_command --mkdir -p /home/iurt/chroot_tmp/iurt/chroot_cauldron.x86_64.0.20261005140203
D: [iurt_root_command] Creating the path
D: [iurt_root_command] Success!
D: [iurt_root_command] Running iurt_root_command --untar /home/iurt/chroot_cauldron.x86_64.tar /home/iurt/chroot_tmp/iurt/chroot_cauldron.x8...
D: [iurt_root_command] Uncompress tarball
D: [iurt_root_command] Success!
N: [iurt] [iurt] chroot recreated in /home/iurt/chroot_tmp/iurt/chroot_cauldron.x86_64.0.20261005140203 (from /home/iurt/chroot_cauldron.x86_64.tar)
D: [iurt_root_command] Running iurt_root_command --netns_create /home/iurt/chroot_tmp/iurt/chroot_cauldron.x86_64.0.20261005140203
D: [iurt_root_command] Create network namespace for given chroot
D: [iurt_root_command] Success!
D: [iurt_root_command] Running iurt_root_command --cp /tmp/rpmmacros.rqlPcy /home/iurt/chroot_tmp/iurt/chroot_cauldron.x86_64.0.202610051402...
D: [iurt_root_command] Copying files
D: [iurt_root_command] copying /tmp/rpmmacros.rqlPcy -> /home/iurt/chroot_tmp/iurt/chroot_cauldron.x86_64.0.20261005140203/etc/rpm/macros
D: [iurt_root_command] Success!
D: [iurt_root_command] Running iurt_root_command --bindmount /proc /home/iurt/chroot_tmp/iurt/chroot_cauldron.x86_64.0.20261005140203/proc
D: [iurt_root_command] Bind mounting
D: [iurt_root_command] Success!
D: [iurt_root_command] Running iurt_root_command --bindmount /dev/pts /home/iurt/chroot_tmp/iurt/chroot_cauldron.x86_64.0.20261005140203/dev...
D: [iurt_root_command] Bind mounting
D: [iurt_root_command] Success!
D: [iurt_root_command] Running iurt_root_command --tmpfs /home/iurt/chroot_tmp/iurt/chroot_cauldron.x86_64.0.20261005140203/dev/shm
D: [iurt_root_command] Mount tmpfs
D: [iurt_root_command] Success!
I: [iurt] [iurt] add chroot media: http://repository.mageia.org/distrib//cauldron/x86_64
D: [iurt] [iurt] Using timeout of 600 seconds.
D: [iurt] [iurt] /usr/bin/sudo /usr/sbin/iurt_root_command --urpmi-addmedia -v --urpmi-root /home/iurt/chroot_tmp/iurt/chroot_cauldron.x86_64.0.20261005140203 core_release http://repository.mageia.org/distrib//cauldron/x86_64/media/core/release
D: [iurt] [iurt] Command exited with 0.
MEDIA core_release
(core_release)
D: [iurt] [iurt] creating user iurt in chroot /home/iurt/chroot_tmp/iurt/chroot_cauldron.x86_64.0.20261005140203
D: [iurt_root_command] Running iurt_root_command --useradd /home/iurt/chroot_tmp/iurt/chroot_cauldron.x86_64.0.20261005140203 iurt 517
D: [iurt_root_command] Useradd
useradd warning: iurt's uid 517 outside of the UID_MIN 1000 and UID_MAX 60000 range.
D: [iurt_root_command] Success!
N: [iurt] [iurt] recreate srpm: @2375454:clojure-spec-alpha-0.6.249-1.mga11.src.rpm
D: [iurt] [iurt] Using timeout of 600 seconds.
D: [iurt] [iurt] perl command
D: [iurt_root_command] Running iurt_root_command --cp /home/iurt/iurt/cauldron/core/release/20261005140123.ns80.duvel.737650-x86_64//@237545...
D: [iurt_root_command] Copying files
D: [iurt_root_command] copying /home/iurt/iurt/cauldron/core/release/20261005140123.ns80.duvel.737650-x86_64//@2375454:clojure-spec-alpha-0.6.249-1.mga11.src.rpm -> /home/iurt/chroot_tmp/iurt/chroot_cauldron.x86_64.0.20261005140203/home/iurt/rpmbuild/SRPMS/
D: [iurt_root_command] Success!
D: [iurt] [iurt] Command exited with 0.
D: [iurt] [iurt] recreating src.rpm...
D: [iurt] [iurt] Using timeout of 600 seconds.
D: [iurt] [iurt] /usr/bin/sudo /usr/sbin/iurt_root_command --chroot /home/iurt/chroot_tmp/iurt/chroot_cauldron.x86_64.0.20261005140203 su iurt -c "rpm -i /home/iurt/rpmbuild/SRPMS/@2375454:clojure-spec-alpha-0.6.249-1.mga11.src.rpm"
D: [iurt] [iurt] Command exited with 0.
D: [iurt] [iurt] calling callback for install_@2375454:clojure-spec-alpha-0.6.249-1.mga11.src.rpm
D: [iurt] [iurt] Using timeout of 600 seconds.
D: [iurt] [iurt] /usr/bin/sudo /usr/sbin/iurt_root_command --chroot /home/iurt/chroot_tmp/iurt/chroot_cauldron.x86_64.0.20261005140203 su iurt -c "rpmspec -q --qf %{NVR}.src.rpm --srpm /home/iurt/rpmbuild/SPECS/clojure-spec-alpha.spec | tail -n1 > /home/iurt/rpmbuild/SPECS/clojure-spec-alpha.spec.srpm_name"
D: [iurt] [iurt] Forking to monitor log size
D: [iurt] [iurt] Command exited with 0.
D: [iurt_root_command] Running iurt_root_command --rm /home/iurt/chroot_tmp/iurt/chroot_cauldron.x86_64.0.20261005140203/home/iurt/rpmbuild/...
D: [iurt_root_command] Removing files
D: [iurt_root_command] removing /home/iurt/chroot_tmp/iurt/chroot_cauldron.x86_64.0.20261005140203/home/iurt/rpmbuild/SRPMS/@2375454:clojure-spec-alpha-0.6.249-1.mga11.src.rpm
D: [iurt_root_command] Success!
D: [iurt] [iurt] Using timeout of 600 seconds.
D: [iurt] [iurt] /usr/bin/sudo /usr/sbin/iurt_root_command --chroot /home/iurt/chroot_tmp/iurt/chroot_cauldron.x86_64.0.20261005140203 su iurt -c "rpmbuild --target x86_64 --nodeps -bs /home/iurt/rpmbuild/SPECS/clojure-spec-alpha.spec"
D: [iurt] [iurt] Forking to monitor log size
D: [iurt] [iurt] Command exited with 0.
D: [iurt_root_command] Running iurt_root_command --ln /home/iurt/chroot_tmp/iurt/chroot_cauldron.x86_64.0.20261005140203/home/iurt/rpmbuild/...
D: [iurt_root_command] Linking files
D: [iurt_root_command] Success!
N: [iurt] [iurt] new srpm: @2375454:clojure-spec-alpha-0.6.249-1.mga11.src.rpm
I: [iurt] [iurt] updating packages in /home/iurt/chroot_tmp/iurt/chroot_cauldron.x86_64.0.20261005140203
D: [iurt] [iurt] Using timeout of 600 seconds.
D: [iurt] [iurt] /usr/bin/sudo /usr/sbin/iurt_root_command --urpmi --urpmi-root /home/iurt/chroot_tmp/iurt/chroot_cauldron.x86_64.0.20261005140203 --auto-update --auto
D: [iurt] [iurt] Command exited with 0.
I: [iurt] [iurt] Install build dependencies for @2375454:clojure-spec-alpha-0.6.249-1.mga11.src.rpm
D: [iurt] [iurt] installing /home/iurt/chroot_tmp/iurt/chroot_cauldron.x86_64.0.20261005140203/home/iurt/rpmbuild/SRPMS//@2375454:clojure-spec-alpha-0.6.249-1.mga11.src.rpm
I: [iurt] [iurt] install dependencies using urpmi
D: [iurt] [iurt] Using timeout of 3600 seconds.
D: [iurt] [iurt] Forking to monitor log size
D: [iurt] [iurt] /usr/bin/sudo /usr/sbin/iurt_root_command --urpmi -v --no-verify-rpm --tune-rpm=all --nolock --auto --no-recommends --ignoresize --noclean --urpmi-root /home/iurt/chroot_tmp/iurt/chroot_cauldron.x86_64.0.20261005140203 --buildrequires /home/iurt/chroot_tmp/iurt/chroot_cauldron.x86_64.0.20261005140203/home/iurt/rpmbuild/SRPMS//@2375454:clojure-spec-alpha-0.6.249-1.mga11.src.rpm
D: [iurt] [iurt] Command exited with 0.
D: [iurt] [iurt] calling callback for install_deps_@2375454:clojure-spec-alpha-0.6.249-1.mga11.src.rpm
D: [iurt] [iurt] missing_deps is empty, aborting.
D: [iurt] [iurt] output had: __ D: [iurt_root_command] urpmi
examining synthesis file [/home/iurt/chroot_tmp/iurt/chroot_cauldron.x86_64.0.20261005140203/var/lib/urpmi/synthesis.hdlist.core_release.cz]
would install instead of upgrade package kernel-desktop-6.18.44-1.mga11-1-1.mga11.x86_64
would install instead of upgrade package kernel-desktop-devel-6.18.44-1.mga11-1-1.mga11.x86_64
would install instead of upgrade package kernel-server-6.18.44-1.mga11-1-1.mga11.x86_64
would install instead of upgrade package kernel-server-devel-6.18.44-1.mga11-1-1.mga11.x86_64
would install instead of upgrade package kernel-linus-6.18.44-1.mga11.x86_64
would install instead of upgrade package kernel-linus-devel-6.18.44-1.mga11.x86_64
retrieving rpm files from medium "core_release"...
http://repository.mageia.org/distrib/cauldron/x86_64/media/core/release/x11-font-xfree86-type1-1.0.5-2.mga10.noarch.rpm
0% of 0 completed, ETA = --:--:--, speed = 0
100% of 35747 completed, ETA = --:--:--, speed = 17.0M
http://repository.mageia.org/distrib/cauldron/x86_64/media/core/release/java-25-openjdk-25.0.4.1.1-4.mga11.x86_64.rpm
0% of 0 completed, ETA = --:--:--, speed = 0
100% of 226k completed, ETA = --:--:--, speed = 110M
http://repository.mageia.org/distrib/cauldron/x86_64/media/core/release/lib64xcb1-1.17.0-2.mga10.x86_64.rpm
0% of 0 completed, ETA = --:--:--, speed = 0
100% of 56093 completed, ETA = --:--:--, speed = 53.4M
http://repository.mageia.org/distrib/cauldron/x86_64/media/core/release/lksctp-tools-1.0.21-2.mga10.x86_64.rpm
0% of 0 completed, ETA = --:--:--, speed = 0
100% of 50628 completed, ETA = --:--:--, speed = 48.2M
http://repository.mageia.org/distrib/cauldron/x86_64/media/core/release/lib64xext6-1.3.7-1.mga11.x86_64.rpm
0% of 0 completed, ETA = --:--:--, speed = 0
100% of 63441 completed, ETA = --:--:--, speed = 60.5M
http://repository.mageia.org/distrib/cauldron/x86_64/media/core/release/lib64png16_16-1.6.58-1.mga11.x86_64.rpm
0% of 0 completed, ETA = --:--:--, speed = 0
100% of 198k completed, ETA = --:--:--, speed = 97.0M
http://repository.mageia.org/distrib/cauldron/x86_64/media/core/release/libalsa-data-1.2.16.1-1.mga11.noarch.rpm
0% of 0 completed, ETA = --:--:--, speed = 0
100% of 274k completed, ETA = --:--:--, speed = 67.1M
http://repository.mageia.org/distrib/cauldron/x86_64/media/core/release/lib64xrender1-0.9.12-2.mga10.x86_64.rpm
0% of 0 completed, ETA = --:--:--, speed = 0
100% of 25003 completed, ETA = --:--:--, speed = 23.8M
http://repository.mageia.org/distrib/cauldron/x86_64/media/core/release/lib64x11_6-1.8.13-1.mga11.x86_64.rpm
0% of 0 completed, ETA = --:--:--, speed = 0
100% of 672k completed, ETA = --:--:--, speed = 54.7M
http://repository.mageia.org/distrib/cauldron/x86_64/media/core/release/lib64pixman1_0-0.46.4-1.mga10.x86_64.rpm
0% of 0 completed, ETA = --:--:--, speed = 0
100% of 287k completed, ETA = --:--:--, speed = 93.6M
http://repository.mageia.org/distrib/cauldron/x86_64/media/core/release/lib64xcb-shm0-1.17.0-2.mga10.x86_64.rpm
0% of 0 completed, ETA = --:--:--, speed = 0
100% of 12066 completed, ETA = --:--:--, speed = 11.5M
http://repository.mageia.org/distrib/cauldron/x86_64/media/core/release/lib64fontenc1-1.1.9-1.mga11.x86_64.rpm
0% of 0 completed, ETA = --:--:--, speed = 0
100% of 20749 completed, ETA = --:--:--, speed = 19.7M
http://repository.mageia.org/distrib/cauldron/x86_64/media/core/release/fontconfig-2.17.1-2.mga10.x86_64.rpm
0% of 0 completed, ETA = --:--:--, speed = 0
100% of 102k completed, ETA = --:--:--, speed = 100M
http://repository.mageia.org/distrib/cauldron/x86_64/media/core/release/lib64xi6-1.8.3-1.mga11.x86_64.rpm
0% of 0 completed, ETA = --:--:--, speed = 0
100% of 40476 completed, ETA = --:--:--, speed = 38.6M
http://repository.mageia.org/distrib/cauldron/x86_64/media/core/release/lib64harfbuzz0-14.5.0-1.mga11.x86_64.rpm
0% of 0 completed, ETA = --:--:--, speed = 0
100% of 1545k completed, ETA = --:--:--, speed = 94.3M
http://repository.mageia.org/distrib/cauldron/x86_64/media/core/release/dola-transformer-1.0.2-1.mga11.noarch.rpm
0% of 0 completed, ETA = --:--:--, speed = 0
100% of 31149 completed, ETA = --:--:--, speed = 29.7M
http://repository.mageia.org/distrib/cauldron/x86_64/media/core/release/lib64alsa2-1.2.16.1-1.mga11.x86_64.rpm
0% of 0 completed, ETA = --:--:--, speed = 0
100% of 530k completed, ETA = --:--:--, speed = 103M
http://repository.mageia.org/distrib/cauldron/x86_64/media/core/release/lua-5.4.8-1.mga10.x86_64.rpm
0% of 0 completed, ETA = --:--:--, speed = 0
100% of 215k completed, ETA = --:--:--, speed = 69.9M
http://repository.mageia.org/distrib/cauldron/x86_64/media/core/release/x11-font-type1-1.0.0-19.mga10.noarch.rpm
0% of 0 completed, ETA = --:--:--, speed = 0
100% of 6421 completed, ETA = --:--:--, speed = 6270k
http://repository.mageia.org/distrib/cauldron/x86_64/media/core/release/timezone-java-2025b-1.mga10.noarch.rpm
0% of 0 completed, ETA = --:--:--, speed = 0
100% of 143k completed, ETA = --:--:--, speed = 140M
http://repository.mageia.org/distrib/cauldron/x86_64/media/core/release/lib64nss3-3.130.0-1.mga11.x86_64.rpm
0% of 0 completed, ETA = --:--:--, speed = 0
100% of 1437k completed, ETA = --:--:--, speed = 87.7M
http://repository.mageia.org/distrib/cauldron/x86_64/media/core/release/lib64freetype6-2.14.3-2.mga11.x86_64.rpm
0% of 0 completed, ETA = --:--:--, speed = 0
100% of 391k completed, ETA = --:--:--, speed = 54.5M
http://repository.mageia.org/distrib/cauldron/x86_64/media/core/release/x11-font-bitstream-type1-1.0.4-2.mga10.noarch.rpm
0% of 0 completed, ETA = --:--:--, speed = 0
100% of 307k completed, ETA = --:--:--, speed = 100M
http://repository.mageia.org/distrib/cauldron/x86_64/media/core/release/lib64nspr4-4.40.0-1.mga11.x86_64.rpm
0% of 0 completed, ETA = --:--:--, speed = 0
100% of 136k completed, ETA = --:--:--, speed = 133M
http://repository.mageia.org/distrib/cauldron/x86_64/media/core/release/mkfontscale-1.2.4-1.mga11.x86_64.rpm
0% of 0 completed, ETA = --:--:--, speed = 0
100% of 33771 completed, ETA = --:--:--, speed = 32.2M
http://repository.mageia.org/distrib/cauldron/x86_64/media/core/release/rootcerts-java-20260714.00-1.mga11.noarch.rpm
0% of 0 completed, ETA = --:--:--, speed = 0
100% of 8148 completed, ETA = --:--:--, speed = 7957k
http://repository.mageia.org/distrib/cauldron/x86_64/media/core/release/lib64lcms2_2-2.19.1-1.mga11.x86_64.rpm
0% of 0 completed, ETA = --:--:--, speed = 0
100% of 188k completed, ETA = --:--:--, speed = 184M
http://repository.mageia.org/distrib/cauldron/x86_64/media/core/release/lib64sctp1-1.0.21-2.mga10.x86_64.rpm
0% of 0 completed, ETA = --:--:--, speed = 0
100% of 48395 completed, ETA = --:--:--, speed = 46.1M
http://repository.mageia.org/distrib/cauldron/x86_64/media/core/release/lib64xdmcp6-1.1.5-2.mga10.x86_64.rpm
0% of 0 completed, ETA = --:--:--, speed = 0
100% of 16566 completed, ETA = --:--:--, speed = 15.7M
http://repository.mageia.org/distrib/cauldron/x86_64/media/core/release/nss-3.130.0-1.mga11.x86_64.rpm
0% of 0 completed, ETA = --:--:--, speed = 0
100% of 7951k completed, ETA = --:--:--, speed = 86.2M
http://repository.mageia.org/distrib/cauldron/x86_64/media/core/release/lujavrite-1.2.3-1.mga10.x86_64.rpm
0% of 0 completed, ETA = --:--:--, speed = 0
100% of 18339 completed, ETA = --:--:--, speed = 17.4M
http://repository.mageia.org/distrib/cauldron/x86_64/media/core/release/lua-posix-35.0-5.mga10.x86_64.rpm
0% of 0 completed, ETA = --:--:--, speed = 0
100% of 126k completed, ETA = --:--:--, speed = 123M
http://repository.mageia.org/distrib/cauldron/x86_64/media/core/release/copy-jdk-configs-4.1-3.mga10.noarch.rpm
0% of 0 completed, ETA = --:--:--, speed = 0
100% of 26999 completed, ETA = --:--:--, speed = 25.7M
http://repository.mageia.org/distrib/cauldron/x86_64/media/core/release/fonts-filesystem-2.0.5-7.mga10.noarch.rpm
0% of 0 completed, ETA = --:--:--, speed = 0
100% of 7335 completed, ETA = --:--:--, speed = 7163k
http://repository.mageia.org/distrib/cauldron/x86_64/media/core/release/javapackages-filesystem-6.5.1-8.mga11.noarch.rpm
0% of 0 completed, ETA = --:--:--, speed = 0
100% of 11271 completed, ETA = --:--:--, speed = 10.7M
http://repository.mageia.org/distrib/cauldron/x86_64/media/core/release/java-25-openjdk-devel-25.0.4.1.1-4.mga11.x86_64.rpm
0% of 0 completed, ETA = --:--:--, speed = 0
100% of 6202k completed, ETA = --:--:--, speed = 82.9M
http://repository.mageia.org/distrib/cauldron/x86_64/media/core/release/lib64jpeg8-3.2.0-1.mga11.x86_64.rpm
0% of 0 completed, ETA = --:--:--, speed = 0
100% of 276k completed, ETA = --:--:--, speed = 135M
http://repository.mageia.org/distrib/cauldron/x86_64/media/core/release/lib64xtst6-1.2.5-3.mga11.x86_64.rpm
0% of 0 completed, ETA = --:--:--, speed = 0
100% of 18546 completed, ETA = --:--:--, speed = 17.6M
http://repository.mageia.org/distrib/cauldron/x86_64/media/core/release/python3-lxml-6.0.2-1.mga10.x86_64.rpm
0% of 0 completed, ETA = --:--:--, speed = 0
100% of 2212k completed, ETA = --:--:--, speed = 86.4M
http://repository.mageia.org/distrib/cauldron/x86_64/media/core/release/lib64fontconfig1-2.17.1-2.mga10.x86_64.rpm
0% of 0 completed, ETA = --:--:--, speed = 0
100% of 146k completed, ETA = --:--:--, speed = 71.4M
http://repository.mageia.org/distrib/cauldron/x86_64/media/core/release/publicsuffix-list-20260624-1.mga11.noarch.rpm
0% of 0 completed, ETA = --:--:--, speed = 0
100% of 94020 completed, ETA = --:--:--, speed = 89.6M
http://repository.mageia.org/distrib/cauldron/x86_64/media/core/release/lib64xcomposite1-0.4.7-1.mga11.x86_64.rpm
0% of 0 completed, ETA = --:--:--, speed = 0
100% of 11892 completed, ETA = --:--:--, speed = 11.3M
http://repository.mageia.org/distrib/cauldron/x86_64/media/core/release/lib64cairo2-1.18.6-1.mga11.x86_64.rpm
0% of 0 completed, ETA = --:--:--, speed = 0
100% of 792k completed, ETA = --:--:--, speed = 36.8M
http://repository.mageia.org/distrib/cauldron/x86_64/media/core/release/java-25-openjdk-headless-25.0.4.1.1-4.mga11.x86_64.rpm
0% of 0 completed, ETA = --:--:--, speed = 0
5% of 50.7M completed, ETA = --:--:--, speed = 84.0M
100% of 50.7M completed, ETA = --:--:--, speed = 102M
http://repository.mageia.org/distrib/cauldron/x86_64/media/core/release/lib64gif7-5.2.2-5.mga11.x86_64.rpm
0% of 0 completed, ETA = --:--:--, speed = 0
100% of 42570 completed, ETA = --:--:--, speed = 40.5M
http://repository.mageia.org/distrib/cauldron/x86_64/media/core/release/lib64xcb-render0-1.17.0-2.mga10.x86_64.rpm
0% of 0 completed, ETA = --:--:--, speed = 0
100% of 22146 completed, ETA = --:--:--, speed = 21.1M
http://repository.mageia.org/distrib/cauldron/x86_64/media/core/release/lib64xau6-1.0.12-2.mga10.x86_64.rpm
0% of 0 completed, ETA = --:--:--, speed = 0
100% of 13251 completed, ETA = --:--:--, speed = 12.6M
http://repository.mageia.org/distrib/cauldron/x86_64/media/core/release/dola-gleaner-1.1.1-1.mga11.noarch.rpm
0% of 0 completed, ETA = --:--:--, speed = 0
100% of 38106 completed, ETA = --:--:--, speed = 36.3M
http://repository.mageia.org/distrib/cauldron/x86_64/media/core/release/apache-commons-codec-1.19.0-1.mga11.noarch.rpm
0% of 0 completed, ETA = --:--:--, speed = 0
100% of 315k completed, ETA = --:--:--, speed = 102M
http://repository.mageia.org/distrib/cauldron/x86_64/media/core/release/lib64graphite2_3-1.3.15-1.mga11.x86_64.rpm
0% of 0 completed, ETA = --:--:--, speed = 0
100% of 81795 completed, ETA = --:--:--, speed = 78.0M
retrieved x11-font-xfree86-type1-1.0.5-2.mga10.noarch.rpm java-25-openjdk-25.0.4.1.1-4.mga11.x86_64.rpm lib64xcb1-1.17.0-2.mga10.x86_64.rpm lksctp-tools-1.0.21-2.mga10.x86_64.rpm lib64xext6-1.3.7-1.mga11.x86_64.rpm lib64png16_16-1.6.58-1.mga11.x86_64.rpm libalsa-data-1.2.16.1-1.mga11.noarch.rpm lib64xrender1-0.9.12-2.mga10.x86_64.rpm lib64x11_6-1.8.13-1.mga11.x86_64.rpm lib64pixman1_0-0.46.4-1.mga10.x86_64.rpm lib64xcb-shm0-1.17.0-2.mga10.x86_64.rpm lib64fontenc1-1.1.9-1.mga11.x86_64.rpm fontconfig-2.17.1-2.mga10.x86_64.rpm lib64xi6-1.8.3-1.mga11.x86_64.rpm lib64harfbuzz0-14.5.0-1.mga11.x86_64.rpm dola-transformer-1.0.2-1.mga11.noarch.rpm lib64alsa2-1.2.16.1-1.mga11.x86_64.rpm lua-5.4.8-1.mga10.x86_64.rpm x11-font-type1-1.0.0-19.mga10.noarch.rpm timezone-java-2025b-1.mga10.noarch.rpm lib64nss3-3.130.0-1.mga11.x86_64.rpm lib64freetype6-2.14.3-2.mga11.x86_64.rpm x11-font-bitstream-type1-1.0.4-2.mga10.noarch.rpm lib64nspr4-4.40.0-1.mga11.x86_64.rpm mkfontscale-1.2.4-1.mga11.x86_64.rpm rootcerts-java-20260714.00-1.mga11.noarch.rpm lib64lcms2_2-2.19.1-1.mga11.x86_64.rpm lib64sctp1-1.0.21-2.mga10.x86_64.rpm lib64xdmcp6-1.1.5-2.mga10.x86_64.rpm nss-3.130.0-1.mga11.x86_64.rpm lujavrite-1.2.3-1.mga10.x86_64.rpm lua-posix-35.0-5.mga10.x86_64.rpm copy-jdk-configs-4.1-3.mga10.noarch.rpm fonts-filesystem-2.0.5-7.mga10.noarch.rpm javapackages-filesystem-6.5.1-8.mga11.noarch.rpm java-25-openjdk-devel-25.0.4.1.1-4.mga11.x86_64.rpm lib64jpeg8-3.2.0-1.mga11.x86_64.rpm lib64xtst6-1.2.5-3.mga11.x86_64.rpm python3-lxml-6.0.2-1.mga10.x86_64.rpm lib64fontconfig1-2.17.1-2.mga10.x86_64.rpm publicsuffix-list-20260624-1.mga11.noarch.rpm lib64xcomposite1-0.4.7-1.mga11.x86_64.rpm lib64cairo2-1.18.6-1.mga11.x86_64.rpm java-25-openjdk-headless-25.0.4.1.1-4.mga11.x86_64.rpm lib64gif7-5.2.2-5.mga11.x86_64.rpm lib64xcb-render0-1.17.0-2.mga10.x86_64.rpm lib64xau6-1.0.12-2.mga10.x86_64.rpm dola-gleaner-1.1.1-1.mga11.noarch.rpm apache-commons-codec-1.19.0-1.mga11.noarch.rpm lib64graphite2_3-1.3.15-1.mga11.x86_64.rpm
...retrieving done
installing lib64fontenc1-1.1.9-1.mga11.x86_64.rpm fontconfig-2.17.1-2.mga10.x86_64.rpm lib64x11_6-1.8.13-1.mga11.x86_64.rpm lib64pixman1_0-0.46.4-1.mga10.x86_64.rpm lib64xcb-shm0-1.17.0-2.mga10.x86_64.rpm libalsa-data-1.2.16.1-1.mga11.noarch.rpm lib64xrender1-0.9.12-2.mga10.x86_64.rpm lib64png16_16-1.6.58-1.mga11.x86_64.rpm lib64xext6-1.3.7-1.mga11.x86_64.rpm lksctp-tools-1.0.21-2.mga10.x86_64.rpm x11-font-xfree86-type1-1.0.5-2.mga10.noarch.rpm lib64xcb1-1.17.0-2.mga10.x86_64.rpm java-25-openjdk-25.0.4.1.1-4.mga11.x86_64.rpm x11-font-bitstream-type1-1.0.4-2.mga10.noarch.rpm x11-font-type1-1.0.0-19.mga10.noarch.rpm timezone-java-2025b-1.mga10.noarch.rpm lib64freetype6-2.14.3-2.mga11.x86_64.rpm lib64nss3-3.130.0-1.mga11.x86_64.rpm lua-5.4.8-1.mga10.x86_64.rpm lib64alsa2-1.2.16.1-1.mga11.x86_64.rpm dola-transformer-1.0.2-1.mga11.noarch.rpm lib64xi6-1.8.3-1.mga11.x86_64.rpm lib64harfbuzz0-14.5.0-1.mga11.x86_64.rpm lib64xtst6-1.2.5-3.mga11.x86_64.rpm python3-lxml-6.0.2-1.mga10.x86_64.rpm fonts-filesystem-2.0.5-7.mga10.noarch.rpm java-25-openjdk-devel-25.0.4.1.1-4.mga11.x86_64.rpm javapackages-filesystem-6.5.1-8.mga11.noarch.rpm lib64jpeg8-3.2.0-1.mga11.x86_64.rpm copy-jdk-configs-4.1-3.mga10.noarch.rpm lua-posix-35.0-5.mga10.x86_64.rpm nss-3.130.0-1.mga11.x86_64.rpm lujavrite-1.2.3-1.mga10.x86_64.rpm rootcerts-java-20260714.00-1.mga11.noarch.rpm lib64lcms2_2-2.19.1-1.mga11.x86_64.rpm lib64sctp1-1.0.21-2.mga10.x86_64.rpm lib64xdmcp6-1.1.5-2.mga10.x86_64.rpm lib64nspr4-4.40.0-1.mga11.x86_64.rpm mkfontscale-1.2.4-1.mga11.x86_64.rpm lib64graphite2_3-1.3.15-1.mga11.x86_64.rpm lib64xau6-1.0.12-2.mga10.x86_64.rpm apache-commons-codec-1.19.0-1.mga11.noarch.rpm dola-gleaner-1.1.1-1.mga11.noarch.rpm lib64gif7-5.2.2-5.mga11.x86_64.rpm java-25-openjdk-headless-25.0.4.1.1-4.mga11.x86_64.rpm lib64xcb-render0-1.17.0-2.mga10.x86_64.rpm lib64cairo2-1.18.6-1.mga11.x86_64.rpm lib64xcomposite1-0.4.7-1.mga11.x86_64.rpm lib64fontconfig1-2.17.1-2.mga10.x86_64.rpm publicsuffix-list-20260624-1.mga11.noarch.rpm from /home/iurt/chroot_tmp/iurt/chroot_cauldron.x86_64.0.20261005140203/var/cache/urpmi/rpms
starting installing packages
created transaction for installing on /home/iurt/chroot_tmp/iurt/chroot_cauldron.x86_64.0.20261005140203 (remove=0, install=0, upgrade=50)
Preparing... #############################################
1/153: lib64png16_16 #############################################
2/153: lib64nspr4 #############################################
3/153: lib64jpeg8 #############################################
4/153: javapackages-filesystem
#############################################
5/153: nss #############################################
6/153: lib64nss3 #############################################
shell-init: error retrieving current directory: getcwd: cannot access parent directories: No such file or directory
shell-init: error retrieving current directory: getcwd: cannot access parent directories: No such file or directory
7/153: lib64gif7 #############################################
8/153: lib64xau6 #############################################
9/153: lib64graphite2_3 #############################################
10/153: lib64xdmcp6 #############################################
11/153: lib64xcb1 #############################################
12/153: lib64x11_6 #############################################
shell-init: error retrieving current directory: getcwd: cannot access parent directories: No such file or directory
13/153: lib64xext6 #############################################
14/153: lib64xrender1 #############################################
15/153: lib64xi6 #############################################
16/153: lib64xtst6 #############################################
17/153: lib64xcomposite1 #############################################
18/153: lib64xcb-shm0 #############################################
19/153: lib64xcb-render0 #############################################
20/153: lib64sctp1 #############################################
21/153: lksctp-tools #############################################
22/153: lib64lcms2_2 #############################################
23/153: rootcerts-java #############################################
24/153: lua-posix #############################################
25/153: fonts-filesystem #############################################
26/153: lua #############################################
27/153: copy-jdk-configs #############################################
28/153: timezone-java #############################################
29/153: libalsa-data #############################################
shell-init: error retrieving current directory: getcwd: cannot access parent directories: No such file or directory
30/153: lib64alsa2 #############################################
31/153: lib64pixman1_0 #############################################
32/153: lib64cairo2 #############################################
33/153: lib64harfbuzz0 #############################################
34/153: lib64freetype6 #############################################
35/153: lib64fontconfig1 #############################################
36/153: fontconfig #############################################
shell-init: error retrieving current directory: getcwd: cannot access parent directories: No such file or directory
37/153: java-25-openjdk-headless
#############################################
shell-init: error retrieving current directory: getcwd: cannot access parent directories: No such file or directory
38/153: lib64fontenc1 #############################################
39/153: mkfontscale #############################################
40/153: x11-font-xfree86-type1
#############################################
shell-init: error retrieving current directory: getcwd: cannot access parent directories: No such file or directory
41/153: x11-font-bitstream-type1
#############################################
shell-init: error retrieving current directory: getcwd: cannot access parent directories: No such file or directory
42/153: x11-font-type1 #############################################
43/153: java-25-openjdk #############################################
shell-init: error retrieving current directory: getcwd: cannot access parent directories: No such file or directory
44/153: java-25-openjdk-devel #############################################
shell-init: error retrieving current directory: getcwd: cannot access parent directories: No such file or directory
45/153: apache-commons-codec #############################################
46/153: publicsuffix-list #############################################
47/153: dola-gleaner #############################################
48/153: lujavrite #############################################
49/153: python3-lxml #############################################
50/153: dola-transformer #############################################
shell-init: error retrieving current directory: getcwd: cannot access parent directories: No such file or directory
shell-init: error retrieving current directory: getcwd: cannot access parent directories: No such file or directory
shell-init: error retrieving current directory: getcwd: cannot access parent directories: No such file or directory
shell-init: error retrieving current directory: getcwd: cannot access parent directories: No such file or directory
shell-init: error retrieving current directory: getcwd: cannot access parent directories: No such file or directory
shell-init: error retrieving current directory: getcwd: cannot access parent directories: No such file or directory
shell-init: error retrieving current directory: getcwd: cannot access parent directories: No such file or directory
shell-init: error retrieving current directory: getcwd: cannot access parent directories: No such file or directory
shell-init: error retrieving current directory: getcwd: cannot access parent directories: No such file or directory
retrieving rpm files from medium "core_release"...
http://repository.mageia.org/distrib/cauldron/x86_64/media/core/release/slf4j-1.7.36-3.mga11.noarch.rpm
0% of 0 completed, ETA = --:--:--, speed = 0
100% of 69687 completed, ETA = --:--:--, speed = 33.2M
http://repository.mageia.org/distrib/cauldron/x86_64/media/core/release/jakarta-annotations-1.3.5-19.mga11.noarch.rpm
0% of 0 completed, ETA = --:--:--, speed = 0
100% of 44469 completed, ETA = --:--:--, speed = 42.4M
http://repository.mageia.org/distrib/cauldron/x86_64/media/core/release/maven-resolver-1.9.27-1.mga11.noarch.rpm
0% of 0 completed, ETA = --:--:--, speed = 0
100% of 745k completed, ETA = --:--:--, speed = 121M
http://repository.mageia.org/distrib/cauldron/x86_64/media/core/release/mockito-5.8.0-3.mga11.noarch.rpm
0% of 0 completed, ETA = --:--:--, speed = 0
100% of 590k completed, ETA = --:--:--, speed = 115M
http://repository.mageia.org/distrib/cauldron/x86_64/media/core/release/maven4-4.0.0~rc.4-1.mga11.noarch.rpm
0% of 0 completed, ETA = --:--:--, speed = 0
100% of 18856 completed, ETA = --:--:--, speed = 17.9M
http://repository.mageia.org/distrib/cauldron/x86_64/media/core/release/google-guice-5.1.0-4.mga11.noarch.rpm
0% of 0 completed, ETA = --:--:--, speed = 0
100% of 602k completed, ETA = --:--:--, speed = 32.6M
http://repository.mageia.org/distrib/cauldron/x86_64/media/core/release/httpcomponents-client-4.5.14-3.mga11.noarch.rpm
0% of 0 completed, ETA = --:--:--, speed = 0
100% of 654k completed, ETA = --:--:--, speed = 106M
http://repository.mageia.org/distrib/cauldron/x86_64/media/core/release/plexus-utils4-4.0.2-1.mga11.noarch.rpm
0% of 0 completed, ETA = --:--:--, speed = 0
100% of 185k completed, ETA = --:--:--, speed = 181M
http://repository.mageia.org/distrib/cauldron/x86_64/media/core/release/maven-file-management-3.2.0-1.mga11.noarch.rpm
0% of 0 completed, ETA = --:--:--, speed = 0
100% of 31044 completed, ETA = --:--:--, speed = 29.6M
http://repository.mageia.org/distrib/cauldron/x86_64/media/core/release/objenesis-3.5-1.mga11.noarch.rpm
0% of 0 completed, ETA = --:--:--, speed = 0
100% of 107k completed, ETA = --:--:--, speed = 105M
http://repository.mageia.org/distrib/cauldron/x86_64/media/core/release/maven-shared-utils-3.4.2-3.mga11.noarch.rpm
0% of 0 completed, ETA = --:--:--, speed = 0
100% of 142k completed, ETA = --:--:--, speed = 139M
http://repository.mageia.org/distrib/cauldron/x86_64/media/core/release/maven-resolver2-2.0.9-1.mga11.noarch.rpm
0% of 0 completed, ETA = --:--:--, speed = 0
100% of 935k completed, ETA = --:--:--, speed = 114M
http://repository.mageia.org/distrib/cauldron/x86_64/media/core/release/plexus-utils-3.6.1-2.mga11.noarch.rpm
0% of 0 completed, ETA = --:--:--, speed = 0
100% of 260k completed, ETA = --:--:--, speed = 11.0M
http://repository.mageia.org/distrib/cauldron/x86_64/media/core/release/google-gson-2.12.1-1.mga11.noarch.rpm
0% of 0 completed, ETA = --:--:--, speed = 0
100% of 305k completed, ETA = --:--:--, speed = 99.5M
http://repository.mageia.org/distrib/cauldron/x86_64/media/core/release/woodstox-core-7.1.0-1.mga11.noarch.rpm
0% of 0 completed, ETA = --:--:--, speed = 0
100% of 488k completed, ETA = --:--:--, speed = 119M
http://repository.mageia.org/distrib/cauldron/x86_64/media/core/release/maven4-openjdk25-4.0.0~rc.4-1.mga11.noarch.rpm
0% of 0 completed, ETA = --:--:--, speed = 0
100% of 7161 completed, ETA = --:--:--, speed = 6993k
http://repository.mageia.org/distrib/cauldron/x86_64/media/core/release/plexus-classworlds-2.12.0-1.mga11.noarch.rpm
0% of 0 completed, ETA = --:--:--, speed = 0
100% of 60915 completed, ETA = --:--:--, speed = 58.0M
http://repository.mageia.org/distrib/cauldron/x86_64/media/core/release/slf4j2-2.0.17-1.mga11.noarch.rpm
0% of 0 completed, ETA = --:--:--, speed = 0
100% of 93131 completed, ETA = --:--:--, speed = 88.8M
http://repository.mageia.org/distrib/cauldron/x86_64/media/core/release/plexus-interactivity-1.3-1.mga11.noarch.rpm
0% of 0 completed, ETA = --:--:--, speed = 0
100% of 17245 completed, ETA = --:--:--, speed = 16.4M
http://repository.mageia.org/distrib/cauldron/x86_64/media/core/release/junit-4.13.2-6.mga11.noarch.rpm
0% of 0 completed, ETA = --:--:--, speed = 0
100% of 344k completed, ETA = --:--:--, speed = 112M
http://repository.mageia.org/distrib/cauldron/x86_64/media/core/release/byte-buddy-agent-1.18.7-1.mga11.noarch.rpm
0% of 0 completed, ETA = --:--:--, speed = 0
100% of 216k completed, ETA = --:--:--, speed = 105M
http://repository.mageia.org/distrib/cauldron/x86_64/media/core/release/jdom2-2.0.6.1-4.mga11.noarch.rpm
0% of 0 completed, ETA = --:--:--, speed = 0
100% of 311k completed, ETA = --:--:--, speed = 101M
http://repository.mageia.org/distrib/cauldron/x86_64/media/core/release/objectweb-asm-9.10.1-1.mga11.noarch.rpm
0% of 0 completed, ETA = --:--:--, speed = 0
100% of 363k completed, ETA = --:--:--, speed = 118M
http://repository.mageia.org/distrib/cauldron/x86_64/media/core/release/jcl-over-slf4j-1.7.36-3.mga11.noarch.rpm
0% of 0 completed, ETA = --:--:--, speed = 0
100% of 22901 completed, ETA = --:--:--, speed = 21.8M
http://repository.mageia.org/distrib/cauldron/x86_64/media/core/release/byte-buddy-1.18.7-1.mga11.noarch.rpm
0% of 0 completed, ETA = --:--:--, speed = 0
100% of 3502k completed, ETA = --:--:--, speed = 114M
http://repository.mageia.org/distrib/cauldron/x86_64/media/core/release/httpcomponents-core-4.4.16-4.mga11.noarch.rpm
0% of 0 completed, ETA = --:--:--, speed = 0
100% of 631k completed, ETA = --:--:--, speed = 123M
http://repository.mageia.org/distrib/cauldron/x86_64/media/core/release/sisu-1.0.0-2.mga11.noarch.rpm
0% of 0 completed, ETA = --:--:--, speed = 0
100% of 453k completed, ETA = --:--:--, speed = 29.4M
http://repository.mageia.org/distrib/cauldron/x86_64/media/core/release/jakarta-inject1.0-1.0.5-4.mga11.noarch.rpm
0% of 0 completed, ETA = --:--:--, speed = 0
100% of 22407 completed, ETA = --:--:--, speed = 21.3M
http://repository.mageia.org/distrib/cauldron/x86_64/media/core/release/maven-wagon-3.5.3-3.mga11.noarch.rpm
0% of 0 completed, ETA = --:--:--, speed = 0
100% of 100k completed, ETA = --:--:--, speed = 98.1M
http://repository.mageia.org/distrib/cauldron/x86_64/media/core/release/apache-commons-io-2.20.0-1.mga11.noarch.rpm
0% of 0 completed, ETA = --:--:--, speed = 0
100% of 523k completed, ETA = --:--:--, speed = 127M
http://repository.mageia.org/distrib/cauldron/x86_64/media/core/release/aopalliance-1.0-22.mga11.noarch.rpm
0% of 0 completed, ETA = --:--:--, speed = 0
100% of 14349 completed, ETA = --:--:--, speed = 13.6M
http://repository.mageia.org/distrib/cauldron/x86_64/media/core/release/plexus-containers-component-annotations-2.2.0-4.mga11.noarch.rpm
0% of 0 completed, ETA = --:--:--, speed = 0
100% of 15901 completed, ETA = --:--:--, speed = 15.1M
http://repository.mageia.org/distrib/cauldron/x86_64/media/core/release/plexus-xml-4.0.4-2.mga11.noarch.rpm
0% of 0 completed, ETA = --:--:--, speed = 0
100% of 98767 completed, ETA = --:--:--, speed = 94.1M
http://repository.mageia.org/distrib/cauldron/x86_64/media/core/release/jline-3.30.4-1.mga11.x86_64.rpm
0% of 0 completed, ETA = --:--:--, speed = 0
100% of 1120k completed, ETA = --:--:--, speed = 109M
http://repository.mageia.org/distrib/cauldron/x86_64/media/core/release/stax2-api-4.3.0-1.mga11.noarch.rpm
0% of 0 completed, ETA = --:--:--, speed = 0
100% of 178k completed, ETA = --:--:--, speed = 174M
http://repository.mageia.org/distrib/cauldron/x86_64/media/core/release/guava-33.5.0-1.mga11.noarch.rpm
0% of 0 completed, ETA = --:--:--, speed = 0
100% of 2495k completed, ETA = --:--:--, speed = 110M
http://repository.mageia.org/distrib/cauldron/x86_64/media/core/release/plexus-cipher-2.0-5.mga11.noarch.rpm
0% of 0 completed, ETA = --:--:--, speed = 0
100% of 25028 completed, ETA = --:--:--, speed = 23.8M
http://repository.mageia.org/distrib/cauldron/x86_64/media/core/release/plexus-sec-dispatcher4-4.1.0-1.mga11.noarch.rpm
0% of 0 completed, ETA = --:--:--, speed = 0
100% of 81478 completed, ETA = --:--:--, speed = 77.7M
http://repository.mageia.org/distrib/cauldron/x86_64/media/core/release/jsr-305-3.0.2-5.mga11.noarch.rpm
0% of 0 completed, ETA = --:--:--, speed = 0
100% of 34468 completed, ETA = --:--:--, speed = 32.8M
http://repository.mageia.org/distrib/cauldron/x86_64/media/core/release/build-helper-maven-plugin-3.6.1-1.mga11.noarch.rpm
0% of 0 completed, ETA = --:--:--, speed = 0
100% of 68581 completed, ETA = --:--:--, speed = 7441k
http://repository.mageia.org/distrib/cauldron/x86_64/media/core/release/jansi-2.4.3-1.mga11.x86_64.rpm
0% of 0 completed, ETA = --:--:--, speed = 0
100% of 115k completed, ETA = --:--:--, speed = 112M
http://repository.mageia.org/distrib/cauldron/x86_64/media/core/release/apache-commons-cli-1.10.0-1.mga11.noarch.rpm
0% of 0 completed, ETA = --:--:--, speed = 0
100% of 119k completed, ETA = --:--:--, speed = 116M
http://repository.mageia.org/distrib/cauldron/x86_64/media/core/release/maven4-lib-4.0.0~rc.4-1.mga11.noarch.rpm
0% of 0 completed, ETA = --:--:--, speed = 0
100% of 16.1M completed, ETA = --:--:--, speed = 112M
http://repository.mageia.org/distrib/cauldron/x86_64/media/core/release/maven-lib-3.9.11-4.mga11.noarch.rpm
0% of 0 completed, ETA = --:--:--, speed = 0
100% of 9871k completed, ETA = --:--:--, speed = 112M
http://repository.mageia.org/distrib/cauldron/x86_64/media/core/release/jcl-over-slf4j2-2.0.17-1.mga11.noarch.rpm
0% of 0 completed, ETA = --:--:--, speed = 0
100% of 23983 completed, ETA = --:--:--, speed = 22.8M
http://repository.mageia.org/distrib/cauldron/x86_64/media/core/release/plexus-sec-dispatcher-2.0-6.mga11.noarch.rpm
0% of 0 completed, ETA = --:--:--, speed = 0
100% of 32777 completed, ETA = --:--:--, speed = 31.2M
http://repository.mageia.org/distrib/cauldron/x86_64/media/core/release/opentest4j-1.3.0-4.mga11.noarch.rpm
0% of 0 completed, ETA = --:--:--, speed = 0
100% of 25525 completed, ETA = --:--:--, speed = 24.3M
http://repository.mageia.org/distrib/cauldron/x86_64/media/core/release/plexus-interpolation-1.28-1.mga11.noarch.rpm
0% of 0 completed, ETA = --:--:--, speed = 0
100% of 81333 completed, ETA = --:--:--, speed = 77.5M
http://repository.mageia.org/distrib/cauldron/x86_64/media/core/release/javapackages-tools-6.5.1-8.mga11.noarch.rpm
0% of 0 completed, ETA = --:--:--, speed = 0
100% of 34337 completed, ETA = --:--:--, speed = 32.7M
http://repository.mageia.org/distrib/cauldron/x86_64/media/core/release/hamcrest-3.0-1.mga11.noarch.rpm
0% of 0 completed, ETA = --:--:--, speed = 0
100% of 119k completed, ETA = --:--:--, speed = 116M
retrieved slf4j-1.7.36-3.mga11.noarch.rpm jakarta-annotations-1.3.5-19.mga11.noarch.rpm maven-resolver-1.9.27-1.mga11.noarch.rpm mockito-5.8.0-3.mga11.noarch.rpm maven4-4.0.0~rc.4-1.mga11.noarch.rpm google-guice-5.1.0-4.mga11.noarch.rpm httpcomponents-client-4.5.14-3.mga11.noarch.rpm plexus-utils4-4.0.2-1.mga11.noarch.rpm maven-file-management-3.2.0-1.mga11.noarch.rpm objenesis-3.5-1.mga11.noarch.rpm maven-shared-utils-3.4.2-3.mga11.noarch.rpm maven-resolver2-2.0.9-1.mga11.noarch.rpm plexus-utils-3.6.1-2.mga11.noarch.rpm google-gson-2.12.1-1.mga11.noarch.rpm woodstox-core-7.1.0-1.mga11.noarch.rpm maven4-openjdk25-4.0.0~rc.4-1.mga11.noarch.rpm plexus-classworlds-2.12.0-1.mga11.noarch.rpm slf4j2-2.0.17-1.mga11.noarch.rpm plexus-interactivity-1.3-1.mga11.noarch.rpm junit-4.13.2-6.mga11.noarch.rpm byte-buddy-agent-1.18.7-1.mga11.noarch.rpm jdom2-2.0.6.1-4.mga11.noarch.rpm objectweb-asm-9.10.1-1.mga11.noarch.rpm jcl-over-slf4j-1.7.36-3.mga11.noarch.rpm byte-buddy-1.18.7-1.mga11.noarch.rpm httpcomponents-core-4.4.16-4.mga11.noarch.rpm sisu-1.0.0-2.mga11.noarch.rpm jakarta-inject1.0-1.0.5-4.mga11.noarch.rpm maven-wagon-3.5.3-3.mga11.noarch.rpm apache-commons-io-2.20.0-1.mga11.noarch.rpm aopalliance-1.0-22.mga11.noarch.rpm plexus-containers-component-annotations-2.2.0-4.mga11.noarch.rpm plexus-xml-4.0.4-2.mga11.noarch.rpm jline-3.30.4-1.mga11.x86_64.rpm stax2-api-4.3.0-1.mga11.noarch.rpm guava-33.5.0-1.mga11.noarch.rpm plexus-cipher-2.0-5.mga11.noarch.rpm plexus-sec-dispatcher4-4.1.0-1.mga11.noarch.rpm jsr-305-3.0.2-5.mga11.noarch.rpm build-helper-maven-plugin-3.6.1-1.mga11.noarch.rpm jansi-2.4.3-1.mga11.x86_64.rpm apache-commons-cli-1.10.0-1.mga11.noarch.rpm maven4-lib-4.0.0~rc.4-1.mga11.noarch.rpm maven-lib-3.9.11-4.mga11.noarch.rpm jcl-over-slf4j2-2.0.17-1.mga11.noarch.rpm plexus-sec-dispatcher-2.0-6.mga11.noarch.rpm opentest4j-1.3.0-4.mga11.noarch.rpm plexus-interpolation-1.28-1.mga11.noarch.rpm javapackages-tools-6.5.1-8.mga11.noarch.rpm hamcrest-3.0-1.mga11.noarch.rpm
...retrieving done
installing plexus-sec-dispatcher4-4.1.0-1.mga11.noarch.rpm jsr-305-3.0.2-5.mga11.noarch.rpm plexus-cipher-2.0-5.mga11.noarch.rpm jansi-2.4.3-1.mga11.x86_64.rpm apache-commons-cli-1.10.0-1.mga11.noarch.rpm build-helper-maven-plugin-3.6.1-1.mga11.noarch.rpm maven-lib-3.9.11-4.mga11.noarch.rpm jcl-over-slf4j2-2.0.17-1.mga11.noarch.rpm plexus-sec-dispatcher-2.0-6.mga11.noarch.rpm opentest4j-1.3.0-4.mga11.noarch.rpm maven4-lib-4.0.0~rc.4-1.mga11.noarch.rpm javapackages-tools-6.5.1-8.mga11.noarch.rpm hamcrest-3.0-1.mga11.noarch.rpm plexus-interpolation-1.28-1.mga11.noarch.rpm byte-buddy-1.18.7-1.mga11.noarch.rpm httpcomponents-core-4.4.16-4.mga11.noarch.rpm sisu-1.0.0-2.mga11.noarch.rpm jakarta-inject1.0-1.0.5-4.mga11.noarch.rpm maven-wagon-3.5.3-3.mga11.noarch.rpm apache-commons-io-2.20.0-1.mga11.noarch.rpm aopalliance-1.0-22.mga11.noarch.rpm plexus-containers-component-annotations-2.2.0-4.mga11.noarch.rpm plexus-xml-4.0.4-2.mga11.noarch.rpm jline-3.30.4-1.mga11.x86_64.rpm guava-33.5.0-1.mga11.noarch.rpm stax2-api-4.3.0-1.mga11.noarch.rpm plexus-classworlds-2.12.0-1.mga11.noarch.rpm slf4j2-2.0.17-1.mga11.noarch.rpm plexus-interactivity-1.3-1.mga11.noarch.rpm junit-4.13.2-6.mga11.noarch.rpm byte-buddy-agent-1.18.7-1.mga11.noarch.rpm objectweb-asm-9.10.1-1.mga11.noarch.rpm jdom2-2.0.6.1-4.mga11.noarch.rpm jcl-over-slf4j-1.7.36-3.mga11.noarch.rpm jakarta-annotations-1.3.5-19.mga11.noarch.rpm maven-resolver-1.9.27-1.mga11.noarch.rpm slf4j-1.7.36-3.mga11.noarch.rpm httpcomponents-client-4.5.14-3.mga11.noarch.rpm plexus-utils4-4.0.2-1.mga11.noarch.rpm maven4-4.0.0~rc.4-1.mga11.noarch.rpm mockito-5.8.0-3.mga11.noarch.rpm google-guice-5.1.0-4.mga11.noarch.rpm objenesis-3.5-1.mga11.noarch.rpm maven-shared-utils-3.4.2-3.mga11.noarch.rpm maven-resolver2-2.0.9-1.mga11.noarch.rpm maven-file-management-3.2.0-1.mga11.noarch.rpm google-gson-2.12.1-1.mga11.noarch.rpm woodstox-core-7.1.0-1.mga11.noarch.rpm maven4-openjdk25-4.0.0~rc.4-1.mga11.noarch.rpm plexus-utils-3.6.1-2.mga11.noarch.rpm from /home/iurt/chroot_tmp/iurt/chroot_cauldron.x86_64.0.20261005140203/var/cache/urpmi/rpms
starting installing packages
created transaction for installing on /home/iurt/chroot_tmp/iurt/chroot_cauldron.x86_64.0.20261005140203 (remove=0, install=0, upgrade=50)
Preparing... #############################################
51/153: slf4j #############################################
52/153: jakarta-inject1.0 #############################################
53/153: httpcomponents-core #############################################
54/153: httpcomponents-client #############################################
55/153: maven-wagon #############################################
56/153: objectweb-asm #############################################
57/153: slf4j2 #############################################
58/153: plexus-utils4 #############################################
59/153: jakarta-annotations #############################################
60/153: google-gson #############################################
61/153: plexus-classworlds #############################################
62/153: guava #############################################
63/153: plexus-containers-component-annotations
#############################################
64/153: sisu #############################################
65/153: jcl-over-slf4j2 #############################################
66/153: plexus-cipher #############################################
67/153: plexus-utils #############################################
68/153: stax2-api #############################################
69/153: aopalliance #############################################
70/153: apache-commons-io #############################################
71/153: plexus-interpolation #############################################
72/153: apache-commons-cli #############################################
73/153: maven-shared-utils #############################################
74/153: maven-file-management #############################################
75/153: woodstox-core #############################################
76/153: plexus-sec-dispatcher #############################################
77/153: plexus-sec-dispatcher4
#############################################
78/153: byte-buddy #############################################
79/153: jcl-over-slf4j #############################################
80/153: objenesis #############################################
81/153: jdom2 #############################################
82/153: byte-buddy-agent #############################################
83/153: plexus-interactivity #############################################
84/153: jline #############################################
85/153: hamcrest #############################################
86/153: junit #############################################
87/153: javapackages-tools #############################################
88/153: maven4-openjdk25 #############################################
89/153: opentest4j #############################################
90/153: mockito #############################################
91/153: jansi #############################################
92/153: jsr-305 #############################################
93/153: google-guice #############################################
94/153: plexus-xml #############################################
95/153: maven-resolver2 #############################################
96/153: maven4-lib #############################################
97/153: maven-resolver #############################################
98/153: maven-lib #############################################
99/153: maven4 #############################################
shell-init: error retrieving current directory: getcwd: cannot access parent directories: No such file or directory
100/153: build-helper-maven-plugin
#############################################
shell-init: error retrieving current directory: getcwd: cannot access parent directories: No such file or directory
shell-init: error retrieving current directory: getcwd: cannot access parent directories: No such file or directory
retrieving rpm files from medium "core_release"...
http://repository.mageia.org/distrib/cauldron/x86_64/media/core/release/xmvn-generator-2.1.1-1.mga11.noarch.rpm
0% of 0 completed, ETA = --:--:--, speed = 0
100% of 61209 completed, ETA = --:--:--, speed = 29.1M
http://repository.mageia.org/distrib/cauldron/x86_64/media/core/release/maven-plugin-annotations-3.9.0-3.mga11.noarch.rpm
0% of 0 completed, ETA = --:--:--, speed = 0
100% of 20224 completed, ETA = --:--:--, speed = 19.2M
http://repository.mageia.org/distrib/cauldron/x86_64/media/core/release/maven-local-openjdk25-6.5.1-8.mga11.noarch.rpm
0% of 0 completed, ETA = --:--:--, speed = 0
100% of 7745 completed, ETA = --:--:--, speed = 7563k
http://repository.mageia.org/distrib/cauldron/x86_64/media/core/release/xmvn-tools-4.3.0-2.mga11.noarch.rpm
0% of 0 completed, ETA = --:--:--, speed = 0
100% of 110k completed, ETA = --:--:--, speed = 108M
http://repository.mageia.org/distrib/cauldron/x86_64/media/core/release/maven-jar-plugin-3.3.0-3.mga11.noarch.rpm
0% of 0 completed, ETA = --:--:--, speed = 0
100% of 28239 completed, ETA = --:--:--, speed = 26.9M
http://repository.mageia.org/distrib/cauldron/x86_64/media/core/release/xmvn5-minimal-5.1.0-1.mga11.noarch.rpm
0% of 0 completed, ETA = --:--:--, speed = 0
100% of 12.5M completed, ETA = --:--:--, speed = 111M
http://repository.mageia.org/distrib/cauldron/x86_64/media/core/release/qdox-2.2.0-1.mga11.noarch.rpm
0% of 0 completed, ETA = --:--:--, speed = 0
100% of 310k completed, ETA = --:--:--, speed = 100M
http://repository.mageia.org/distrib/cauldron/x86_64/media/core/release/maven-shared-incremental-1.1-30.mga11.noarch.rpm
0% of 0 completed, ETA = --:--:--, speed = 0
100% of 20339 completed, ETA = --:--:--, speed = 19.3M
http://repository.mageia.org/distrib/cauldron/x86_64/media/core/release/maven-openjdk25-3.9.11-4.mga11.noarch.rpm
0% of 0 completed, ETA = --:--:--, speed = 0
100% of 7537 completed, ETA = --:--:--, speed = 7360k
http://repository.mageia.org/distrib/cauldron/x86_64/media/core/release/maven-surefire-provider-junit-3.2.2-5.mga11.noarch.rpm
0% of 0 completed, ETA = --:--:--, speed = 0
100% of 148k completed, ETA = --:--:--, speed = 145M
http://repository.mageia.org/distrib/cauldron/x86_64/media/core/release/exec-maven-plugin-3.6.3-1.mga11.noarch.rpm
0% of 0 completed, ETA = --:--:--, speed = 0
100% of 96701 completed, ETA = --:--:--, speed = 6295k
http://repository.mageia.org/distrib/cauldron/x86_64/media/core/release/maven-surefire-provider-testng-3.2.2-5.mga11.noarch.rpm
0% of 0 completed, ETA = --:--:--, speed = 0
100% of 56007 completed, ETA = --:--:--, speed = 53.4M
http://repository.mageia.org/distrib/cauldron/x86_64/media/core/release/beust-jcommander-1.82-4.mga11.noarch.rpm
0% of 0 completed, ETA = --:--:--, speed = 0
100% of 89893 completed, ETA = --:--:--, speed = 85.7M
http://repository.mageia.org/distrib/cauldron/x86_64/media/core/release/javapackages-common-6.5.1-8.mga11.noarch.rpm
0% of 0 completed, ETA = --:--:--, speed = 0
100% of 58383 completed, ETA = --:--:--, speed = 55.6M
http://repository.mageia.org/distrib/cauldron/x86_64/media/core/release/picocli-4.7.7-1.mga11.noarch.rpm
0% of 0 completed, ETA = --:--:--, speed = 0
100% of 515k completed, ETA = --:--:--, speed = 125M
http://repository.mageia.org/distrib/cauldron/x86_64/media/core/release/xmvn5-tools-5.1.0-1.mga11.noarch.rpm
0% of 0 completed, ETA = --:--:--, speed = 0
100% of 106k completed, ETA = --:--:--, speed = 104M
http://repository.mageia.org/distrib/cauldron/x86_64/media/core/release/maven-surefire-plugin-3.2.2-5.mga11.noarch.rpm
0% of 0 completed, ETA = --:--:--, speed = 0
100% of 45179 completed, ETA = --:--:--, speed = 43.0M
http://repository.mageia.org/distrib/cauldron/x86_64/media/core/release/maven-surefire-provider-junit5-3.2.2-5.mga11.noarch.rpm
0% of 0 completed, ETA = --:--:--, speed = 0
100% of 34044 completed, ETA = --:--:--, speed = 32.4M
http://repository.mageia.org/distrib/cauldron/x86_64/media/core/release/xmvn-mojo-4.3.0-2.mga11.noarch.rpm
0% of 0 completed, ETA = --:--:--, speed = 0
100% of 46413 completed, ETA = --:--:--, speed = 44.2M
http://repository.mageia.org/distrib/cauldron/x86_64/media/core/release/assertj-core-3.26.3-1.mga11.noarch.rpm
0% of 0 completed, ETA = --:--:--, speed = 0
100% of 1279k completed, ETA = --:--:--, speed = 113M
http://repository.mageia.org/distrib/cauldron/x86_64/media/core/release/xz-java-1.12-1.mga11.noarch.rpm
0% of 0 completed, ETA = --:--:--, speed = 0
100% of 158k completed, ETA = --:--:--, speed = 154M
http://repository.mageia.org/distrib/cauldron/x86_64/media/core/release/python3-javapackages-6.5.1-8.mga11.noarch.rpm
0% of 0 completed, ETA = --:--:--, speed = 0
100% of 88518 completed, ETA = --:--:--, speed = 10.5M
http://repository.mageia.org/distrib/cauldron/x86_64/media/core/release/plexus-archiver-4.12.0-1.mga11.noarch.rpm
0% of 0 completed, ETA = --:--:--, speed = 0
100% of 188k completed, ETA = --:--:--, speed = 92.2M
http://repository.mageia.org/distrib/cauldron/x86_64/media/core/release/xmvn5-mojo-5.1.0-1.mga11.noarch.rpm
0% of 0 completed, ETA = --:--:--, speed = 0
100% of 18888 completed, ETA = --:--:--, speed = 18.0M
http://repository.mageia.org/distrib/cauldron/x86_64/media/core/release/ant-1.10.15-8.mga11.noarch.rpm
0% of 0 completed, ETA = --:--:--, speed = 0
100% of 168k completed, ETA = --:--:--, speed = 164M
http://repository.mageia.org/distrib/cauldron/x86_64/media/core/release/maven-common-artifact-filters-3.4.0-2.mga11.noarch.rpm
0% of 0 completed, ETA = --:--:--, speed = 0
100% of 57070 completed, ETA = --:--:--, speed = 54.4M
http://repository.mageia.org/distrib/cauldron/x86_64/media/core/release/maven-compiler-plugin-3.12.1-3.mga11.noarch.rpm
0% of 0 completed, ETA = --:--:--, speed = 0
100% of 74598 completed, ETA = --:--:--, speed = 71.1M
http://repository.mageia.org/distrib/cauldron/x86_64/media/core/release/maven-resources-plugin-3.3.1-3.mga11.noarch.rpm
0% of 0 completed, ETA = --:--:--, speed = 0
100% of 31601 completed, ETA = --:--:--, speed = 30.1M
http://repository.mageia.org/distrib/cauldron/x86_64/media/core/release/maven-archiver-3.6.2-2.mga11.noarch.rpm
0% of 0 completed, ETA = --:--:--, speed = 0
100% of 35962 completed, ETA = --:--:--, speed = 34.2M
http://repository.mageia.org/distrib/cauldron/x86_64/media/core/release/maven-3.9.11-4.mga11.noarch.rpm
0% of 0 completed, ETA = --:--:--, speed = 0
100% of 16753 completed, ETA = --:--:--, speed = 15.9M
http://repository.mageia.org/distrib/cauldron/x86_64/media/core/release/maven-filtering-3.3.2-1.mga11.noarch.rpm
0% of 0 completed, ETA = --:--:--, speed = 0
100% of 60608 completed, ETA = --:--:--, speed = 57.8M
http://repository.mageia.org/distrib/cauldron/x86_64/media/core/release/plexus-languages-1.5.2-1.mga11.noarch.rpm
0% of 0 completed, ETA = --:--:--, speed = 0
100% of 60242 completed, ETA = --:--:--, speed = 57.4M
http://repository.mageia.org/distrib/cauldron/x86_64/media/core/release/apache-commons-exec-1.6.0-1.mga11.noarch.rpm
0% of 0 completed, ETA = --:--:--, speed = 0
100% of 77025 completed, ETA = --:--:--, speed = 14.6M
http://repository.mageia.org/distrib/cauldron/x86_64/media/core/release/dola-1.3.2-6.mga11.noarch.rpm
0% of 0 completed, ETA = --:--:--, speed = 0
100% of 116k completed, ETA = --:--:--, speed = 113M
http://repository.mageia.org/distrib/cauldron/x86_64/media/core/release/plexus-io-3.5.2-1.mga11.noarch.rpm
0% of 0 completed, ETA = --:--:--, speed = 0
100% of 78233 completed, ETA = --:--:--, speed = 74.6M
http://repository.mageia.org/distrib/cauldron/x86_64/media/core/release/junit5-5.14.4-1.mga11.noarch.rpm
0% of 0 completed, ETA = --:--:--, speed = 0
100% of 1426k completed, ETA = --:--:--, speed = 116M
http://repository.mageia.org/distrib/cauldron/x86_64/media/core/release/apache-commons-compress-1.28.0-2.mga11.noarch.rpm
0% of 0 completed, ETA = --:--:--, speed = 0
100% of 614k completed, ETA = --:--:--, speed = 120M
http://repository.mageia.org/distrib/cauldron/x86_64/media/core/release/xmvn-core-4.3.0-2.mga11.noarch.rpm
0% of 0 completed, ETA = --:--:--, speed = 0
100% of 114k completed, ETA = --:--:--, speed = 111M
http://repository.mageia.org/distrib/cauldron/x86_64/media/core/release/xmvn-minimal-4.3.0-2.mga11.noarch.rpm
0% of 0 completed, ETA = --:--:--, speed = 0
100% of 8406k completed, ETA = --:--:--, speed = 112M
http://repository.mageia.org/distrib/cauldron/x86_64/media/core/release/maven-surefire-3.2.2-5.mga11.noarch.rpm
0% of 0 completed, ETA = --:--:--, speed = 0
100% of 1031k completed, ETA = --:--:--, speed = 111M
http://repository.mageia.org/distrib/cauldron/x86_64/media/core/release/javapackages-local-openjdk25-6.5.1-8.mga11.noarch.rpm
0% of 0 completed, ETA = --:--:--, speed = 0
100% of 8279 completed, ETA = --:--:--, speed = 8084k
http://repository.mageia.org/distrib/cauldron/x86_64/media/core/release/ant-openjdk25-1.10.15-8.mga11.noarch.rpm
0% of 0 completed, ETA = --:--:--, speed = 0
100% of 7756 completed, ETA = --:--:--, speed = 7574k
http://repository.mageia.org/distrib/cauldron/x86_64/media/core/release/xmvn-toolchain-openjdk25-4.3.0-2.mga11.noarch.rpm
0% of 0 completed, ETA = --:--:--, speed = 0
100% of 7366 completed, ETA = --:--:--, speed = 7193k
http://repository.mageia.org/distrib/cauldron/x86_64/media/core/release/ant-lib-1.10.15-8.mga11.noarch.rpm
0% of 0 completed, ETA = --:--:--, speed = 0
100% of 2091k completed, ETA = --:--:--, speed = 70.4M
http://repository.mageia.org/distrib/cauldron/x86_64/media/core/release/kojan-xml-1.0.1-1.mga11.noarch.rpm
0% of 0 completed, ETA = --:--:--, speed = 0
100% of 29751 completed, ETA = --:--:--, speed = 28.3M
http://repository.mageia.org/distrib/cauldron/x86_64/media/core/release/apache-commons-lang3-3.19.0-2.mga11.noarch.rpm
0% of 0 completed, ETA = --:--:--, speed = 0
100% of 666k completed, ETA = --:--:--, speed = 108M
http://repository.mageia.org/distrib/cauldron/x86_64/media/core/release/univocity-parsers-2.9.1-12.mga11.noarch.rpm
0% of 0 completed, ETA = --:--:--, speed = 0
100% of 403k completed, ETA = --:--:--, speed = 131M
http://repository.mageia.org/distrib/cauldron/x86_64/media/core/release/xmvn5-core-5.1.0-1.mga11.noarch.rpm
0% of 0 completed, ETA = --:--:--, speed = 0
100% of 85908 completed, ETA = --:--:--, speed = 81.9M
http://repository.mageia.org/distrib/cauldron/x86_64/media/core/release/plexus-build-api0-0.0.7-43.mga11.noarch.rpm
0% of 0 completed, ETA = --:--:--, speed = 0
100% of 24333 completed, ETA = --:--:--, speed = 3394k
http://repository.mageia.org/distrib/cauldron/x86_64/media/core/release/plexus-compiler-2.16.2-1.mga11.noarch.rpm
0% of 0 completed, ETA = --:--:--, speed = 0
100% of 69269 completed, ETA = --:--:--, speed = 66.0M
retrieved xmvn-generator-2.1.1-1.mga11.noarch.rpm maven-plugin-annotations-3.9.0-3.mga11.noarch.rpm maven-local-openjdk25-6.5.1-8.mga11.noarch.rpm xmvn-tools-4.3.0-2.mga11.noarch.rpm maven-jar-plugin-3.3.0-3.mga11.noarch.rpm xmvn5-minimal-5.1.0-1.mga11.noarch.rpm qdox-2.2.0-1.mga11.noarch.rpm maven-shared-incremental-1.1-30.mga11.noarch.rpm maven-openjdk25-3.9.11-4.mga11.noarch.rpm maven-surefire-provider-junit-3.2.2-5.mga11.noarch.rpm exec-maven-plugin-3.6.3-1.mga11.noarch.rpm maven-surefire-provider-testng-3.2.2-5.mga11.noarch.rpm beust-jcommander-1.82-4.mga11.noarch.rpm javapackages-common-6.5.1-8.mga11.noarch.rpm picocli-4.7.7-1.mga11.noarch.rpm xmvn5-tools-5.1.0-1.mga11.noarch.rpm maven-surefire-plugin-3.2.2-5.mga11.noarch.rpm maven-surefire-provider-junit5-3.2.2-5.mga11.noarch.rpm xmvn-mojo-4.3.0-2.mga11.noarch.rpm assertj-core-3.26.3-1.mga11.noarch.rpm xz-java-1.12-1.mga11.noarch.rpm python3-javapackages-6.5.1-8.mga11.noarch.rpm plexus-archiver-4.12.0-1.mga11.noarch.rpm xmvn5-mojo-5.1.0-1.mga11.noarch.rpm ant-1.10.15-8.mga11.noarch.rpm maven-common-artifact-filters-3.4.0-2.mga11.noarch.rpm maven-compiler-plugin-3.12.1-3.mga11.noarch.rpm maven-resources-plugin-3.3.1-3.mga11.noarch.rpm maven-archiver-3.6.2-2.mga11.noarch.rpm maven-3.9.11-4.mga11.noarch.rpm maven-filtering-3.3.2-1.mga11.noarch.rpm plexus-languages-1.5.2-1.mga11.noarch.rpm apache-commons-exec-1.6.0-1.mga11.noarch.rpm dola-1.3.2-6.mga11.noarch.rpm plexus-io-3.5.2-1.mga11.noarch.rpm junit5-5.14.4-1.mga11.noarch.rpm apache-commons-compress-1.28.0-2.mga11.noarch.rpm xmvn-core-4.3.0-2.mga11.noarch.rpm xmvn-minimal-4.3.0-2.mga11.noarch.rpm maven-surefire-3.2.2-5.mga11.noarch.rpm javapackages-local-openjdk25-6.5.1-8.mga11.noarch.rpm ant-openjdk25-1.10.15-8.mga11.noarch.rpm xmvn-toolchain-openjdk25-4.3.0-2.mga11.noarch.rpm ant-lib-1.10.15-8.mga11.noarch.rpm kojan-xml-1.0.1-1.mga11.noarch.rpm apache-commons-lang3-3.19.0-2.mga11.noarch.rpm univocity-parsers-2.9.1-12.mga11.noarch.rpm xmvn5-core-5.1.0-1.mga11.noarch.rpm plexus-build-api0-0.0.7-43.mga11.noarch.rpm plexus-compiler-2.16.2-1.mga11.noarch.rpm
...retrieving done
installing maven-surefire-provider-testng-3.2.2-5.mga11.noarch.rpm beust-jcommander-1.82-4.mga11.noarch.rpm javapackages-common-6.5.1-8.mga11.noarch.rpm picocli-4.7.7-1.mga11.noarch.rpm xmvn5-tools-5.1.0-1.mga11.noarch.rpm maven-surefire-provider-junit5-3.2.2-5.mga11.noarch.rpm maven-surefire-plugin-3.2.2-5.mga11.noarch.rpm assertj-core-3.26.3-1.mga11.noarch.rpm xmvn-mojo-4.3.0-2.mga11.noarch.rpm python3-javapackages-6.5.1-8.mga11.noarch.rpm xz-java-1.12-1.mga11.noarch.rpm plexus-archiver-4.12.0-1.mga11.noarch.rpm xmvn-generator-2.1.1-1.mga11.noarch.rpm maven-plugin-annotations-3.9.0-3.mga11.noarch.rpm maven-local-openjdk25-6.5.1-8.mga11.noarch.rpm maven-jar-plugin-3.3.0-3.mga11.noarch.rpm xmvn-tools-4.3.0-2.mga11.noarch.rpm xmvn5-minimal-5.1.0-1.mga11.noarch.rpm qdox-2.2.0-1.mga11.noarch.rpm maven-shared-incremental-1.1-30.mga11.noarch.rpm maven-surefire-provider-junit-3.2.2-5.mga11.noarch.rpm maven-openjdk25-3.9.11-4.mga11.noarch.rpm exec-maven-plugin-3.6.3-1.mga11.noarch.rpm xmvn-core-4.3.0-2.mga11.noarch.rpm apache-commons-compress-1.28.0-2.mga11.noarch.rpm maven-surefire-3.2.2-5.mga11.noarch.rpm xmvn-minimal-4.3.0-2.mga11.noarch.rpm javapackages-local-openjdk25-6.5.1-8.mga11.noarch.rpm ant-openjdk25-1.10.15-8.mga11.noarch.rpm xmvn-toolchain-openjdk25-4.3.0-2.mga11.noarch.rpm kojan-xml-1.0.1-1.mga11.noarch.rpm apache-commons-lang3-3.19.0-2.mga11.noarch.rpm ant-lib-1.10.15-8.mga11.noarch.rpm plexus-build-api0-0.0.7-43.mga11.noarch.rpm univocity-parsers-2.9.1-12.mga11.noarch.rpm xmvn5-core-5.1.0-1.mga11.noarch.rpm plexus-compiler-2.16.2-1.mga11.noarch.rpm ant-1.10.15-8.mga11.noarch.rpm xmvn5-mojo-5.1.0-1.mga11.noarch.rpm maven-common-artifact-filters-3.4.0-2.mga11.noarch.rpm maven-resources-plugin-3.3.1-3.mga11.noarch.rpm maven-archiver-3.6.2-2.mga11.noarch.rpm maven-3.9.11-4.mga11.noarch.rpm maven-compiler-plugin-3.12.1-3.mga11.noarch.rpm plexus-languages-1.5.2-1.mga11.noarch.rpm maven-filtering-3.3.2-1.mga11.noarch.rpm apache-commons-exec-1.6.0-1.mga11.noarch.rpm plexus-io-3.5.2-1.mga11.noarch.rpm junit5-5.14.4-1.mga11.noarch.rpm dola-1.3.2-6.mga11.noarch.rpm from /home/iurt/chroot_tmp/iurt/chroot_cauldron.x86_64.0.20261005140203/var/cache/urpmi/rpms
starting installing packages
created transaction for installing on /home/iurt/chroot_tmp/iurt/chroot_cauldron.x86_64.0.20261005140203 (remove=0, install=0, upgrade=50)
Preparing... #############################################
101/153: xmvn-core #############################################
102/153: apache-commons-lang3 #############################################
103/153: apache-commons-compress
#############################################
104/153: kojan-xml #############################################
105/153: xmvn5-core #############################################
106/153: maven #############################################
shell-init: error retrieving current directory: getcwd: cannot access parent directories: No such file or directory
107/153: maven-openjdk25 #############################################
108/153: ant-openjdk25 #############################################
109/153: picocli #############################################
110/153: xmvn5-tools #############################################
111/153: xmvn-minimal #############################################
112/153: xmvn5-minimal #############################################
113/153: xmvn5-mojo #############################################
114/153: dola #############################################
115/153: xmvn-generator #############################################
116/153: xmvn-mojo #############################################
117/153: plexus-io #############################################
118/153: apache-commons-exec #############################################
119/153: maven-common-artifact-filters
#############################################
120/153: plexus-compiler #############################################
121/153: univocity-parsers #############################################
122/153: plexus-build-api0 #############################################
123/153: maven-filtering #############################################
124/153: maven-resources-plugin
#############################################
125/153: ant-lib #############################################
126/153: xmvn-toolchain-openjdk25
#############################################
127/153: maven-shared-incremental
#############################################
128/153: qdox #############################################
129/153: plexus-languages #############################################
130/153: maven-surefire #############################################
131/153: maven-surefire-provider-testng
#############################################
132/153: maven-surefire-provider-junit
#############################################
133/153: maven-compiler-plugin #############################################
134/153: xz-java #############################################
135/153: plexus-archiver #############################################
136/153: maven-archiver #############################################
137/153: maven-jar-plugin #############################################
138/153: python3-javapackages #############################################
139/153: javapackages-common #############################################
140/153: assertj-core #############################################
141/153: junit5 #############################################
142/153: maven-surefire-provider-junit5
#############################################
143/153: maven-surefire-plugin #############################################
144/153: beust-jcommander #############################################
145/153: xmvn-tools #############################################
146/153: javapackages-local-openjdk25
#############################################
147/153: maven-local-openjdk25 #############################################
148/153: ant #############################################
149/153: exec-maven-plugin #############################################
150/153: maven-plugin-annotations
#############################################
shell-init: error retrieving current directory: getcwd: cannot access parent directories: No such file or directory
shell-init: error retrieving current directory: getcwd: cannot access parent directories: No such file or directory
retrieving rpm files from medium "core_release"...
http://repository.mageia.org/distrib/cauldron/x86_64/media/core/release/clojure-maven-plugin-1.9.3-1.mga11.noarch.rpm
0% of 0 completed, ETA = --:--:--, speed = 0
100% of 81737 completed, ETA = --:--:--, speed = 38.9M
http://repository.mageia.org/distrib/cauldron/x86_64/media/core/release/clojure-tmp-1.12.4-1.mga11.noarch.rpm
0% of 0 completed, ETA = --:--:--, speed = 0
100% of 3679k completed, ETA = --:--:--, speed = 112M
http://repository.mageia.org/distrib/cauldron/x86_64/media/core/release/clojure-core-specs-alpha-tmp-0.5.81-1.mga11.noarch.rpm
0% of 0 completed, ETA = --:--:--, speed = 0
100% of 20469 completed, ETA = --:--:--, speed = 19.5M
retrieved clojure-maven-plugin-1.9.3-1.mga11.noarch.rpm clojure-tmp-1.12.4-1.mga11.noarch.rpm clojure-core-specs-alpha-tmp-0.5.81-1.mga11.noarch.rpm
...retrieving done
installing clojure-tmp-1.12.4-1.mga11.noarch.rpm clojure-maven-plugin-1.9.3-1.mga11.noarch.rpm clojure-core-specs-alpha-tmp-0.5.81-1.mga11.noarch.rpm from /home/iurt/chroot_tmp/iurt/chroot_cauldron.x86_64.0.20261005140203/var/cache/urpmi/rpms
starting installing packages
created transaction for installing on /home/iurt/chroot_tmp/iurt/chroot_cauldron.x86_64.0.20261005140203 (remove=0, install=0, upgrade=3)
Preparing... #############################################
151/153: clojure-core-specs-alpha-tmp
#############################################
152/153: clojure-maven-plugin #############################################
153/153: clojure-tmp #############################################
D: [iurt_root_command] Success!
__
I: [iurt] [iurt] installation successful
I: [iurt] [iurt] handling dynamic buildrequires
D: [iurt] [iurt] DynamicBuildRequires not required for @2375454:clojure-spec-alpha-0.6.249-1.mga11.src.rpm
D: [iurt] [iurt] Using timeout of 60 seconds.
D: [iurt] [iurt] rpm --root /home/iurt/chroot_tmp/iurt/chroot_cauldron.x86_64.0.20261005140203 -qa | sort
D: [iurt] [iurt] Forking to monitor log size
D: [iurt] [iurt] Command exited with 0.
N: [iurt] [iurt] Building @2375454:clojure-spec-alpha-0.6.249-1.mga11.src.rpm
D: [iurt] [iurt] Using timeout of 36000 seconds.
D: [iurt] [iurt] Forking to monitor log size
D: [iurt] [iurt] /usr/bin/sudo /usr/sbin/iurt_root_command --chroot /home/iurt/chroot_tmp/iurt/chroot_cauldron.x86_64.0.20261005140203 /bin/su - iurt -c "TMP=/home/iurt/tmp/ rpmbuild --target noarch --rebuild /home/iurt/rpmbuild/SRPMS/@2375454:clojure-spec-alpha-0.6.249-1.mga11.src.rpm"
D: [iurt] [iurt] Command exited with 256.
D: [iurt] [iurt] calling callback for build_@2375454:clojure-spec-alpha-0.6.249-1.mga11.src.rpm
E: [iurt] [iurt] ERROR: call_ret=1 kill= err=256 ()
F: [iurt] [iurt] See https://pkgsubmit.mageia.org/queue/build//cauldron/x86_64//log/@2375454:clojure-spec-alpha-0.6.249-1.mga11.src.rpm/
Command failed: /usr/bin/sudo /usr/sbin/iurt_root_command --chroot /home/iurt/chroot_tmp/iurt/chroot_cauldron.x86_64.0.20261005140203 /bin/su - iurt -c "TMP=/home/iurt/tmp/ rpmbuild --target noarch --rebuild /home/iurt/rpmbuild/SRPMS/@2375454:clojure-spec-alpha-0.6.249-1.mga11.src.rpm"
I: [iurt] [iurt] --------------- Command failed, full output follows ---------------
I: [iurt] [iurt] D: [iurt_root_command] chroot
RTNETLINK answers: Invalid argument
RTNETLINK answers: Invalid argument
RTNETLINK answers: Invalid argument
RTNETLINK answers: Invalid argument
RTNETLINK answers: Invalid argument
RTNETLINK answers: Invalid argument
RTNETLINK answers: Invalid argument
RTNETLINK answers: Invalid argument
RTNETLINK answers: Invalid argument
RTNETLINK answers: Invalid argument
RTNETLINK answers: Invalid argument
RTNETLINK answers: Invalid argument
RTNETLINK answers: Invalid argument
RTNETLINK answers: Invalid argument
RTNETLINK answers: Invalid argument
RTNETLINK answers: Invalid argument
RTNETLINK answers: Invalid argument
RTNETLINK answers: Invalid argument
RTNETLINK answers: Invalid argument
RTNETLINK answers: Invalid argument
RTNETLINK answers: Invalid argument
RTNETLINK answers: Invalid argument
RTNETLINK answers: Invalid argument
RTNETLINK answers: Invalid argument
RTNETLINK answers: Invalid argument
RTNETLINK answers: Invalid argument
RTNETLINK answers: Invalid argument
RTNETLINK answers: Invalid argument
RTNETLINK answers: Invalid argument
RTNETLINK answers: Invalid argument
RTNETLINK answers: Invalid argument
RTNETLINK answers: Invalid argument
RTNETLINK answers: Invalid argument
RTNETLINK answers: Invalid argument
RTNETLINK answers: Invalid argument
RTNETLINK answers: Invalid argument
RTNETLINK answers: Invalid argument
RTNETLINK answers: Invalid argument
RTNETLINK answers: Invalid argument
RTNETLINK answers: Invalid argument
RTNETLINK answers: Invalid argument
RTNETLINK answers: Invalid argument
RTNETLINK answers: Invalid argument
RTNETLINK answers: Invalid argument
RTNETLINK answers: Invalid argument
RTNETLINK answers: Invalid argument
RTNETLINK answers: Invalid argument
RTNETLINK answers: Invalid argument
RTNETLINK answers: Invalid argument
RTNETLINK answers: Invalid argument
RTNETLINK answers: Invalid argument
RTNETLINK answers: Invalid argument
RTNETLINK answers: Invalid argument
RTNETLINK answers: Invalid argument
RTNETLINK answers: Invalid argument
RTNETLINK answers: Invalid argument
RTNETLINK answers: Invalid argument
RTNETLINK answers: Invalid argument
RTNETLINK answers: Invalid argument
RTNETLINK answers: Invalid argument
RTNETLINK answers: Invalid argument
RTNETLINK answers: Invalid argument
RTNETLINK answers: Invalid argument
RTNETLINK answers: Invalid argument
RTNETLINK answers: Invalid argument
RTNETLINK answers: Invalid argument
RTNETLINK answers: Invalid argument
RTNETLINK answers: Invalid argument
RTNETLINK answers: Invalid argument
RTNETLINK answers: Invalid argument
RTNETLINK answers: Invalid argument
RTNETLINK answers: Invalid argument
RTNETLINK answers: Invalid argument
RTNETLINK answers: Invalid argument
RTNETLINK answers: Invalid argument
RTNETLINK answers: Invalid argument
RTNETLINK answers: Invalid argument
RTNETLINK answers: Invalid argument
RTNETLINK answers: Invalid argument
RTNETLINK answers: Invalid argument
RTNETLINK answers: Invalid argument
RTNETLINK answers: Invalid argument
RTNETLINK answers: Invalid argument
RTNETLINK answers: Invalid argument
RTNETLINK answers: Invalid argument
RTNETLINK answers: Invalid argument
RTNETLINK answers: Invalid argument
RTNETLINK answers: Invalid argument
RTNETLINK answers: Invalid argument
RTNETLINK answers: Invalid argument
RTNETLINK answers: Invalid argument
RTNETLINK answers: Invalid argument
RTNETLINK answers: Invalid argument
RTNETLINK answers: Invalid argument
RTNETLINK answers: Invalid argument
RTNETLINK answers: Invalid argument
RTNETLINK answers: Invalid argument
RTNETLINK answers: Invalid argument
RTNETLINK answers: Invalid argument
RTNETLINK answers: Invalid argument
RTNETLINK answers: Invalid argument
RTNETLINK answers: Invalid argument
RTNETLINK answers: Invalid argument
RTNETLINK answers: Invalid argument
RTNETLINK answers: Invalid argument
RTNETLINK answers: Invalid argument
RTNETLINK answers: Invalid argument
RTNETLINK answers: Invalid argument
RTNETLINK answers: Invalid argument
RTNETLINK answers: Invalid argument
RTNETLINK answers: Invalid argument
RTNETLINK answers: Invalid argument
RTNETLINK answers: Invalid argument
RTNETLINK answers: Invalid argument
RTNETLINK answers: Invalid argument
RTNETLINK answers: Invalid argument
RTNETLINK answers: Invalid argument
RTNETLINK answers: Invalid argument
RTNETLINK answers: Invalid argument
RTNETLINK answers: Invalid argument
RTNETLINK answers: Invalid argument
RTNETLINK answers: Invalid argument
RTNETLINK answers: Invalid argument
RTNETLINK answers: Invalid argument
RTNETLINK answers: Invalid argument
RTNETLINK answers: Invalid argument
RTNETLINK answers: Invalid argument
RTNETLINK answers: Invalid argument
RTNETLINK answers: Invalid argument
RTNETLINK answers: Invalid argument
RTNETLINK answers: Invalid argument
RTNETLINK answers: Invalid argument
RTNETLINK answers: Invalid argument
RTNETLINK answers: Invalid argument
RTNETLINK answers: Invalid argument
RTNETLINK answers: Invalid argument
RTNETLINK answers: Invalid argument
RTNETLINK answers: Invalid argument
RTNETLINK answers: Invalid argument
RTNETLINK answers: Invalid argument
RTNETLINK answers: Invalid argument
RTNETLINK answers: Invalid argument
RTNETLINK answers: Invalid argument
RTNETLINK answers: Invalid argument
RTNETLINK answers: Invalid argument
RTNETLINK answers: Invalid argument
RTNETLINK answers: Invalid argument
RTNETLINK answers: Invalid argument
RTNETLINK answers: Invalid argument
RTNETLINK answers: Invalid argument
RTNETLINK answers: Invalid argument
RTNETLINK answers: Invalid argument
RTNETLINK answers: Invalid argument
RTNETLINK answers: Invalid argument
RTNETLINK answers: Invalid argument
RTNETLINK answers: Invalid argument
RTNETLINK answers: Invalid argument
RTNETLINK answers: Invalid argument
RTNETLINK answers: Invalid argument
RTNETLINK answers: Invalid argument
RTNETLINK answers: Invalid argument
RTNETLINK answers: Invalid argument
RTNETLINK answers: Invalid argument
RTNETLINK answers: Invalid argument
RTNETLINK answers: Invalid argument
RTNETLINK answers: Invalid argument
RTNETLINK answers: Invalid argument
RTNETLINK answers: Invalid argument
RTNETLINK answers: Invalid argument
RTNETLINK answers: Invalid argument
RTNETLINK answers: Invalid argument
RTNETLINK answers: Invalid argument
RTNETLINK answers: Invalid argument
RTNETLINK answers: Invalid argument
RTNETLINK answers: Invalid argument
RTNETLINK answers: Invalid argument
RTNETLINK answers: Invalid argument
RTNETLINK answers: Invalid argument
RTNETLINK answers: Invalid argument
RTNETLINK answers: Invalid argument
RTNETLINK answers: Invalid argument
RTNETLINK answers: Invalid argument
RTNETLINK answers: Invalid argument
RTNETLINK answers: Invalid argument
RTNETLINK answers: Invalid argument
RTNETLINK answers: Invalid argument
RTNETLINK answers: Invalid argument
RTNETLINK answers: Invalid argument
RTNETLINK answers: Invalid argument
RTNETLINK answers: Invalid argument
RTNETLINK answers: Invalid argument
RTNETLINK answers: Invalid argument
RTNETLINK answers: Invalid argument
RTNETLINK answers: Invalid argument
RTNETLINK answers: Invalid argument
RTNETLINK answers: Invalid argument
RTNETLINK answers: Invalid argument
RTNETLINK answers: Invalid argument
RTNETLINK answers: Invalid argument
RTNETLINK answers: Invalid argument
RTNETLINK answers: Invalid argument
RTNETLINK answers: Invalid argument
RTNETLINK answers: Invalid argument
RTNETLINK answers: Invalid argument
RTNETLINK answers: Invalid argument
RTNETLINK answers: Invalid argument
RTNETLINK answers: Invalid argument
RTNETLINK answers: Invalid argument
RTNETLINK answers: Invalid argument
RTNETLINK answers: Invalid argument
RTNETLINK answers: Invalid argument
RTNETLINK answers: Invalid argument
RTNETLINK answers: Invalid argument
RTNETLINK answers: Invalid argument
RTNETLINK answers: Invalid argument
RTNETLINK answers: Invalid argument
RTNETLINK answers: Invalid argument
RTNETLINK answers: Invalid argument
RTNETLINK answers: Invalid argument
RTNETLINK answers: Invalid argument
RTNETLINK answers: Invalid argument
RTNETLINK answers: Invalid argument
RTNETLINK answers: Invalid argument
RTNETLINK answers: Invalid argument
RTNETLINK answers: Invalid argument
RTNETLINK answers: Invalid argument
RTNETLINK answers: Invalid argument
RTNETLINK answers: Invalid argument
RTNETLINK answers: Invalid argument
RTNETLINK answers: Invalid argument
RTNETLINK answers: Invalid argument
RTNETLINK answers: Invalid argument
RTNETLINK answers: Invalid argument
RTNETLINK answers: Invalid argument
RTNETLINK answers: Invalid argument
RTNETLINK answers: Invalid argument
RTNETLINK answers: Invalid argument
RTNETLINK answers: Invalid argument
RTNETLINK answers: Invalid argument
RTNETLINK answers: Invalid argument
RTNETLINK answers: Invalid argument
RTNETLINK answers: Invalid argument
RTNETLINK answers: Invalid argument
RTNETLINK answers: Invalid argument
RTNETLINK answers: Invalid argument
RTNETLINK answers: Invalid argument
RTNETLINK answers: Invalid argument
RTNETLINK answers: Invalid argument
RTNETLINK answers: Invalid argument
RTNETLINK answers: Invalid argument
RTNETLINK answers: Invalid argument
RTNETLINK answers: Invalid argument
RTNETLINK answers: Invalid argument
RTNETLINK answers: Invalid argument
RTNETLINK answers: Invalid argument
RTNETLINK answers: Invalid argument
RTNETLINK answers: Invalid argument
RTNETLINK answers: Invalid argument
RTNETLINK answers: Invalid argument
RTNETLINK answers: Invalid argument
RTNETLINK answers: Invalid argument
RTNETLINK answers: Invalid argument
RTNETLINK answers: Invalid argument
RTNETLINK answers: Invalid argument
RTNETLINK answers: Invalid argument
RTNETLINK answers: Invalid argument
RTNETLINK answers: Invalid argument
RTNETLINK answers: Invalid argument
RTNETLINK answers: Invalid argument
RTNETLINK answers: Invalid argument
RTNETLINK answers: Invalid argument
RTNETLINK answers: Invalid argument
RTNETLINK answers: Invalid argument
RTNETLINK answers: Invalid argument
RTNETLINK answers: Invalid argument
RTNETLINK answers: Invalid argument
RTNETLINK answers: Invalid argument
RTNETLINK answers: Invalid argument
RTNETLINK answers: Invalid argument
RTNETLINK answers: Invalid argument
RTNETLINK answers: Invalid argument
RTNETLINK answers: Invalid argument
RTNETLINK answers: Invalid argument
RTNETLINK answers: Invalid argument
RTNETLINK answers: Invalid argument
RTNETLINK answers: Invalid argument
RTNETLINK answers: Invalid argument
RTNETLINK answers: Invalid argument
RTNETLINK answers: Invalid argument
RTNETLINK answers: Invalid argument
RTNETLINK answers: Invalid argument
RTNETLINK answers: Invalid argument
RTNETLINK answers: Invalid argument
RTNETLINK answers: Invalid argument
RTNETLINK answers: Invalid argument
RTNETLINK answers: Invalid argument
RTNETLINK answers: Invalid argument
RTNETLINK answers: Invalid argument
RTNETLINK answers: Invalid argument
RTNETLINK answers: Invalid argument
RTNETLINK answers: Invalid argument
RTNETLINK answers: Invalid argument
RTNETLINK answers: Invalid argument
RTNETLINK answers: Invalid argument
RTNETLINK answers: Invalid argument
RTNETLINK answers: Invalid argument
RTNETLINK answers: Invalid argument
RTNETLINK answers: Invalid argument
RTNETLINK answers: Invalid argument
RTNETLINK answers: Invalid argument
RTNETLINK answers: Invalid argument
RTNETLINK answers: Invalid argument
RTNETLINK answers: Invalid argument
RTNETLINK answers: Invalid argument
RTNETLINK answers: Invalid argument
RTNETLINK answers: Invalid argument
RTNETLINK answers: Invalid argument
RTNETLINK answers: Invalid argument
RTNETLINK answers: Invalid argument
RTNETLINK answers: Invalid argument
RTNETLINK answers: Invalid argument
RTNETLINK answers: Invalid argument
RTNETLINK answers: Invalid argument
RTNETLINK answers: Invalid argument
RTNETLINK answers: Invalid argument
RTNETLINK answers: Invalid argument
RTNETLINK answers: Invalid argument
RTNETLINK answers: Invalid argument
RTNETLINK answers: Invalid argument
RTNETLINK answers: Invalid argument
RTNETLINK answers: Invalid argument
RTNETLINK answers: Invalid argument
RTNETLINK answers: Invalid argument
RTNETLINK answers: Invalid argument
RTNETLINK answers: Invalid argument
RTNETLINK answers: Invalid argument
RTNETLINK answers: Invalid argument
RTNETLINK answers: Invalid argument
RTNETLINK answers: Invalid argument
RTNETLINK answers: Invalid argument
RTNETLINK answers: Invalid argument
RTNETLINK answers: Invalid argument
RTNETLINK answers: Invalid argument
RTNETLINK answers: Invalid argument
RTNETLINK answers: Invalid argument
RTNETLINK answers: Invalid argument
RTNETLINK answers: Invalid argument
RTNETLINK answers: Invalid argument
RTNETLINK answers: Invalid argument
RTNETLINK answers: Invalid argument
RTNETLINK answers: Invalid argument
RTNETLINK answers: Invalid argument
RTNETLINK answers: Invalid argument
RTNETLINK answers: Invalid argument
RTNETLINK answers: Invalid argument
RTNETLINK answers: Invalid argument
RTNETLINK answers: Invalid argument
RTNETLINK answers: Invalid argument
RTNETLINK answers: Invalid argument
RTNETLINK answers: Invalid argument
RTNETLINK answers: Invalid argument
RTNETLINK answers: Invalid argument
RTNETLINK answers: Invalid argument
RTNETLINK answers: Invalid argument
RTNETLINK answers: Invalid argument
RTNETLINK answers: Invalid argument
RTNETLINK answers: Invalid argument
RTNETLINK answers: Invalid argument
RTNETLINK answers: Invalid argument
RTNETLINK answers: Invalid argument
RTNETLINK answers: Invalid argument
RTNETLINK answers: Invalid argument
RTNETLINK answers: Invalid argument
RTNETLINK answers: Invalid argument
RTNETLINK answers: Invalid argument
RTNETLINK answers: Invalid argument
RTNETLINK answers: Invalid argument
RTNETLINK answers: Invalid argument
RTNETLINK answers: Invalid argument
RTNETLINK answers: Invalid argument
RTNETLINK answers: Invalid argument
RTNETLINK answers: Invalid argument
RTNETLINK answers: Invalid argument
RTNETLINK answers: Invalid argument
RTNETLINK answers: Invalid argument
RTNETLINK answers: Invalid argument
RTNETLINK answers: Invalid argument
RTNETLINK answers: Invalid argument
RTNETLINK answers: Invalid argument
RTNETLINK answers: Invalid argument
RTNETLINK answers: Invalid argument
RTNETLINK answers: Invalid argument
RTNETLINK answers: Invalid argument
RTNETLINK answers: Invalid argument
RTNETLINK answers: Invalid argument
RTNETLINK answers: Invalid argument
RTNETLINK answers: Invalid argument
RTNETLINK answers: Invalid argument
RTNETLINK answers: Invalid argument
RTNETLINK answers: Invalid argument
RTNETLINK answers: Invalid argument
RTNETLINK answers: Invalid argument
RTNETLINK answers: Invalid argument
RTNETLINK answers: Invalid argument
RTNETLINK answers: Invalid argument
RTNETLINK answers: Invalid argument
RTNETLINK answers: Invalid argument
RTNETLINK answers: Invalid argument
RTNETLINK answers: Invalid argument
RTNETLINK answers: Invalid argument
RTNETLINK answers: Invalid argument
RTNETLINK answers: Invalid argument
RTNETLINK answers: Invalid argument
RTNETLINK answers: Invalid argument
RTNETLINK answers: Invalid argument
RTNETLINK answers: Invalid argument
RTNETLINK answers: Invalid argument
RTNETLINK answers: Invalid argument
RTNETLINK answers: Invalid argument
RTNETLINK answers: Invalid argument
RTNETLINK answers: Invalid argument
RTNETLINK answers: Invalid argument
RTNETLINK answers: Invalid argument
RTNETLINK answers: Invalid argument
RTNETLINK answers: Invalid argument
RTNETLINK answers: Invalid argument
RTNETLINK answers: Invalid argument
RTNETLINK answers: Invalid argument
RTNETLINK answers: Invalid argument
RTNETLINK answers: Invalid argument
RTNETLINK answers: Invalid argument
RTNETLINK answers: Invalid argument
RTNETLINK answers: Invalid argument
RTNETLINK answers: Invalid argument
RTNETLINK answers: Invalid argument
RTNETLINK answers: Invalid argument
RTNETLINK answers: Invalid argument
RTNETLINK answers: Invalid argument
RTNETLINK answers: Invalid argument
RTNETLINK answers: Invalid argument
RTNETLINK answers: Invalid argument
RTNETLINK answers: Invalid argument
RTNETLINK answers: Invalid argument
RTNETLINK answers: Invalid argument
RTNETLINK answers: Invalid argument
RTNETLINK answers: Invalid argument
RTNETLINK answers: Invalid argument
RTNETLINK answers: Invalid argument
RTNETLINK answers: Invalid argument
RTNETLINK answers: Invalid argument
RTNETLINK answers: Invalid argument
RTNETLINK answers: Invalid argument
RTNETLINK answers: Invalid argument
RTNETLINK answers: Invalid argument
RTNETLINK answers: Invalid argument
RTNETLINK answers: Invalid argument
RTNETLINK answers: Invalid argument
RTNETLINK answers: Invalid argument
RTNETLINK answers: Invalid argument
RTNETLINK answers: Invalid argument
RTNETLINK answers: Invalid argument
RTNETLINK answers: Invalid argument
RTNETLINK answers: Invalid argument
RTNETLINK answers: Invalid argument
RTNETLINK answers: Invalid argument
RTNETLINK answers: Invalid argument
RTNETLINK answers: Invalid argument
RTNETLINK answers: Invalid argument
RTNETLINK answers: Invalid argument
RTNETLINK answers: Invalid argument
RTNETLINK answers: Invalid argument
RTNETLINK answers: Invalid argument
RTNETLINK answers: Invalid argument
RTNETLINK answers: Invalid argument
RTNETLINK answers: Invalid argument
RTNETLINK answers: Invalid argument
RTNETLINK answers: Invalid argument
RTNETLINK answers: Invalid argument
RTNETLINK answers: Invalid argument
RTNETLINK answers: Invalid argument
RTNETLINK answers: Invalid argument
RTNETLINK answers: Invalid argument
RTNETLINK answers: Invalid argument
RTNETLINK answers: Invalid argument
RTNETLINK answers: Invalid argument
RTNETLINK answers: Invalid argument
RTNETLINK answers: Invalid argument
RTNETLINK answers: Invalid argument
RTNETLINK answers: Invalid argument
RTNETLINK answers: Invalid argument
RTNETLINK answers: Invalid argument
RTNETLINK answers: Invalid argument
RTNETLINK answers: Invalid argument
RTNETLINK answers: Invalid argument
RTNETLINK answers: Invalid argument
RTNETLINK answers: Invalid argument
RTNETLINK answers: Invalid argument
RTNETLINK answers: Invalid argument
RTNETLINK answers: Invalid argument
RTNETLINK answers: Invalid argument
RTNETLINK answers: Invalid argument
RTNETLINK answers: Invalid argument
RTNETLINK answers: Invalid argument
RTNETLINK answers: Invalid argument
RTNETLINK answers: Invalid argument
RTNETLINK answers: Invalid argument
RTNETLINK answers: Invalid argument
RTNETLINK answers: Invalid argument
RTNETLINK answers: Invalid argument
RTNETLINK answers: Invalid argument
RTNETLINK answers: Invalid argument
RTNETLINK answers: Invalid argument
RTNETLINK answers: Invalid argument
RTNETLINK answers: Invalid argument
RTNETLINK answers: Invalid argument
RTNETLINK answers: Invalid argument
RTNETLINK answers: Invalid argument
RTNETLINK answers: Invalid argument
RTNETLINK answers: Invalid argument
RTNETLINK answers: Invalid argument
RTNETLINK answers: Invalid argument
RTNETLINK answers: Invalid argument
RTNETLINK answers: Invalid argument
RTNETLINK answers: Invalid argument
RTNETLINK answers: Invalid argument
RTNETLINK answers: Invalid argument
RTNETLINK answers: Invalid argument
RTNETLINK answers: Invalid argument
RTNETLINK answers: Invalid argument
RTNETLINK answers: Invalid argument
RTNETLINK answers: Invalid argument
RTNETLINK answers: Invalid argument
RTNETLINK answers: Invalid argument
RTNETLINK answers: Invalid argument
RTNETLINK answers: Invalid argument
RTNETLINK answers: Invalid argument
RTNETLINK answers: Invalid argument
RTNETLINK answers: Invalid argument
RTNETLINK answers: Invalid argument
RTNETLINK answers: Invalid argument
RTNETLINK answers: Invalid argument
RTNETLINK answers: Invalid argument
RTNETLINK answers: Invalid argument
RTNETLINK answers: Invalid argument
RTNETLINK answers: Invalid argument
RTNETLINK answers: Invalid argument
RTNETLINK answers: Invalid argument
RTNETLINK answers: Invalid argument
RTNETLINK answers: Invalid argument
RTNETLINK answers: Invalid argument
RTNETLINK answers: Invalid argument
RTNETLINK answers: Invalid argument
RTNETLINK answers: Invalid argument
RTNETLINK answers: Invalid argument
RTNETLINK answers: Invalid argument
RTNETLINK answers: Invalid argument
RTNETLINK answers: Invalid argument
RTNETLINK answers: Invalid argument
RTNETLINK answers: Invalid argument
RTNETLINK answers: Invalid argument
RTNETLINK answers: Invalid argument
RTNETLINK answers: Invalid argument
RTNETLINK answers: Invalid argument
RTNETLINK answers: Invalid argument
RTNETLINK answers: Invalid argument
RTNETLINK answers: Invalid argument
RTNETLINK answers: Invalid argument
RTNETLINK answers: Invalid argument
RTNETLINK answers: Invalid argument
RTNETLINK answers: Invalid argument
RTNETLINK answers: Invalid argument
RTNETLINK answers: Invalid argument
RTNETLINK answers: Invalid argument
RTNETLINK answers: Invalid argument
RTNETLINK answers: Invalid argument
RTNETLINK answers: Invalid argument
RTNETLINK answers: Invalid argument
RTNETLINK answers: Invalid argument
RTNETLINK answers: Invalid argument
RTNETLINK answers: Invalid argument
RTNETLINK answers: Invalid argument
RTNETLINK answers: Invalid argument
RTNETLINK answers: Invalid argument
RTNETLINK answers: Invalid argument
RTNETLINK answers: Invalid argument
RTNETLINK answers: Invalid argument
RTNETLINK answers: Invalid argument
RTNETLINK answers: Invalid argument
RTNETLINK answers: Invalid argument
RTNETLINK answers: Invalid argument
RTNETLINK answers: Invalid argument
RTNETLINK answers: Invalid argument
RTNETLINK answers: Invalid argument
RTNETLINK answers: Invalid argument
RTNETLINK answers: Invalid argument
RTNETLINK answers: Invalid argument
RTNETLINK answers: Invalid argument
RTNETLINK answers: Invalid argument
RTNETLINK answers: Invalid argument
RTNETLINK answers: Invalid argument
RTNETLINK answers: Invalid argument
RTNETLINK answers: Invalid argument
RTNETLINK answers: Invalid argument
RTNETLINK answers: Invalid argument
RTNETLINK answers: Invalid argument
RTNETLINK answers: Invalid argument
RTNETLINK answers: Invalid argument
RTNETLINK answers: Invalid argument
RTNETLINK answers: Invalid argument
RTNETLINK answers: Invalid argument
RTNETLINK answers: Invalid argument
RTNETLINK answers: Invalid argument
RTNETLINK answers: Invalid argument
RTNETLINK answers: Invalid argument
RTNETLINK answers: Invalid argument
RTNETLINK answers: Invalid argument
RTNETLINK answers: Invalid argument
RTNETLINK answers: Invalid argument
RTNETLINK answers: Invalid argument
RTNETLINK answers: Invalid argument
RTNETLINK answers: Invalid argument
RTNETLINK answers: Invalid argument
RTNETLINK answers: Invalid argument
RTNETLINK answers: Invalid argument
RTNETLINK answers: Invalid argument
RTNETLINK answers: Invalid argument
RTNETLINK answers: Invalid argument
RTNETLINK answers: Invalid argument
RTNETLINK answers: Invalid argument
RTNETLINK answers: Invalid argument
RTNETLINK answers: Invalid argument
RTNETLINK answers: Invalid argument
RTNETLINK answers: Invalid argument
RTNETLINK answers: Invalid argument
RTNETLINK answers: Invalid argument
RTNETLINK answers: Invalid argument
RTNETLINK answers: Invalid argument
RTNETLINK answers: Invalid argument
RTNETLINK answers: Invalid argument
RTNETLINK answers: Invalid argument
RTNETLINK answers: Invalid argument
RTNETLINK answers: Invalid argument
RTNETLINK answers: Invalid argument
RTNETLINK answers: Invalid argument
RTNETLINK answers: Invalid argument
RTNETLINK answers: Invalid argument
RTNETLINK answers: Invalid argument
RTNETLINK answers: Invalid argument
RTNETLINK answers: Invalid argument
RTNETLINK answers: Invalid argument
RTNETLINK answers: Invalid argument
RTNETLINK answers: Invalid argument
RTNETLINK answers: Invalid argument
RTNETLINK answers: Invalid argument
RTNETLINK answers: Invalid argument
RTNETLINK answers: Invalid argument
RTNETLINK answers: Invalid argument
RTNETLINK answers: Invalid argument
RTNETLINK answers: Invalid argument
RTNETLINK answers: Invalid argument
RTNETLINK answers: Invalid argument
RTNETLINK answers: Invalid argument
RTNETLINK answers: Invalid argument
RTNETLINK answers: Invalid argument
RTNETLINK answers: Invalid argument
RTNETLINK answers: Invalid argument
RTNETLINK answers: Invalid argument
RTNETLINK answers: Invalid argument
RTNETLINK answers: Invalid argument
RTNETLINK answers: Invalid argument
RTNETLINK answers: Invalid argument
RTNETLINK answers: Invalid argument
RTNETLINK answers: Invalid argument
RTNETLINK answers: Invalid argument
RTNETLINK answers: Invalid argument
RTNETLINK answers: Invalid argument
RTNETLINK answers: Invalid argument
RTNETLINK answers: Invalid argument
RTNETLINK answers: Invalid argument
RTNETLINK answers: Invalid argument
RTNETLINK answers: Invalid argument
RTNETLINK answers: Invalid argument
RTNETLINK answers: Invalid argument
RTNETLINK answers: Invalid argument
RTNETLINK answers: Invalid argument
RTNETLINK answers: Invalid argument
RTNETLINK answers: Invalid argument
RTNETLINK answers: Invalid argument
RTNETLINK answers: Invalid argument
RTNETLINK answers: Invalid argument
RTNETLINK answers: Invalid argument
RTNETLINK answers: Invalid argument
RTNETLINK answers: Invalid argument
RTNETLINK answers: Invalid argument
RTNETLINK answers: Invalid argument
RTNETLINK answers: Invalid argument
RTNETLINK answers: Invalid argument
RTNETLINK answers: Invalid argument
RTNETLINK answers: Invalid argument
RTNETLINK answers: Invalid argument
RTNETLINK answers: Invalid argument
RTNETLINK answers: Invalid argument
RTNETLINK answers: Invalid argument
RTNETLINK answers: Invalid argument
RTNETLINK answers: Invalid argument
RTNETLINK answers: Invalid argument
RTNETLINK answers: Invalid argument
RTNETLINK answers: Invalid argument
RTNETLINK answers: Invalid argument
RTNETLINK answers: Invalid argument
RTNETLINK answers: Invalid argument
RTNETLINK answers: Invalid argument
RTNETLINK answers: Invalid argument
RTNETLINK answers: Invalid argument
RTNETLINK answers: Invalid argument
RTNETLINK answers: Invalid argument
RTNETLINK answers: Invalid argument
RTNETLINK answers: Invalid argument
RTNETLINK answers: Invalid argument
RTNETLINK answers: Invalid argument
RTNETLINK answers: Invalid argument
RTNETLINK answers: Invalid argument
RTNETLINK answers: Invalid argument
RTNETLINK answers: Invalid argument
RTNETLINK answers: Invalid argument
RTNETLINK answers: Invalid argument
RTNETLINK answers: Invalid argument
RTNETLINK answers: Invalid argument
RTNETLINK answers: Invalid argument
RTNETLINK answers: Invalid argument
RTNETLINK answers: Invalid argument
RTNETLINK answers: Invalid argument
RTNETLINK answers: Invalid argument
RTNETLINK answers: Invalid argument
RTNETLINK answers: Invalid argument
RTNETLINK answers: Invalid argument
RTNETLINK answers: Invalid argument
RTNETLINK answers: Invalid argument
RTNETLINK answers: Invalid argument
RTNETLINK answers: Invalid argument
RTNETLINK answers: Invalid argument
RTNETLINK answers: Invalid argument
RTNETLINK answers: Invalid argument
RTNETLINK answers: Invalid argument
RTNETLINK answers: Invalid argument
RTNETLINK answers: Invalid argument
RTNETLINK answers: Invalid argument
RTNETLINK answers: Invalid argument
RTNETLINK answers: Invalid argument
RTNETLINK answers: Invalid argument
RTNETLINK answers: Invalid argument
RTNETLINK answers: Invalid argument
RTNETLINK answers: Invalid argument
RTNETLINK answers: Invalid argument
RTNETLINK answers: Invalid argument
RTNETLINK answers: Invalid argument
RTNETLINK answers: Invalid argument
RTNETLINK answers: Invalid argument
RTNETLINK answers: Invalid argument
RTNETLINK answers: Invalid argument
RTNETLINK answers: Invalid argument
RTNETLINK answers: Invalid argument
RTNETLINK answers: Invalid argument
RTNETLINK answers: Invalid argument
RTNETLINK answers: Invalid argument
RTNETLINK answers: Invalid argument
RTNETLINK answers: Invalid argument
RTNETLINK answers: Invalid argument
RTNETLINK answers: Invalid argument
RTNETLINK answers: Invalid argument
RTNETLINK answers: Invalid argument
RTNETLINK answers: Invalid argument
RTNETLINK answers: Invalid argument
RTNETLINK answers: Invalid argument
RTNETLINK answers: Invalid argument
RTNETLINK answers: Invalid argument
RTNETLINK answers: Invalid argument
RTNETLINK answers: Invalid argument
RTNETLINK answers: Invalid argument
RTNETLINK answers: Invalid argument
RTNETLINK answers: Invalid argument
RTNETLINK answers: Invalid argument
RTNETLINK answers: Invalid argument
RTNETLINK answers: Invalid argument
RTNETLINK answers: Invalid argument
RTNETLINK answers: Invalid argument
RTNETLINK answers: Invalid argument
RTNETLINK answers: Invalid argument
RTNETLINK answers: Invalid argument
RTNETLINK answers: Invalid argument
RTNETLINK answers: Invalid argument
RTNETLINK answers: Invalid argument
RTNETLINK answers: Invalid argument
RTNETLINK answers: Invalid argument
RTNETLINK answers: Invalid argument
RTNETLINK answers: Invalid argument
RTNETLINK answers: Invalid argument
RTNETLINK answers: Invalid argument
RTNETLINK answers: Invalid argument
RTNETLINK answers: Invalid argument
RTNETLINK answers: Invalid argument
RTNETLINK answers: Invalid argument
RTNETLINK answers: Invalid argument
RTNETLINK answers: Invalid argument
RTNETLINK answers: Invalid argument
RTNETLINK answers: Invalid argument
RTNETLINK answers: Invalid argument
RTNETLINK answers: Invalid argument
RTNETLINK answers: Invalid argument
RTNETLINK answers: Invalid argument
RTNETLINK answers: Invalid argument
RTNETLINK answers: Invalid argument
RTNETLINK answers: Invalid argument
RTNETLINK answers: Invalid argument
RTNETLINK answers: Invalid argument
RTNETLINK answers: Invalid argument
RTNETLINK answers: Invalid argument
RTNETLINK answers: Invalid argument
RTNETLINK answers: Invalid argument
RTNETLINK answers: Invalid argument
RTNETLINK answers: Invalid argument
RTNETLINK answers: Invalid argument
RTNETLINK answers: Invalid argument
RTNETLINK answers: Invalid argument
RTNETLINK answers: Invalid argument
RTNETLINK answers: Invalid argument
RTNETLINK answers: Invalid argument
RTNETLINK answers: Invalid argument
RTNETLINK answers: Invalid argument
RTNETLINK answers: Invalid argument
RTNETLINK answers: Invalid argument
RTNETLINK answers: Invalid argument
RTNETLINK answers: Invalid argument
RTNETLINK answers: Invalid argument
RTNETLINK answers: Invalid argument
RTNETLINK answers: Invalid argument
RTNETLINK answers: Invalid argument
RTNETLINK answers: Invalid argument
RTNETLINK answers: Invalid argument
RTNETLINK answers: Invalid argument
RTNETLINK answers: Invalid argument
RTNETLINK answers: Invalid argument
RTNETLINK answers: Invalid argument
RTNETLINK answers: Invalid argument
RTNETLINK answers: Invalid argument
RTNETLINK answers: Invalid argument
RTNETLINK answers: Invalid argument
RTNETLINK answers: Invalid argument
RTNETLINK answers: Invalid argument
RTNETLINK answers: Invalid argument
RTNETLINK answers: Invalid argument
RTNETLINK answers: Invalid argument
RTNETLINK answers: Invalid argument
RTNETLINK answers: Invalid argument
RTNETLINK answers: Invalid argument
RTNETLINK answers: Invalid argument
RTNETLINK answers: Invalid argument
RTNETLINK answers: Invalid argument
RTNETLINK answers: Invalid argument
RTNETLINK answers: Invalid argument
RTNETLINK answers: Invalid argument
RTNETLINK answers: Invalid argument
RTNETLINK answers: Invalid argument
RTNETLINK answers: Invalid argument
RTNETLINK answers: Invalid argument
RTNETLINK answers: Invalid argument
RTNETLINK answers: Invalid argument
RTNETLINK answers: Invalid argument
RTNETLINK answers: Invalid argument
RTNETLINK answers: Invalid argument
RTNETLINK answers: Invalid argument
RTNETLINK answers: Invalid argument
RTNETLINK answers: Invalid argument
RTNETLINK answers: Invalid argument
RTNETLINK answers: Invalid argument
RTNETLINK answers: Invalid argument
RTNETLINK answers: Invalid argument
RTNETLINK answers: Invalid argument
RTNETLINK answers: Invalid argument
RTNETLINK answers: Invalid argument
RTNETLINK answers: Invalid argument
RTNETLINK answers: Invalid argument
RTNETLINK answers: Invalid argument
RTNETLINK answers: Invalid argument
RTNETLINK answers: Invalid argument
RTNETLINK answers: Invalid argument
RTNETLINK answers: Invalid argument
RTNETLINK answers: Invalid argument
RTNETLINK answers: Invalid argument
RTNETLINK answers: Invalid argument
RTNETLINK answers: Invalid argument
RTNETLINK answers: Invalid argument
RTNETLINK answers: Invalid argument
RTNETLINK answers: Invalid argument
RTNETLINK answers: Invalid argument
RTNETLINK answers: Invalid argument
RTNETLINK answers: Invalid argument
RTNETLINK answers: Invalid argument
RTNETLINK answers: Invalid argument
RTNETLINK answers: Invalid argument
RTNETLINK answers: Invalid argument
RTNETLINK answers: Invalid argument
RTNETLINK answers: Invalid argument
RTNETLINK answers: Invalid argument
RTNETLINK answers: Invalid argument
RTNETLINK answers: Invalid argument
RTNETLINK answers: Invalid argument
RTNETLINK answers: Invalid argument
RTNETLINK answers: Invalid argument
RTNETLINK answers: Invalid argument
RTNETLINK answers: Invalid argument
RTNETLINK answers: Invalid argument
RTNETLINK answers: Invalid argument
RTNETLINK answers: Invalid argument
RTNETLINK answers: Invalid argument
RTNETLINK answers: Invalid argument
RTNETLINK answers: Invalid argument
RTNETLINK answers: Invalid argument
RTNETLINK answers: Invalid argument
RTNETLINK answers: Invalid argument
RTNETLINK answers: Invalid argument
RTNETLINK answers: Invalid argument
RTNETLINK answers: Invalid argument
RTNETLINK answers: Invalid argument
RTNETLINK answers: Invalid argument
RTNETLINK answers: Invalid argument
RTNETLINK answers: Invalid argument
RTNETLINK answers: Invalid argument
RTNETLINK answers: Invalid argument
RTNETLINK answers: Invalid argument
RTNETLINK answers: Invalid argument
RTNETLINK answers: Invalid argument
RTNETLINK answers: Invalid argument
RTNETLINK answers: Invalid argument
RTNETLINK answers: Invalid argument
RTNETLINK answers: Invalid argument
RTNETLINK answers: Invalid argument
RTNETLINK answers: Invalid argument
RTNETLINK answers: Invalid argument
RTNETLINK answers: Invalid argument
RTNETLINK answers: Invalid argument
RTNETLINK answers: Invalid argument
RTNETLINK answers: Invalid argument
RTNETLINK answers: Invalid argument
RTNETLINK answers: Invalid argument
RTNETLINK answers: Invalid argument
RTNETLINK answers: Invalid argument
RTNETLINK answers: Invalid argument
RTNETLINK answers: Invalid argument
RTNETLINK answers: Invalid argument
RTNETLINK answers: Invalid argument
RTNETLINK answers: Invalid argument
RTNETLINK answers: Invalid argument
RTNETLINK answers: Invalid argument
RTNETLINK answers: Invalid argument
RTNETLINK answers: Invalid argument
RTNETLINK answers: Invalid argument
RTNETLINK answers: Invalid argument
RTNETLINK answers: Invalid argument
RTNETLINK answers: Invalid argument
RTNETLINK answers: Invalid argument
RTNETLINK answers: Invalid argument
RTNETLINK answers: Invalid argument
RTNETLINK answers: Invalid argument
RTNETLINK answers: Invalid argument
RTNETLINK answers: Invalid argument
RTNETLINK answers: Invalid argument
RTNETLINK answers: Invalid argument
RTNETLINK answers: Invalid argument
RTNETLINK answers: Invalid argument
RTNETLINK answers: Invalid argument
RTNETLINK answers: Invalid argument
RTNETLINK answers: Invalid argument
RTNETLINK answers: Invalid argument
RTNETLINK answers: Invalid argument
RTNETLINK answers: Invalid argument
RTNETLINK answers: Invalid argument
RTNETLINK answers: Invalid argument
RTNETLINK answers: Invalid argument
RTNETLINK answers: Invalid argument
RTNETLINK answers: Invalid argument
RTNETLINK answers: Invalid argument
RTNETLINK answers: Invalid argument
RTNETLINK answers: Invalid argument
RTNETLINK answers: Invalid argument
RTNETLINK answers: Invalid argument
RTNETLINK answers: Invalid argument
RTNETLINK answers: Invalid argument
RTNETLINK answers: Invalid argument
RTNETLINK answers: Invalid argument
RTNETLINK answers: Invalid argument
RTNETLINK answers: Invalid argument
RTNETLINK answers: Invalid argument
RTNETLINK answers: Invalid argument
RTNETLINK answers: Invalid argument
RTNETLINK answers: Invalid argument
RTNETLINK answers: Invalid argument
RTNETLINK answers: Invalid argument
RTNETLINK answers: Invalid argument
RTNETLINK answers: Invalid argument
RTNETLINK answers: Invalid argument
RTNETLINK answers: Invalid argument
RTNETLINK answers: Invalid argument
RTNETLINK answers: Invalid argument
RTNETLINK answers: Invalid argument
RTNETLINK answers: Invalid argument
RTNETLINK answers: Invalid argument
RTNETLINK answers: Invalid argument
RTNETLINK answers: Invalid argument
RTNETLINK answers: Invalid argument
RTNETLINK answers: Invalid argument
RTNETLINK answers: Invalid argument
RTNETLINK answers: Invalid argument
RTNETLINK answers: Invalid argument
RTNETLINK answers: Invalid argument
RTNETLINK answers: Invalid argument
RTNETLINK answers: Invalid argument
RTNETLINK answers: Invalid argument
RTNETLINK answers: Invalid argument
RTNETLINK answers: Invalid argument
RTNETLINK answers: Invalid argument
RTNETLINK answers: Invalid argument
RTNETLINK answers: Invalid argument
RTNETLINK answers: Invalid argument
RTNETLINK answers: Invalid argument
RTNETLINK answers: Invalid argument
RTNETLINK answers: Invalid argument
RTNETLINK answers: Invalid argument
RTNETLINK answers: Invalid argument
RTNETLINK answers: Invalid argument
RTNETLINK answers: Invalid argument
RTNETLINK answers: Invalid argument
RTNETLINK answers: Invalid argument
RTNETLINK answers: Invalid argument
RTNETLINK answers: Invalid argument
RTNETLINK answers: Invalid argument
RTNETLINK answers: Invalid argument
RTNETLINK answers: Invalid argument
RTNETLINK answers: Invalid argument
RTNETLINK answers: Invalid argument
RTNETLINK answers: Invalid argument
RTNETLINK answers: Invalid argument
RTNETLINK answers: Invalid argument
RTNETLINK answers: Invalid argument
RTNETLINK answers: Invalid argument
RTNETLINK answers: Invalid argument
RTNETLINK answers: Invalid argument
RTNETLINK answers: Invalid argument
RTNETLINK answers: Invalid argument
RTNETLINK answers: Invalid argument
RTNETLINK answers: Invalid argument
RTNETLINK answers: Invalid argument
RTNETLINK answers: Invalid argument
RTNETLINK answers: Invalid argument
RTNETLINK answers: Invalid argument
RTNETLINK answers: Invalid argument
RTNETLINK answers: Invalid argument
RTNETLINK answers: Invalid argument
RTNETLINK answers: Invalid argument
RTNETLINK answers: Invalid argument
RTNETLINK answers: Invalid argument
RTNETLINK answers: Invalid argument
RTNETLINK answers: Invalid argument
RTNETLINK answers: Invalid argument
RTNETLINK answers: Invalid argument
RTNETLINK answers: Invalid argument
RTNETLINK answers: Invalid argument
RTNETLINK answers: Invalid argument
RTNETLINK answers: Invalid argument
RTNETLINK answers: Invalid argument
RTNETLINK answers: Invalid argument
RTNETLINK answers: Invalid argument
RTNETLINK answers: Invalid argument
RTNETLINK answers: Invalid argument
RTNETLINK answers: Invalid argument
RTNETLINK answers: Invalid argument
RTNETLINK answers: Invalid argument
RTNETLINK answers: Invalid argument
RTNETLINK answers: Invalid argument
RTNETLINK answers: Invalid argument
RTNETLINK answers: Invalid argument
RTNETLINK answers: Invalid argument
RTNETLINK answers: Invalid argument
RTNETLINK answers: Invalid argument
RTNETLINK answers: Invalid argument
RTNETLINK answers: Invalid argument
RTNETLINK answers: Invalid argument
RTNETLINK answers: Invalid argument
RTNETLINK answers: Invalid argument
RTNETLINK answers: Invalid argument
RTNETLINK answers: Invalid argument
RTNETLINK answers: Invalid argument
RTNETLINK answers: Invalid argument
RTNETLINK answers: Invalid argument
RTNETLINK answers: Invalid argument
RTNETLINK answers: Invalid argument
RTNETLINK answers: Invalid argument
RTNETLINK answers: Invalid argument
RTNETLINK answers: Invalid argument
RTNETLINK answers: Invalid argument
RTNETLINK answers: Invalid argument
RTNETLINK answers: Invalid argument
RTNETLINK answers: Invalid argument
RTNETLINK answers: Invalid argument
RTNETLINK answers: Invalid argument
RTNETLINK answers: Invalid argument
RTNETLINK answers: Invalid argument
RTNETLINK answers: Invalid argument
RTNETLINK answers: Invalid argument
RTNETLINK answers: Invalid argument
RTNETLINK answers: Invalid argument
RTNETLINK answers: Invalid argument
RTNETLINK answers: Invalid argument
RTNETLINK answers: Invalid argument
RTNETLINK answers: Invalid argument
RTNETLINK answers: Invalid argument
RTNETLINK answers: Invalid argument
RTNETLINK answers: Invalid argument
RTNETLINK answers: Invalid argument
RTNETLINK answers: Invalid argument
RTNETLINK answers: Invalid argument
RTNETLINK answers: Invalid argument
RTNETLINK answers: Invalid argument
RTNETLINK answers: Invalid argument
RTNETLINK answers: Invalid argument
RTNETLINK answers: Invalid argument
RTNETLINK answers: Invalid argument
RTNETLINK answers: Invalid argument
RTNETLINK answers: Invalid argument
RTNETLINK answers: Invalid argument
RTNETLINK answers: Invalid argument
RTNETLINK answers: Invalid argument
RTNETLINK answers: Invalid argument
RTNETLINK answers: Invalid argument
RTNETLINK answers: Invalid argument
RTNETLINK answers: Invalid argument
RTNETLINK answers: Invalid argument
RTNETLINK answers: Invalid argument
RTNETLINK answers: Invalid argument
RTNETLINK answers: Invalid argument
RTNETLINK answers: Invalid argument
RTNETLINK answers: Invalid argument
RTNETLINK answers: Invalid argument
RTNETLINK answers: Invalid argument
RTNETLINK answers: Invalid argument
RTNETLINK answers: Invalid argument
RTNETLINK answers: Invalid argument
RTNETLINK answers: Invalid argument
RTNETLINK answers: Invalid argument
RTNETLINK answers: Invalid argument
RTNETLINK answers: Invalid argument
RTNETLINK answers: Invalid argument
RTNETLINK answers: Invalid argument
RTNETLINK answers: Invalid argument
RTNETLINK answers: Invalid argument
RTNETLINK answers: Invalid argument
RTNETLINK answers: Invalid argument
RTNETLINK answers: Invalid argument
RTNETLINK answers: Invalid argument
RTNETLINK answers: Invalid argument
RTNETLINK answers: Invalid argument
RTNETLINK answers: Invalid argument
RTNETLINK answers: Invalid argument
RTNETLINK answers: Invalid argument
RTNETLINK answers: Invalid argument
RTNETLINK answers: Invalid argument
RTNETLINK answers: Invalid argument
RTNETLINK answers: Invalid argument
RTNETLINK answers: Invalid argument
RTNETLINK answers: Invalid argument
RTNETLINK answers: Invalid argument
RTNETLINK answers: Invalid argument
RTNETLINK answers: Invalid argument
RTNETLINK answers: Invalid argument
RTNETLINK answers: Invalid argument
RTNETLINK answers: Invalid argument
RTNETLINK answers: Invalid argument
RTNETLINK answers: Invalid argument
RTNETLINK answers: Invalid argument
RTNETLINK answers: Invalid argument
RTNETLINK answers: Invalid argument
RTNETLINK answers: Invalid argument
RTNETLINK answers: Invalid argument
RTNETLINK answers: Invalid argument
RTNETLINK answers: Invalid argument
RTNETLINK answers: Invalid argument
RTNETLINK answers: Invalid argument
RTNETLINK answers: Invalid argument
RTNETLINK answers: Invalid argument
RTNETLINK answers: Invalid argument
RTNETLINK answers: Invalid argument
RTNETLINK answers: Invalid argument
RTNETLINK answers: Invalid argument
RTNETLINK answers: Invalid argument
RTNETLINK answers: Invalid argument
RTNETLINK answers: Invalid argument
RTNETLINK answers: Invalid argument
RTNETLINK answers: Invalid argument
RTNETLINK answers: Invalid argument
RTNETLINK answers: Invalid argument
RTNETLINK answers: Invalid argument
RTNETLINK answers: Invalid argument
RTNETLINK answers: Invalid argument
RTNETLINK answers: Invalid argument
RTNETLINK answers: Invalid argument
RTNETLINK answers: Invalid argument
RTNETLINK answers: Invalid argument
RTNETLINK answers: Invalid argument
RTNETLINK answers: Invalid argument
RTNETLINK answers: Invalid argument
RTNETLINK answers: Invalid argument
RTNETLINK answers: Invalid argument
RTNETLINK answers: Invalid argument
RTNETLINK answers: Invalid argument
RTNETLINK answers: Invalid argument
RTNETLINK answers: Invalid argument
RTNETLINK answers: Invalid argument
RTNETLINK answers: Invalid argument
RTNETLINK answers: Invalid argument
RTNETLINK answers: Invalid argument
RTNETLINK answers: Invalid argument
RTNETLINK answers: Invalid argument
RTNETLINK answers: Invalid argument
RTNETLINK answers: Invalid argument
RTNETLINK answers: Invalid argument
RTNETLINK answers: Invalid argument
RTNETLINK answers: Invalid argument
RTNETLINK answers: Invalid argument
RTNETLINK answers: Invalid argument
RTNETLINK answers: Invalid argument
RTNETLINK answers: Invalid argument
RTNETLINK answers: Invalid argument
RTNETLINK answers: Invalid argument
RTNETLINK answers: Invalid argument
RTNETLINK answers: Invalid argument
RTNETLINK answers: Invalid argument
RTNETLINK answers: Invalid argument
RTNETLINK answers: Invalid argument
RTNETLINK answers: Invalid argument
RTNETLINK answers: Invalid argument
RTNETLINK answers: Invalid argument
RTNETLINK answers: Invalid argument
RTNETLINK answers: Invalid argument
RTNETLINK answers: Invalid argument
RTNETLINK answers: Invalid argument
RTNETLINK answers: Invalid argument
RTNETLINK answers: Invalid argument
RTNETLINK answers: Invalid argument
RTNETLINK answers: Invalid argument
RTNETLINK answers: Invalid argument
RTNETLINK answers: Invalid argument
RTNETLINK answers: Invalid argument
RTNETLINK answers: Invalid argument
RTNETLINK answers: Invalid argument
RTNETLINK answers: Invalid argument
RTNETLINK answers: Invalid argument
RTNETLINK answers: Invalid argument
RTNETLINK answers: Invalid argument
RTNETLINK answers: Invalid argument
RTNETLINK answers: Invalid argument
RTNETLINK answers: Invalid argument
RTNETLINK answers: Invalid argument
RTNETLINK answers: Invalid argument
RTNETLINK answers: Invalid argument
RTNETLINK answers: Invalid argument
RTNETLINK answers: Invalid argument
RTNETLINK answers: Invalid argument
RTNETLINK answers: Invalid argument
RTNETLINK answers: Invalid argument
RTNETLINK answers: Invalid argument
RTNETLINK answers: Invalid argument
RTNETLINK answers: Invalid argument
RTNETLINK answers: Invalid argument
RTNETLINK answers: Invalid argument
RTNETLINK answers: Invalid argument
RTNETLINK answers: Invalid argument
RTNETLINK answers: Invalid argument
RTNETLINK answers: Invalid argument
RTNETLINK answers: Invalid argument
RTNETLINK answers: Invalid argument
RTNETLINK answers: Invalid argument
RTNETLINK answers: Invalid argument
RTNETLINK answers: Invalid argument
RTNETLINK answers: Invalid argument
RTNETLINK answers: Invalid argument
RTNETLINK answers: Invalid argument
RTNETLINK answers: Invalid argument
RTNETLINK answers: Invalid argument
RTNETLINK answers: Invalid argument
RTNETLINK answers: Invalid argument
RTNETLINK answers: Invalid argument
RTNETLINK answers: Invalid argument
RTNETLINK answers: Invalid argument
RTNETLINK answers: Invalid argument
RTNETLINK answers: Invalid argument
RTNETLINK answers: Invalid argument
RTNETLINK answers: Invalid argument
RTNETLINK answers: Invalid argument
RTNETLINK answers: Invalid argument
RTNETLINK answers: Invalid argument
RTNETLINK answers: Invalid argument
RTNETLINK answers: Invalid argument
RTNETLINK answers: Invalid argument
RTNETLINK answers: Invalid argument
RTNETLINK answers: Invalid argument
RTNETLINK answers: Invalid argument
RTNETLINK answers: Invalid argument
RTNETLINK answers: Invalid argument
RTNETLINK answers: Invalid argument
RTNETLINK answers: Invalid argument
RTNETLINK answers: Invalid argument
RTNETLINK answers: Invalid argument
RTNETLINK answers: Invalid argument
RTNETLINK answers: Invalid argument
RTNETLINK answers: Invalid argument
RTNETLINK answers: Invalid argument
RTNETLINK answers: Invalid argument
RTNETLINK answers: Invalid argument
RTNETLINK answers: Invalid argument
RTNETLINK answers: Invalid argument
RTNETLINK answers: Invalid argument
RTNETLINK answers: Invalid argument
RTNETLINK answers: Invalid argument
RTNETLINK answers: Invalid argument
RTNETLINK answers: Invalid argument
RTNETLINK answers: Invalid argument
RTNETLINK answers: Invalid argument
RTNETLINK answers: Invalid argument
RTNETLINK answers: Invalid argument
RTNETLINK answers: Invalid argument
RTNETLINK answers: Invalid argument
RTNETLINK answers: Invalid argument
RTNETLINK answers: Invalid argument
RTNETLINK answers: Invalid argument
RTNETLINK answers: Invalid argument
RTNETLINK answers: Invalid argument
RTNETLINK answers: Invalid argument
RTNETLINK answers: Invalid argument
RTNETLINK answers: Invalid argument
RTNETLINK answers: Invalid argument
RTNETLINK answers: Invalid argument
RTNETLINK answers: Invalid argument
RTNETLINK answers: Invalid argument
RTNETLINK answers: Invalid argument
RTNETLINK answers: Invalid argument
RTNETLINK answers: Invalid argument
RTNETLINK answers: Invalid argument
RTNETLINK answers: Invalid argument
RTNETLINK answers: Invalid argument
RTNETLINK answers: Invalid argument
RTNETLINK answers: Invalid argument
RTNETLINK answers: Invalid argument
RTNETLINK answers: Invalid argument
RTNETLINK answers: Invalid argument
RTNETLINK answers: Invalid argument
RTNETLINK answers: Invalid argument
RTNETLINK answers: Invalid argument
RTNETLINK answers: Invalid argument
RTNETLINK answers: Invalid argument
RTNETLINK answers: Invalid argument
RTNETLINK answers: Invalid argument
RTNETLINK answers: Invalid argument
RTNETLINK answers: Invalid argument
RTNETLINK answers: Invalid argument
RTNETLINK answers: Invalid argument
RTNETLINK answers: Invalid argument
RTNETLINK answers: Invalid argument
RTNETLINK answers: Invalid argument
RTNETLINK answers: Invalid argument
RTNETLINK answers: Invalid argument
RTNETLINK answers: Invalid argument
RTNETLINK answers: Invalid argument
RTNETLINK answers: Invalid argument
RTNETLINK answers: Invalid argument
RTNETLINK answers: Invalid argument
RTNETLINK answers: Invalid argument
RTNETLINK answers: Invalid argument
RTNETLINK answers: Invalid argument
RTNETLINK answers: Invalid argument
RTNETLINK answers: Invalid argument
RTNETLINK answers: Invalid argument
RTNETLINK answers: Invalid argument
RTNETLINK answers: Invalid argument
RTNETLINK answers: Invalid argument
RTNETLINK answers: Invalid argument
RTNETLINK answers: Invalid argument
RTNETLINK answers: Invalid argument
RTNETLINK answers: Invalid argument
RTNETLINK answers: Invalid argument
RTNETLINK answers: Invalid argument
RTNETLINK answers: Invalid argument
RTNETLINK answers: Invalid argument
RTNETLINK answers: Invalid argument
RTNETLINK answers: Invalid argument
RTNETLINK answers: Invalid argument
RTNETLINK answers: Invalid argument
RTNETLINK answers: Invalid argument
RTNETLINK answers: Invalid argument
RTNETLINK answers: Invalid argument
RTNETLINK answers: Invalid argument
RTNETLINK answers: Invalid argument
RTNETLINK answers: Invalid argument
RTNETLINK answers: Invalid argument
RTNETLINK answers: Invalid argument
RTNETLINK answers: Invalid argument
RTNETLINK answers: Invalid argument
RTNETLINK answers: Invalid argument
RTNETLINK answers: Invalid argument
RTNETLINK answers: Invalid argument
RTNETLINK answers: Invalid argument
RTNETLINK answers: Invalid argument
RTNETLINK answers: Invalid argument
RTNETLINK answers: Invalid argument
RTNETLINK answers: Invalid argument
RTNETLINK answers: Invalid argument
RTNETLINK answers: Invalid argument
RTNETLINK answers: Invalid argument
RTNETLINK answers: Invalid argument
RTNETLINK answers: Invalid argument
RTNETLINK answers: Invalid argument
RTNETLINK answers: Invalid argument
RTNETLINK answers: Invalid argument
RTNETLINK answers: Invalid argument
RTNETLINK answers: Invalid argument
RTNETLINK answers: Invalid argument
RTNETLINK answers: Invalid argument
RTNETLINK answers: Invalid argument
RTNETLINK answers: Invalid argument
RTNETLINK answers: Invalid argument
RTNETLINK answers: Invalid argument
RTNETLINK answers: Invalid argument
RTNETLINK answers: Invalid argument
RTNETLINK answers: Invalid argument
RTNETLINK answers: Invalid argument
RTNETLINK answers: Invalid argument
RTNETLINK answers: Invalid argument
RTNETLINK answers: Invalid argument
RTNETLINK answers: Invalid argument
RTNETLINK answers: Invalid argument
RTNETLINK answers: Invalid argument
RTNETLINK answers: Invalid argument
RTNETLINK answers: Invalid argument
RTNETLINK answers: Invalid argument
RTNETLINK answers: Invalid argument
RTNETLINK answers: Invalid argument
RTNETLINK answers: Invalid argument
RTNETLINK answers: Invalid argument
RTNETLINK answers: Invalid argument
RTNETLINK answers: Invalid argument
RTNETLINK answers: Invalid argument
RTNETLINK answers: Invalid argument
RTNETLINK answers: Invalid argument
RTNETLINK answers: Invalid argument
RTNETLINK answers: Invalid argument
RTNETLINK answers: Invalid argument
RTNETLINK answers: Invalid argument
RTNETLINK answers: Invalid argument
RTNETLINK answers: Invalid argument
RTNETLINK answers: Invalid argument
RTNETLINK answers: Invalid argument
RTNETLINK answers: Invalid argument
RTNETLINK answers: Invalid argument
RTNETLINK answers: Invalid argument
RTNETLINK answers: Invalid argument
RTNETLINK answers: Invalid argument
RTNETLINK answers: Invalid argument
RTNETLINK answers: Invalid argument
RTNETLINK answers: Invalid argument
RTNETLINK answers: Invalid argument
RTNETLINK answers: Invalid argument
RTNETLINK answers: Invalid argument
RTNETLINK answers: Invalid argument
RTNETLINK answers: Invalid argument
RTNETLINK answers: Invalid argument
RTNETLINK answers: Invalid argument
RTNETLINK answers: Invalid argument
RTNETLINK answers: Invalid argument
RTNETLINK answers: Invalid argument
RTNETLINK answers: Invalid argument
RTNETLINK answers: Invalid argument
RTNETLINK answers: Invalid argument
RTNETLINK answers: Invalid argument
RTNETLINK answers: Invalid argument
RTNETLINK answers: Invalid argument
RTNETLINK answers: Invalid argument
RTNETLINK answers: Invalid argument
RTNETLINK answers: Invalid argument
RTNETLINK answers: Invalid argument
RTNETLINK answers: Invalid argument
RTNETLINK answers: Invalid argument
RTNETLINK answers: Invalid argument
RTNETLINK answers: Invalid argument
RTNETLINK answers: Invalid argument
RTNETLINK answers: Invalid argument
RTNETLINK answers: Invalid argument
RTNETLINK answers: Invalid argument
RTNETLINK answers: Invalid argument
RTNETLINK answers: Invalid argument
RTNETLINK answers: Invalid argument
RTNETLINK answers: Invalid argument
RTNETLINK answers: Invalid argument
RTNETLINK answers: Invalid argument
RTNETLINK answers: Invalid argument
RTNETLINK answers: Invalid argument
RTNETLINK answers: Invalid argument
RTNETLINK answers: Invalid argument
RTNETLINK answers: Invalid argument
RTNETLINK answers: Invalid argument
RTNETLINK answers: Invalid argument
RTNETLINK answers: Invalid argument
RTNETLINK answers: Invalid argument
RTNETLINK answers: Invalid argument
RTNETLINK answers: Invalid argument
RTNETLINK answers: Invalid argument
RTNETLINK answers: Invalid argument
RTNETLINK answers: Invalid argument
RTNETLINK answers: Invalid argument
RTNETLINK answers: Invalid argument
RTNETLINK answers: Invalid argument
RTNETLINK answers: Invalid argument
RTNETLINK answers: Invalid argument
RTNETLINK answers: Invalid argument
RTNETLINK answers: Invalid argument
RTNETLINK answers: Invalid argument
RTNETLINK answers: Invalid argument
RTNETLINK answers: Invalid argument
RTNETLINK answers: Invalid argument
RTNETLINK answers: Invalid argument
RTNETLINK answers: Invalid argument
RTNETLINK answers: Invalid argument
RTNETLINK answers: Invalid argument
RTNETLINK answers: Invalid argument
RTNETLINK answers: Invalid argument
RTNETLINK answers: Invalid argument
RTNETLINK answers: Invalid argument
RTNETLINK answers: Invalid argument
RTNETLINK answers: Invalid argument
RTNETLINK answers: Invalid argument
RTNETLINK answers: Invalid argument
RTNETLINK answers: Invalid argument
RTNETLINK answers: Invalid argument
RTNETLINK answers: Invalid argument
RTNETLINK answers: Invalid argument
RTNETLINK answers: Invalid argument
RTNETLINK answers: Invalid argument
RTNETLINK answers: Invalid argument
RTNETLINK answers: Invalid argument
RTNETLINK answers: Invalid argument
RTNETLINK answers: Invalid argument
RTNETLINK answers: Invalid argument
RTNETLINK answers: Invalid argument
RTNETLINK answers: Invalid argument
RTNETLINK answers: Invalid argument
RTNETLINK answers: Invalid argument
RTNETLINK answers: Invalid argument
RTNETLINK answers: Invalid argument
RTNETLINK answers: Invalid argument
RTNETLINK answers: Invalid argument
RTNETLINK answers: Invalid argument
RTNETLINK answers: Invalid argument
RTNETLINK answers: Invalid argument
RTNETLINK answers: Invalid argument
RTNETLINK answers: Invalid argument
RTNETLINK answers: Invalid argument
RTNETLINK answers: Invalid argument
RTNETLINK answers: Invalid argument
RTNETLINK answers: Invalid argument
RTNETLINK answers: Invalid argument
RTNETLINK answers: Invalid argument
RTNETLINK answers: Invalid argument
RTNETLINK answers: Invalid argument
RTNETLINK answers: Invalid argument
RTNETLINK answers: Invalid argument
RTNETLINK answers: Invalid argument
RTNETLINK answers: Invalid argument
RTNETLINK answers: Invalid argument
RTNETLINK answers: Invalid argument
RTNETLINK answers: Invalid argument
RTNETLINK answers: Invalid argument
RTNETLINK answers: Invalid argument
RTNETLINK answers: Invalid argument
RTNETLINK answers: Invalid argument
RTNETLINK answers: Invalid argument
RTNETLINK answers: Invalid argument
RTNETLINK answers: Invalid argument
RTNETLINK answers: Invalid argument
RTNETLINK answers: Invalid argument
RTNETLINK answers: Invalid argument
RTNETLINK answers: Invalid argument
RTNETLINK answers: Invalid argument
RTNETLINK answers: Invalid argument
RTNETLINK answers: Invalid argument
RTNETLINK answers: Invalid argument
RTNETLINK answers: Invalid argument
RTNETLINK answers: Invalid argument
RTNETLINK answers: Invalid argument
RTNETLINK answers: Invalid argument
RTNETLINK answers: Invalid argument
RTNETLINK answers: Invalid argument
RTNETLINK answers: Invalid argument
RTNETLINK answers: Invalid argument
RTNETLINK answers: Invalid argument
RTNETLINK answers: Invalid argument
Building target platforms: noarch
Building for target noarch
Installing /home/iurt/rpmbuild/SRPMS/@2375454:clojure-spec-alpha-0.6.249-1.mga11.src.rpm
Executing(%mkbuilddir): /bin/sh -e /home/iurt/rpmbuild/tmp/rpm-tmp.j57oUd
Executing(%prep): /bin/sh -e /home/iurt/rpmbuild/tmp/rpm-tmp.Cilumq
+ umask 022
+ cd /home/iurt/rpmbuild/BUILD/clojure-spec-alpha-0.6.249-build
+ '[' 1 -eq 1 ']'
+ '[' 1 -eq 1 ']'
+ '[' 1 -eq 1 ']'
+ cd /home/iurt/rpmbuild/BUILD/clojure-spec-alpha-0.6.249-build
+ rm -rf spec.alpha-0.6.249
+ /usr/lib/rpm/rpmuncompress -x /home/iurt/rpmbuild/SOURCES/v0.6.249.zip
+ STATUS=0
+ '[' 0 -ne 0 ']'
+ cd spec.alpha-0.6.249
+ /usr/bin/chmod -Rf a+rX,u+w,g-w,o-w .
+ /usr/bin/python3 /usr/share/java-utils/pom_editor.py pom_remove_parent pom.xml
+ /usr/bin/python3 /usr/share/java-utils/pom_editor.py pom_xpath_inject pom:project 'org.clojure'
+ /usr/bin/python3 /usr/share/java-utils/pom_editor.py pom_xpath_inject pom:project/pom:properties 'UTF-8'
+ /usr/bin/python3 /usr/share/java-utils/pom_editor.py pom_xpath_inject pom:project/pom:properties 'src/main/clojure'
+ /usr/bin/python3 /usr/share/java-utils/pom_editor.py pom_xpath_inject pom:project/pom:properties 'src/test/clojure'
+ /usr/bin/python3 /usr/share/java-utils/pom_editor.py pom_xpath_inject 'pom:execution[pom:id='\''clojure-compile'\'']' 'compile'
+ /usr/bin/python3 /usr/share/java-utils/pom_editor.py pom_xpath_inject 'pom:execution[pom:id='\''clojure-test'\'']' 'test'
+ /usr/bin/python3 /usr/share/java-utils/pom_editor.py pom_add_plugin org.codehaus.mojo:build-helper-maven-plugin:1.12 . $'\n\n \n \n add-clojure-source-dirs\n generate-sources\n \n add-source\n add-resource\n \n \n \n src/main/clojure\n \n \n \n src/main/clojure\n \n \n \n \n \n add-clojure-test-source-dirs\n generate-sources\n \n add-test-source\n add-test-resource\n \n \n \n src/test/clojure\n \n \n \n src/test/clojure\n \n \n \n \n '
+ RPM_EC=0
++ jobs -p
+ exit 0
Executing(%build): /bin/sh -e /home/iurt/rpmbuild/tmp/rpm-tmp.KvYIu7
+ umask 022
+ cd /home/iurt/rpmbuild/BUILD/clojure-spec-alpha-0.6.249-build
+ CFLAGS='-O2 -g -pipe -Wformat -Werror=format-security -Wp,-U_FORTIFY_SOURCE,-D_FORTIFY_SOURCE=3 -specs=/usr/lib/rpm/redhat/redhat-hardened-cc1 -fstack-protector-strong -m64 -fasynchronous-unwind-tables -fstack-clash-protection -fcf-protection=full'
+ export CFLAGS
+ CXXFLAGS='-O2 -g -pipe -Wformat -Werror=format-security -Wp,-U_FORTIFY_SOURCE,-D_FORTIFY_SOURCE=3 -specs=/usr/lib/rpm/redhat/redhat-hardened-cc1 -fstack-protector-strong -m64 -fasynchronous-unwind-tables -fstack-clash-protection -fcf-protection=full'
+ export CXXFLAGS
+ FFLAGS='-O2 -g -pipe -Wformat -Werror=format-security -Wp,-U_FORTIFY_SOURCE,-D_FORTIFY_SOURCE=3 -specs=/usr/lib/rpm/redhat/redhat-hardened-cc1 -fstack-protector-strong -m64 -fasynchronous-unwind-tables -fstack-clash-protection -fcf-protection=full '
+ export FFLAGS
+ FCFLAGS='-O2 -g -pipe -Wformat -Werror=format-security -Wp,-U_FORTIFY_SOURCE,-D_FORTIFY_SOURCE=3 -specs=/usr/lib/rpm/redhat/redhat-hardened-cc1 -fstack-protector-strong -m64 -fasynchronous-unwind-tables -fstack-clash-protection -fcf-protection=full '
+ export FCFLAGS
+ VALAFLAGS=-g
+ export VALAFLAGS
+ RUSTFLAGS='-Copt-level=3 -Cdebuginfo=2 -Ccodegen-units=1 -Cstrip=none --cap-lints=warn'
+ export RUSTFLAGS
+ LDFLAGS='-Wl,--as-needed -Wl,--no-undefined -Wl,-z,relro -Wl,-z,now -Wl,-O1 -Wl,--build-id=sha1 -Wl,--enable-new-dtags -specs=/usr/lib/rpm/redhat/redhat-hardened-ld'
+ export LDFLAGS
+ LT_SYS_LIBRARY_PATH=/usr/lib:
+ export LT_SYS_LIBRARY_PATH
+ CC=gcc
+ export CC
+ CXX=g++
+ export CXX
+ cd spec.alpha-0.6.249
+ '[' 1 -eq 1 ']'
+ '[' 1 -eq 1 ']'
+ /usr/bin/python3 /usr/share/java-utils/mvn_build.py --xmvn-javadoc -f
Executing: xmvn --batch-mode --offline -Dmaven.test.skip=true package org.fedoraproject.xmvn:xmvn-mojo:install org.fedoraproject.xmvn:xmvn-mojo:javadoc org.fedoraproject.xmvn:xmvn-mojo:builddep
['xmvn', '--batch-mode', '--offline', '-Dmaven.test.skip=true', 'package', 'org.fedoraproject.xmvn:xmvn-mojo:install', 'org.fedoraproject.xmvn:xmvn-mojo:javadoc', 'org.fedoraproject.xmvn:xmvn-mojo:builddep']
SLF4J: Class path contains multiple SLF4J bindings.
SLF4J: Found binding in [jar:file:/usr/share/xmvn/lib/slf4j-api-1.7.36.jar!/org/slf4j/impl/StaticLoggerBinder.class]
SLF4J: Found binding in [jar:file:/usr/share/xmvn/lib/maven-slf4j-provider-3.9.11.jar!/org/slf4j/impl/StaticLoggerBinder.class]
SLF4J: See http://www.slf4j.org/codes.html#multiple_bindings for an explanation.
SLF4J: Actual binding is of type [org.slf4j.impl.SimpleLoggerFactory]
SLF4J: Class path contains multiple SLF4J bindings.
SLF4J: Found binding in [jar:file:/usr/share/xmvn/lib/slf4j-api-1.7.36.jar!/org/slf4j/impl/StaticLoggerBinder.class]
SLF4J: Found binding in [jar:file:/usr/share/xmvn/lib/maven-slf4j-provider-3.9.11.jar!/org/slf4j/impl/StaticLoggerBinder.class]
SLF4J: See http://www.slf4j.org/codes.html#multiple_bindings for an explanation.
SLF4J: Actual binding is of type [org.slf4j.impl.SimpleLoggerFactory]
WARNING: A terminally deprecated method in sun.misc.Unsafe has been called
WARNING: sun.misc.Unsafe::objectFieldOffset has been called by com.google.common.util.concurrent.AbstractFuture$UnsafeAtomicHelper (file:/usr/share/xmvn/lib/failureaccess-1.0.3.jar)
WARNING: Please consider reporting this to the maintainers of class com.google.common.util.concurrent.AbstractFuture$UnsafeAtomicHelper
WARNING: sun.misc.Unsafe::objectFieldOffset will be removed in a future release
[INFO] Scanning for projects...
[INFO]
[INFO] -----------------------< org.clojure:spec.alpha >-----------------------
[INFO] Building spec.alpha 0.6.249
[INFO] from pom.xml
[INFO] --------------------------------[ jar ]---------------------------------
[WARNING] The POM for org.clojure:spec.alpha:jar:0.5.238 is missing, no dependency information available
[INFO]
[INFO] ------------------------------------------------------------------------
[INFO] Skipping spec.alpha
[INFO] This project has been banned from the build due to previous failures.
[INFO] ------------------------------------------------------------------------
[INFO] ------------------------------------------------------------------------
[INFO] BUILD FAILURE
[INFO] ------------------------------------------------------------------------
[INFO] Total time: 0.543 s
[INFO] Finished at: 2026-10-05T14:02:32Z
[INFO] ------------------------------------------------------------------------
[ERROR] Failed to execute goal on project spec.alpha: Could not resolve dependencies for project org.clojure:spec.alpha:jar:0.6.249
[ERROR] dependency: org.clojure:spec.alpha:jar:0.5.238 (provided)
[ERROR] Cannot access central (https://repo.maven.apache.org/maven2) in offline mode and the artifact org.clojure:spec.alpha:jar:0.5.238 has not been downloaded from it before.
[ERROR] -> [Help 1]
[ERROR]
[ERROR] To see the full stack trace of the errors, re-run Maven with the -e switch.
[ERROR] Re-run Maven using the -X switch to enable full debug logging.
[ERROR]
[ERROR] For more information about the errors and possible solutions, please read the following articles:
[ERROR] [Help 1] http://cwiki.apache.org/confluence/display/MAVEN/DependencyResolutionException
error: Bad exit status from /home/iurt/rpmbuild/tmp/rpm-tmp.KvYIu7 (%build)
RPM build errors:
Bad exit status from /home/iurt/rpmbuild/tmp/rpm-tmp.KvYIu7 (%build)
I: [iurt_root_command] ERROR: chroot
I: [iurt] [iurt] --------------- end of command output ---------------
D: [iurt] [iurt] clean chroot
D: [iurt_root_command] Running iurt_root_command --netns_delete /home/iurt/chroot_tmp/iurt/chroot_cauldron.x86_64.0.20261005140203
D: [iurt_root_command] Delete network namespace for given chroot, killing all processes
D: [iurt_root_command] Success!
D: [iurt_root_command] Running iurt_root_command --umount /home/iurt/chroot_tmp/iurt/chroot_cauldron.x86_64.0.20261005140203/proc
D: [iurt_root_command] Unmounting
D: [iurt_root_command] Success!
D: [iurt_root_command] Running iurt_root_command --umount /home/iurt/chroot_tmp/iurt/chroot_cauldron.x86_64.0.20261005140203/dev/pts
D: [iurt_root_command] Unmounting
D: [iurt_root_command] Success!
D: [iurt_root_command] Running iurt_root_command --umount /home/iurt/chroot_tmp/iurt/chroot_cauldron.x86_64.0.20261005140203/dev/shm
D: [iurt_root_command] Unmounting
D: [iurt_root_command] Success!
[iurt] [iurt] cleaning /home/iurt/chroot_tmp/iurt/chroot_cauldron.x86_64.0.20261005140203
[iurt] [iurt] removing /home/iurt/chroot_tmp/iurt/chroot_cauldron.x86_64.0.20261005140203
D: [iurt_root_command] Running iurt_root_command --rm -r /home/iurt/chroot_tmp/iurt/chroot_cauldron.x86_64.0.20261005140203
D: [iurt_root_command] Removing files
D: [iurt_root_command] removing /home/iurt/chroot_tmp/iurt/chroot_cauldron.x86_64.0.20261005140203
D: [iurt_root_command] Success!