*: [iurt] This is iurt version 0.9.4
D: [iurt] [iurt] load config: /home/iurt/.iurt.cauldron.conf
D: [iurt] [iurt] load config: /etc/iurt/build/cauldron.conf
D: [iurt] [iurt] Setting PERL_EXTUTILS_AUTOINSTALL to --skipdeps
D: [iurt] [iurt] Setting PERL_AUTOINSTALL to --skipdeps
I: [iurt] [iurt] local spool: /home/iurt/iurt/cauldron/core/release/20261003104739.daviddavid.duvel.1357431-x86_64
I: [iurt] [iurt] Packages to build: 1
D: [iurt] [iurt] using 0.20261003104844 as chroot extension
D: [iurt] [iurt] using local user iurt, id 517
I: [iurt] [iurt] Remove existing chroot
D: [iurt] [iurt] ... dir /home/iurt/chroot_tmp all prefix chroot_cauldron.x86_64
D: [iurt] [iurt] running with pid 2596605
N: [iurt] [iurt] Build package @2374644:jline2-2.14.6-9.mga11.src.rpm [1/1]
D: [iurt] [iurt] Not reusing old chroot
I: [iurt] [iurt] Install new chroot
D: [iurt] [iurt] ... in /home/iurt/chroot_tmp/iurt/chroot_cauldron.x86_64.0.20261003104844
D: [iurt] [iurt] clean chroot
N: [iurt] [iurt] creating chroot
D: [iurt_root_command] Running iurt_root_command --mkdir -p /home/iurt/chroot_tmp/iurt/chroot_cauldron.x86_64.0.20261003104844.tmp.zf8HJ5
D: [iurt_root_command] Creating the path
D: [iurt_root_command] Success!
D: [iurt] [iurt] decompressing /var/log/qa from /home/iurt/chroot_cauldron.x86_64.tar in /home/iurt/chroot_tmp/iurt/chroot_cauldron.x86_64.0.20261003104844.tmp.zf8HJ5
D: [iurt_root_command] Running iurt_root_command --untar /home/iurt/chroot_cauldron.x86_64.tar /home/iurt/chroot_tmp/iurt/chroot_cauldron.x8...
D: [iurt_root_command] Uncompress tarball
D: [iurt_root_command] Success!
D: [iurt_root_command] Running iurt_root_command --mkdir -m 1023 /home/iurt/chroot_tmp/iurt/chroot_cauldron.x86_64.0.20261003104844.tmp.zf8H...
D: [iurt_root_command] Creating the path
D: [iurt_root_command] Success!
/bin/cp: cannot create special file '/home/iurt/chroot_tmp/iurt/chroot_cauldron.x86_64.0.20261003104844.tmp.zf8HJ5/tmp/tmp.wP120K/dev/null': Operation not permitted
% Total % Received % Xferd Average Speed Time Time Time Current
Dload Upload Total Spent Left Speed
0 0 0 0 0 0 0 0 --:--:-- --:--:-- --:--:-- 0
100 3318k 100 3318k 0 0 98.2M 0 --:--:-- --:--:-- --:--:-- 98.2M
% Total % Received % Xferd Average Speed Time Time Time Current
Dload Upload Total Spent Left Speed
0 0 0 0 0 0 0 0 --:--:-- --:--:-- --:--:-- 0
100 32 100 32 0 0 32000 0 --:--:-- --:--:-- --:--:-- 32000
N: [iurt] [iurt] chroot tarball is already up-to-date
D: [iurt_root_command] Running iurt_root_command --rm -r /home/iurt/chroot_tmp/iurt/chroot_cauldron.x86_64.0.20261003104844.tmp.zf8HJ5
D: [iurt_root_command] Removing files
D: [iurt_root_command] removing /home/iurt/chroot_tmp/iurt/chroot_cauldron.x86_64.0.20261003104844.tmp.zf8HJ5
D: [iurt_root_command] Success!
D: [iurt_root_command] Running iurt_root_command --rm -r /home/iurt/chroot_tmp/iurt/chroot_cauldron.x86_64.0.20261003104844
D: [iurt_root_command] Removing files
D: [iurt_root_command] removing /home/iurt/chroot_tmp/iurt/chroot_cauldron.x86_64.0.20261003104844
D: [iurt_root_command] Success!
D: [iurt_root_command] Running iurt_root_command --mkdir -p /home/iurt/chroot_tmp/iurt/chroot_cauldron.x86_64.0.20261003104844
D: [iurt_root_command] Creating the path
D: [iurt_root_command] Success!
D: [iurt_root_command] Running iurt_root_command --untar /home/iurt/chroot_cauldron.x86_64.tar /home/iurt/chroot_tmp/iurt/chroot_cauldron.x8...
D: [iurt_root_command] Uncompress tarball
D: [iurt_root_command] Success!
N: [iurt] [iurt] chroot recreated in /home/iurt/chroot_tmp/iurt/chroot_cauldron.x86_64.0.20261003104844 (from /home/iurt/chroot_cauldron.x86_64.tar)
D: [iurt_root_command] Running iurt_root_command --netns_create /home/iurt/chroot_tmp/iurt/chroot_cauldron.x86_64.0.20261003104844
D: [iurt_root_command] Create network namespace for given chroot
D: [iurt_root_command] Success!
D: [iurt_root_command] Running iurt_root_command --cp /tmp/rpmmacros.kHs6NI /home/iurt/chroot_tmp/iurt/chroot_cauldron.x86_64.0.202610031048...
D: [iurt_root_command] Copying files
D: [iurt_root_command] copying /tmp/rpmmacros.kHs6NI -> /home/iurt/chroot_tmp/iurt/chroot_cauldron.x86_64.0.20261003104844/etc/rpm/macros
D: [iurt_root_command] Success!
D: [iurt_root_command] Running iurt_root_command --bindmount /proc /home/iurt/chroot_tmp/iurt/chroot_cauldron.x86_64.0.20261003104844/proc
D: [iurt_root_command] Bind mounting
D: [iurt_root_command] Success!
D: [iurt_root_command] Running iurt_root_command --bindmount /dev/pts /home/iurt/chroot_tmp/iurt/chroot_cauldron.x86_64.0.20261003104844/dev...
D: [iurt_root_command] Bind mounting
D: [iurt_root_command] Success!
D: [iurt_root_command] Running iurt_root_command --tmpfs /home/iurt/chroot_tmp/iurt/chroot_cauldron.x86_64.0.20261003104844/dev/shm
D: [iurt_root_command] Mount tmpfs
D: [iurt_root_command] Success!
I: [iurt] [iurt] add chroot media: http://repository.mageia.org/distrib//cauldron/x86_64
D: [iurt] [iurt] Using timeout of 600 seconds.
D: [iurt] [iurt] /usr/bin/sudo /usr/sbin/iurt_root_command --urpmi-addmedia -v --urpmi-root /home/iurt/chroot_tmp/iurt/chroot_cauldron.x86_64.0.20261003104844 core_release http://repository.mageia.org/distrib//cauldron/x86_64/media/core/release
D: [iurt] [iurt] Command exited with 0.
MEDIA core_release
(core_release)
D: [iurt] [iurt] creating user iurt in chroot /home/iurt/chroot_tmp/iurt/chroot_cauldron.x86_64.0.20261003104844
D: [iurt_root_command] Running iurt_root_command --useradd /home/iurt/chroot_tmp/iurt/chroot_cauldron.x86_64.0.20261003104844 iurt 517
D: [iurt_root_command] Useradd
useradd warning: iurt's uid 517 outside of the UID_MIN 1000 and UID_MAX 60000 range.
D: [iurt_root_command] Success!
N: [iurt] [iurt] recreate srpm: @2374644:jline2-2.14.6-9.mga11.src.rpm
D: [iurt] [iurt] Using timeout of 600 seconds.
D: [iurt] [iurt] perl command
D: [iurt_root_command] Running iurt_root_command --cp /home/iurt/iurt/cauldron/core/release/20261003104739.daviddavid.duvel.1357431-x86_64//...
D: [iurt_root_command] Copying files
D: [iurt_root_command] copying /home/iurt/iurt/cauldron/core/release/20261003104739.daviddavid.duvel.1357431-x86_64//@2374644:jline2-2.14.6-9.mga11.src.rpm -> /home/iurt/chroot_tmp/iurt/chroot_cauldron.x86_64.0.20261003104844/home/iurt/rpmbuild/SRPMS/
D: [iurt_root_command] Success!
D: [iurt] [iurt] Command exited with 0.
D: [iurt] [iurt] recreating src.rpm...
D: [iurt] [iurt] Using timeout of 600 seconds.
D: [iurt] [iurt] /usr/bin/sudo /usr/sbin/iurt_root_command --chroot /home/iurt/chroot_tmp/iurt/chroot_cauldron.x86_64.0.20261003104844 su iurt -c "rpm -i /home/iurt/rpmbuild/SRPMS/@2374644:jline2-2.14.6-9.mga11.src.rpm"
D: [iurt] [iurt] Command exited with 0.
D: [iurt] [iurt] calling callback for install_@2374644:jline2-2.14.6-9.mga11.src.rpm
D: [iurt] [iurt] Using timeout of 600 seconds.
D: [iurt] [iurt] /usr/bin/sudo /usr/sbin/iurt_root_command --chroot /home/iurt/chroot_tmp/iurt/chroot_cauldron.x86_64.0.20261003104844 su iurt -c "rpmspec -q --qf %{NVR}.src.rpm --srpm /home/iurt/rpmbuild/SPECS/jline2.spec | tail -n1 > /home/iurt/rpmbuild/SPECS/jline2.spec.srpm_name"
D: [iurt] [iurt] Forking to monitor log size
D: [iurt] [iurt] Command exited with 0.
D: [iurt_root_command] Running iurt_root_command --rm /home/iurt/chroot_tmp/iurt/chroot_cauldron.x86_64.0.20261003104844/home/iurt/rpmbuild/...
D: [iurt_root_command] Removing files
D: [iurt_root_command] removing /home/iurt/chroot_tmp/iurt/chroot_cauldron.x86_64.0.20261003104844/home/iurt/rpmbuild/SRPMS/@2374644:jline2-2.14.6-9.mga11.src.rpm
D: [iurt_root_command] Success!
D: [iurt] [iurt] Using timeout of 600 seconds.
D: [iurt] [iurt] /usr/bin/sudo /usr/sbin/iurt_root_command --chroot /home/iurt/chroot_tmp/iurt/chroot_cauldron.x86_64.0.20261003104844 su iurt -c "rpmbuild --target x86_64 --nodeps -bs /home/iurt/rpmbuild/SPECS/jline2.spec"
D: [iurt] [iurt] Forking to monitor log size
D: [iurt] [iurt] Command exited with 0.
D: [iurt_root_command] Running iurt_root_command --ln /home/iurt/chroot_tmp/iurt/chroot_cauldron.x86_64.0.20261003104844/home/iurt/rpmbuild/...
D: [iurt_root_command] Linking files
D: [iurt_root_command] Success!
N: [iurt] [iurt] new srpm: @2374644:jline2-2.14.6-9.mga11.src.rpm
I: [iurt] [iurt] updating packages in /home/iurt/chroot_tmp/iurt/chroot_cauldron.x86_64.0.20261003104844
D: [iurt] [iurt] Using timeout of 600 seconds.
D: [iurt] [iurt] /usr/bin/sudo /usr/sbin/iurt_root_command --urpmi --urpmi-root /home/iurt/chroot_tmp/iurt/chroot_cauldron.x86_64.0.20261003104844 --auto-update --auto
D: [iurt] [iurt] Command exited with 0.
I: [iurt] [iurt] Install build dependencies for @2374644:jline2-2.14.6-9.mga11.src.rpm
D: [iurt] [iurt] installing /home/iurt/chroot_tmp/iurt/chroot_cauldron.x86_64.0.20261003104844/home/iurt/rpmbuild/SRPMS//@2374644:jline2-2.14.6-9.mga11.src.rpm
I: [iurt] [iurt] install dependencies using urpmi
D: [iurt] [iurt] Using timeout of 3600 seconds.
D: [iurt] [iurt] Forking to monitor log size
D: [iurt] [iurt] /usr/bin/sudo /usr/sbin/iurt_root_command --urpmi -v --no-verify-rpm --tune-rpm=all --nolock --auto --no-recommends --ignoresize --noclean --urpmi-root /home/iurt/chroot_tmp/iurt/chroot_cauldron.x86_64.0.20261003104844 --buildrequires /home/iurt/chroot_tmp/iurt/chroot_cauldron.x86_64.0.20261003104844/home/iurt/rpmbuild/SRPMS//@2374644:jline2-2.14.6-9.mga11.src.rpm
D: [iurt] [iurt] Command exited with 0.
D: [iurt] [iurt] calling callback for install_deps_@2374644:jline2-2.14.6-9.mga11.src.rpm
D: [iurt] [iurt] missing_deps is empty, aborting.
D: [iurt] [iurt] output had: __ D: [iurt_root_command] urpmi
examining synthesis file [/home/iurt/chroot_tmp/iurt/chroot_cauldron.x86_64.0.20261003104844/var/lib/urpmi/synthesis.hdlist.core_release.cz]
would install instead of upgrade package kernel-desktop-6.18.44-1.mga11-1-1.mga11.x86_64
would install instead of upgrade package kernel-desktop-devel-6.18.44-1.mga11-1-1.mga11.x86_64
would install instead of upgrade package kernel-server-6.18.44-1.mga11-1-1.mga11.x86_64
would install instead of upgrade package kernel-server-devel-6.18.44-1.mga11-1-1.mga11.x86_64
would install instead of upgrade package kernel-linus-6.18.44-1.mga11.x86_64
would install instead of upgrade package kernel-linus-devel-6.18.44-1.mga11.x86_64
retrieving rpm files from medium "core_release"...
http://repository.mageia.org/distrib/cauldron/x86_64/media/core/release/java-25-openjdk-headless-25.0.4.1.1-4.mga11.x86_64.rpm
0% of 0 completed, ETA = --:--:--, speed = 0
100% of 50.7M completed, ETA = --:--:--, speed = 111M
http://repository.mageia.org/distrib/cauldron/x86_64/media/core/release/lib64graphite2_3-1.3.15-1.mga11.x86_64.rpm
0% of 0 completed, ETA = --:--:--, speed = 0
52% of 81795 completed, ETA = --:--:--, speed = 41.1M
100% of 81795 completed, ETA = --:--:--, speed = 39.0M
http://repository.mageia.org/distrib/cauldron/x86_64/media/core/release/lujavrite-1.2.3-1.mga10.x86_64.rpm
0% of 0 completed, ETA = --:--:--, speed = 0
100% of 18339 completed, ETA = --:--:--, speed = 17.4M
http://repository.mageia.org/distrib/cauldron/x86_64/media/core/release/rootcerts-java-20260714.00-1.mga11.noarch.rpm
0% of 0 completed, ETA = --:--:--, speed = 0
100% of 8148 completed, ETA = --:--:--, speed = 7957k
http://repository.mageia.org/distrib/cauldron/x86_64/media/core/release/lib64lcms2_2-2.19.1-1.mga11.x86_64.rpm
0% of 0 completed, ETA = --:--:--, speed = 0
100% of 188k completed, ETA = --:--:--, speed = 15.3M
http://repository.mageia.org/distrib/cauldron/x86_64/media/core/release/lib64xcb-shm0-1.17.0-2.mga10.x86_64.rpm
0% of 0 completed, ETA = --:--:--, speed = 0
100% of 12066 completed, ETA = --:--:--, speed = 11.5M
http://repository.mageia.org/distrib/cauldron/x86_64/media/core/release/lib64xcb1-1.17.0-2.mga10.x86_64.rpm
0% of 0 completed, ETA = --:--:--, speed = 0
100% of 56093 completed, ETA = --:--:--, speed = 53.4M
http://repository.mageia.org/distrib/cauldron/x86_64/media/core/release/java-25-openjdk-devel-25.0.4.1.1-4.mga11.x86_64.rpm
0% of 0 completed, ETA = --:--:--, speed = 0
100% of 6202k completed, ETA = --:--:--, speed = 112M
http://repository.mageia.org/distrib/cauldron/x86_64/media/core/release/dola-transformer-1.0.2-1.mga11.noarch.rpm
0% of 0 completed, ETA = --:--:--, speed = 0
100% of 31149 completed, ETA = --:--:--, speed = 29.7M
http://repository.mageia.org/distrib/cauldron/x86_64/media/core/release/lib64cairo2-1.18.6-1.mga11.x86_64.rpm
0% of 0 completed, ETA = --:--:--, speed = 0
100% of 792k completed, ETA = --:--:--, speed = 110M
http://repository.mageia.org/distrib/cauldron/x86_64/media/core/release/x11-font-xfree86-type1-1.0.5-2.mga10.noarch.rpm
0% of 0 completed, ETA = --:--:--, speed = 0
100% of 35747 completed, ETA = --:--:--, speed = 34.0M
http://repository.mageia.org/distrib/cauldron/x86_64/media/core/release/plexus-utils4-4.0.2-1.mga11.noarch.rpm
0% of 0 completed, ETA = --:--:--, speed = 0
100% of 185k completed, ETA = --:--:--, speed = 181M
http://repository.mageia.org/distrib/cauldron/x86_64/media/core/release/x11-font-type1-1.0.0-19.mga10.noarch.rpm
0% of 0 completed, ETA = --:--:--, speed = 0
100% of 6421 completed, ETA = --:--:--, speed = 6270k
http://repository.mageia.org/distrib/cauldron/x86_64/media/core/release/lib64xau6-1.0.12-2.mga10.x86_64.rpm
0% of 0 completed, ETA = --:--:--, speed = 0
100% of 13251 completed, ETA = --:--:--, speed = 12.6M
http://repository.mageia.org/distrib/cauldron/x86_64/media/core/release/mkfontscale-1.2.4-1.mga11.x86_64.rpm
0% of 0 completed, ETA = --:--:--, speed = 0
100% of 33771 completed, ETA = --:--:--, speed = 32.2M
http://repository.mageia.org/distrib/cauldron/x86_64/media/core/release/lib64xdmcp6-1.1.5-2.mga10.x86_64.rpm
0% of 0 completed, ETA = --:--:--, speed = 0
100% of 16566 completed, ETA = --:--:--, speed = 15.7M
http://repository.mageia.org/distrib/cauldron/x86_64/media/core/release/lib64harfbuzz0-14.5.0-1.mga11.x86_64.rpm
0% of 0 completed, ETA = --:--:--, speed = 0
100% of 1545k completed, ETA = --:--:--, speed = 116M
http://repository.mageia.org/distrib/cauldron/x86_64/media/core/release/lib64fontenc1-1.1.9-1.mga11.x86_64.rpm
0% of 0 completed, ETA = --:--:--, speed = 0
100% of 20749 completed, ETA = --:--:--, speed = 19.7M
http://repository.mageia.org/distrib/cauldron/x86_64/media/core/release/lib64jpeg8-3.2.0-1.mga11.x86_64.rpm
0% of 0 completed, ETA = --:--:--, speed = 0
100% of 276k completed, ETA = --:--:--, speed = 135M
http://repository.mageia.org/distrib/cauldron/x86_64/media/core/release/dola-gleaner-1.1.1-1.mga11.noarch.rpm
0% of 0 completed, ETA = --:--:--, speed = 0
100% of 38106 completed, ETA = --:--:--, speed = 36.3M
http://repository.mageia.org/distrib/cauldron/x86_64/media/core/release/lib64pixman1_0-0.46.4-1.mga10.x86_64.rpm
0% of 0 completed, ETA = --:--:--, speed = 0
100% of 287k completed, ETA = --:--:--, speed = 140M
http://repository.mageia.org/distrib/cauldron/x86_64/media/core/release/javapackages-filesystem-6.5.1-8.mga11.noarch.rpm
0% of 0 completed, ETA = --:--:--, speed = 0
100% of 11271 completed, ETA = --:--:--, speed = 10.7M
http://repository.mageia.org/distrib/cauldron/x86_64/media/core/release/lua-5.4.8-1.mga10.x86_64.rpm
0% of 0 completed, ETA = --:--:--, speed = 0
100% of 215k completed, ETA = --:--:--, speed = 104M
http://repository.mageia.org/distrib/cauldron/x86_64/media/core/release/fonts-filesystem-2.0.5-7.mga10.noarch.rpm
0% of 0 completed, ETA = --:--:--, speed = 0
100% of 7335 completed, ETA = --:--:--, speed = 7163k
http://repository.mageia.org/distrib/cauldron/x86_64/media/core/release/lksctp-tools-1.0.21-2.mga10.x86_64.rpm
0% of 0 completed, ETA = --:--:--, speed = 0
100% of 50628 completed, ETA = --:--:--, speed = 48.2M
http://repository.mageia.org/distrib/cauldron/x86_64/media/core/release/lib64alsa2-1.2.16.1-1.mga11.x86_64.rpm
0% of 0 completed, ETA = --:--:--, speed = 0
100% of 530k completed, ETA = --:--:--, speed = 47.1M
http://repository.mageia.org/distrib/cauldron/x86_64/media/core/release/nss-3.130.0-1.mga11.x86_64.rpm
0% of 0 completed, ETA = --:--:--, speed = 0
100% of 7951k completed, ETA = --:--:--, speed = 112M
http://repository.mageia.org/distrib/cauldron/x86_64/media/core/release/libalsa-data-1.2.16.1-1.mga11.noarch.rpm
0% of 0 completed, ETA = --:--:--, speed = 0
100% of 274k completed, ETA = --:--:--, speed = 134M
http://repository.mageia.org/distrib/cauldron/x86_64/media/core/release/copy-jdk-configs-4.1-3.mga10.noarch.rpm
0% of 0 completed, ETA = --:--:--, speed = 0
100% of 26999 completed, ETA = --:--:--, speed = 25.7M
http://repository.mageia.org/distrib/cauldron/x86_64/media/core/release/lib64png16_16-1.6.58-1.mga11.x86_64.rpm
0% of 0 completed, ETA = --:--:--, speed = 0
100% of 198k completed, ETA = --:--:--, speed = 194M
http://repository.mageia.org/distrib/cauldron/x86_64/media/core/release/publicsuffix-list-20260624-1.mga11.noarch.rpm
0% of 0 completed, ETA = --:--:--, speed = 0
100% of 94020 completed, ETA = --:--:--, speed = 89.6M
http://repository.mageia.org/distrib/cauldron/x86_64/media/core/release/lib64xrender1-0.9.12-2.mga10.x86_64.rpm
0% of 0 completed, ETA = --:--:--, speed = 0
100% of 25003 completed, ETA = --:--:--, speed = 23.8M
http://repository.mageia.org/distrib/cauldron/x86_64/media/core/release/lib64xi6-1.8.3-1.mga11.x86_64.rpm
0% of 0 completed, ETA = --:--:--, speed = 0
100% of 40476 completed, ETA = --:--:--, speed = 38.6M
http://repository.mageia.org/distrib/cauldron/x86_64/media/core/release/java-25-openjdk-25.0.4.1.1-4.mga11.x86_64.rpm
0% of 0 completed, ETA = --:--:--, speed = 0
100% of 226k completed, ETA = --:--:--, speed = 110M
http://repository.mageia.org/distrib/cauldron/x86_64/media/core/release/lib64freetype6-2.14.3-2.mga11.x86_64.rpm
0% of 0 completed, ETA = --:--:--, speed = 0
100% of 391k completed, ETA = --:--:--, speed = 25.4M
http://repository.mageia.org/distrib/cauldron/x86_64/media/core/release/x11-font-bitstream-type1-1.0.4-2.mga10.noarch.rpm
0% of 0 completed, ETA = --:--:--, speed = 0
100% of 307k completed, ETA = --:--:--, speed = 150M
http://repository.mageia.org/distrib/cauldron/x86_64/media/core/release/lib64sctp1-1.0.21-2.mga10.x86_64.rpm
0% of 0 completed, ETA = --:--:--, speed = 0
100% of 48395 completed, ETA = --:--:--, speed = 46.1M
http://repository.mageia.org/distrib/cauldron/x86_64/media/core/release/python3-lxml-6.0.2-1.mga10.x86_64.rpm
0% of 0 completed, ETA = --:--:--, speed = 0
100% of 2212k completed, ETA = --:--:--, speed = 113M
http://repository.mageia.org/distrib/cauldron/x86_64/media/core/release/lib64gif7-5.2.2-5.mga11.x86_64.rpm
0% of 0 completed, ETA = --:--:--, speed = 0
100% of 42570 completed, ETA = --:--:--, speed = 40.5M
http://repository.mageia.org/distrib/cauldron/x86_64/media/core/release/lua-posix-35.0-5.mga10.x86_64.rpm
0% of 0 completed, ETA = --:--:--, speed = 0
100% of 126k completed, ETA = --:--:--, speed = 123M
http://repository.mageia.org/distrib/cauldron/x86_64/media/core/release/lib64nss3-3.130.0-1.mga11.x86_64.rpm
0% of 0 completed, ETA = --:--:--, speed = 0
100% of 1437k completed, ETA = --:--:--, speed = 116M
http://repository.mageia.org/distrib/cauldron/x86_64/media/core/release/fontconfig-2.17.1-2.mga10.x86_64.rpm
0% of 0 completed, ETA = --:--:--, speed = 0
100% of 102k completed, ETA = --:--:--, speed = 100M
http://repository.mageia.org/distrib/cauldron/x86_64/media/core/release/lib64nspr4-4.40.0-1.mga11.x86_64.rpm
0% of 0 completed, ETA = --:--:--, speed = 0
100% of 136k completed, ETA = --:--:--, speed = 133M
http://repository.mageia.org/distrib/cauldron/x86_64/media/core/release/lib64xext6-1.3.7-1.mga11.x86_64.rpm
0% of 0 completed, ETA = --:--:--, speed = 0
100% of 63441 completed, ETA = --:--:--, speed = 60.5M
http://repository.mageia.org/distrib/cauldron/x86_64/media/core/release/lib64x11_6-1.8.13-1.mga11.x86_64.rpm
0% of 0 completed, ETA = --:--:--, speed = 0
100% of 672k completed, ETA = --:--:--, speed = 109M
http://repository.mageia.org/distrib/cauldron/x86_64/media/core/release/lib64xtst6-1.2.5-3.mga11.x86_64.rpm
0% of 0 completed, ETA = --:--:--, speed = 0
100% of 18546 completed, ETA = --:--:--, speed = 17.6M
http://repository.mageia.org/distrib/cauldron/x86_64/media/core/release/timezone-java-2025b-1.mga10.noarch.rpm
0% of 0 completed, ETA = --:--:--, speed = 0
100% of 143k completed, ETA = --:--:--, speed = 140M
http://repository.mageia.org/distrib/cauldron/x86_64/media/core/release/lib64xcb-render0-1.17.0-2.mga10.x86_64.rpm
0% of 0 completed, ETA = --:--:--, speed = 0
100% of 22146 completed, ETA = --:--:--, speed = 21.1M
http://repository.mageia.org/distrib/cauldron/x86_64/media/core/release/lib64fontconfig1-2.17.1-2.mga10.x86_64.rpm
0% of 0 completed, ETA = --:--:--, speed = 0
100% of 146k completed, ETA = --:--:--, speed = 142M
http://repository.mageia.org/distrib/cauldron/x86_64/media/core/release/lib64xcomposite1-0.4.7-1.mga11.x86_64.rpm
0% of 0 completed, ETA = --:--:--, speed = 0
100% of 11892 completed, ETA = --:--:--, speed = 11.3M
retrieved java-25-openjdk-headless-25.0.4.1.1-4.mga11.x86_64.rpm lib64graphite2_3-1.3.15-1.mga11.x86_64.rpm lujavrite-1.2.3-1.mga10.x86_64.rpm rootcerts-java-20260714.00-1.mga11.noarch.rpm lib64lcms2_2-2.19.1-1.mga11.x86_64.rpm lib64xcb-shm0-1.17.0-2.mga10.x86_64.rpm lib64xcb1-1.17.0-2.mga10.x86_64.rpm java-25-openjdk-devel-25.0.4.1.1-4.mga11.x86_64.rpm dola-transformer-1.0.2-1.mga11.noarch.rpm lib64cairo2-1.18.6-1.mga11.x86_64.rpm x11-font-xfree86-type1-1.0.5-2.mga10.noarch.rpm plexus-utils4-4.0.2-1.mga11.noarch.rpm x11-font-type1-1.0.0-19.mga10.noarch.rpm lib64xau6-1.0.12-2.mga10.x86_64.rpm mkfontscale-1.2.4-1.mga11.x86_64.rpm lib64xdmcp6-1.1.5-2.mga10.x86_64.rpm lib64harfbuzz0-14.5.0-1.mga11.x86_64.rpm lib64fontenc1-1.1.9-1.mga11.x86_64.rpm lib64jpeg8-3.2.0-1.mga11.x86_64.rpm dola-gleaner-1.1.1-1.mga11.noarch.rpm lib64pixman1_0-0.46.4-1.mga10.x86_64.rpm javapackages-filesystem-6.5.1-8.mga11.noarch.rpm lua-5.4.8-1.mga10.x86_64.rpm fonts-filesystem-2.0.5-7.mga10.noarch.rpm lksctp-tools-1.0.21-2.mga10.x86_64.rpm lib64alsa2-1.2.16.1-1.mga11.x86_64.rpm nss-3.130.0-1.mga11.x86_64.rpm libalsa-data-1.2.16.1-1.mga11.noarch.rpm copy-jdk-configs-4.1-3.mga10.noarch.rpm lib64png16_16-1.6.58-1.mga11.x86_64.rpm publicsuffix-list-20260624-1.mga11.noarch.rpm lib64xrender1-0.9.12-2.mga10.x86_64.rpm lib64xi6-1.8.3-1.mga11.x86_64.rpm java-25-openjdk-25.0.4.1.1-4.mga11.x86_64.rpm lib64freetype6-2.14.3-2.mga11.x86_64.rpm x11-font-bitstream-type1-1.0.4-2.mga10.noarch.rpm lib64sctp1-1.0.21-2.mga10.x86_64.rpm python3-lxml-6.0.2-1.mga10.x86_64.rpm lib64gif7-5.2.2-5.mga11.x86_64.rpm lua-posix-35.0-5.mga10.x86_64.rpm lib64nss3-3.130.0-1.mga11.x86_64.rpm fontconfig-2.17.1-2.mga10.x86_64.rpm lib64nspr4-4.40.0-1.mga11.x86_64.rpm lib64xext6-1.3.7-1.mga11.x86_64.rpm lib64x11_6-1.8.13-1.mga11.x86_64.rpm lib64xtst6-1.2.5-3.mga11.x86_64.rpm timezone-java-2025b-1.mga10.noarch.rpm lib64xcb-render0-1.17.0-2.mga10.x86_64.rpm lib64fontconfig1-2.17.1-2.mga10.x86_64.rpm lib64xcomposite1-0.4.7-1.mga11.x86_64.rpm
...retrieving done
installing lib64nspr4-4.40.0-1.mga11.x86_64.rpm lib64xext6-1.3.7-1.mga11.x86_64.rpm timezone-java-2025b-1.mga10.noarch.rpm lib64xcb-render0-1.17.0-2.mga10.x86_64.rpm lib64xtst6-1.2.5-3.mga11.x86_64.rpm lib64x11_6-1.8.13-1.mga11.x86_64.rpm lib64xcomposite1-0.4.7-1.mga11.x86_64.rpm lib64fontconfig1-2.17.1-2.mga10.x86_64.rpm copy-jdk-configs-4.1-3.mga10.noarch.rpm lib64png16_16-1.6.58-1.mga11.x86_64.rpm libalsa-data-1.2.16.1-1.mga11.noarch.rpm lib64alsa2-1.2.16.1-1.mga11.x86_64.rpm nss-3.130.0-1.mga11.x86_64.rpm lksctp-tools-1.0.21-2.mga10.x86_64.rpm lib64xi6-1.8.3-1.mga11.x86_64.rpm lib64xrender1-0.9.12-2.mga10.x86_64.rpm publicsuffix-list-20260624-1.mga11.noarch.rpm python3-lxml-6.0.2-1.mga10.x86_64.rpm lib64sctp1-1.0.21-2.mga10.x86_64.rpm x11-font-bitstream-type1-1.0.4-2.mga10.noarch.rpm java-25-openjdk-25.0.4.1.1-4.mga11.x86_64.rpm lib64freetype6-2.14.3-2.mga11.x86_64.rpm fontconfig-2.17.1-2.mga10.x86_64.rpm lib64nss3-3.130.0-1.mga11.x86_64.rpm lua-posix-35.0-5.mga10.x86_64.rpm lib64gif7-5.2.2-5.mga11.x86_64.rpm lib64harfbuzz0-14.5.0-1.mga11.x86_64.rpm lib64xdmcp6-1.1.5-2.mga10.x86_64.rpm dola-gleaner-1.1.1-1.mga11.noarch.rpm lib64jpeg8-3.2.0-1.mga11.x86_64.rpm lib64fontenc1-1.1.9-1.mga11.x86_64.rpm fonts-filesystem-2.0.5-7.mga10.noarch.rpm javapackages-filesystem-6.5.1-8.mga11.noarch.rpm lua-5.4.8-1.mga10.x86_64.rpm lib64pixman1_0-0.46.4-1.mga10.x86_64.rpm rootcerts-java-20260714.00-1.mga11.noarch.rpm lujavrite-1.2.3-1.mga10.x86_64.rpm lib64graphite2_3-1.3.15-1.mga11.x86_64.rpm java-25-openjdk-headless-25.0.4.1.1-4.mga11.x86_64.rpm lib64xcb1-1.17.0-2.mga10.x86_64.rpm lib64lcms2_2-2.19.1-1.mga11.x86_64.rpm lib64xcb-shm0-1.17.0-2.mga10.x86_64.rpm dola-transformer-1.0.2-1.mga11.noarch.rpm java-25-openjdk-devel-25.0.4.1.1-4.mga11.x86_64.rpm mkfontscale-1.2.4-1.mga11.x86_64.rpm lib64xau6-1.0.12-2.mga10.x86_64.rpm x11-font-type1-1.0.0-19.mga10.noarch.rpm plexus-utils4-4.0.2-1.mga11.noarch.rpm x11-font-xfree86-type1-1.0.5-2.mga10.noarch.rpm lib64cairo2-1.18.6-1.mga11.x86_64.rpm from /home/iurt/chroot_tmp/iurt/chroot_cauldron.x86_64.0.20261003104844/var/cache/urpmi/rpms
starting installing packages
created transaction for installing on /home/iurt/chroot_tmp/iurt/chroot_cauldron.x86_64.0.20261003104844 (remove=0, install=0, upgrade=50)
Preparing... #############################################
1/159: lib64png16_16 #############################################
2/159: javapackages-filesystem
#############################################
3/159: lib64jpeg8 #############################################
4/159: lib64nspr4 #############################################
5/159: nss #############################################
6/159: lib64nss3 #############################################
shell-init: error retrieving current directory: getcwd: cannot access parent directories: No such file or directory
shell-init: error retrieving current directory: getcwd: cannot access parent directories: No such file or directory
7/159: lib64xau6 #############################################
8/159: lib64lcms2_2 #############################################
9/159: lib64graphite2_3 #############################################
10/159: rootcerts-java #############################################
11/159: lib64pixman1_0 #############################################
12/159: lua #############################################
13/159: fonts-filesystem #############################################
14/159: lib64fontenc1 #############################################
15/159: lib64xdmcp6 #############################################
16/159: lib64xcb1 #############################################
17/159: lib64x11_6 #############################################
shell-init: error retrieving current directory: getcwd: cannot access parent directories: No such file or directory
18/159: lib64xext6 #############################################
19/159: lib64xrender1 #############################################
20/159: lib64xtst6 #############################################
21/159: lib64xi6 #############################################
22/159: lib64xcomposite1 #############################################
23/159: lib64xcb-render0 #############################################
24/159: lib64xcb-shm0 #############################################
25/159: lib64cairo2 #############################################
26/159: lib64harfbuzz0 #############################################
27/159: lib64freetype6 #############################################
28/159: lib64fontconfig1 #############################################
29/159: fontconfig #############################################
shell-init: error retrieving current directory: getcwd: cannot access parent directories: No such file or directory
30/159: mkfontscale #############################################
31/159: x11-font-bitstream-type1
#############################################
shell-init: error retrieving current directory: getcwd: cannot access parent directories: No such file or directory
32/159: x11-font-xfree86-type1
#############################################
shell-init: error retrieving current directory: getcwd: cannot access parent directories: No such file or directory
33/159: x11-font-type1 #############################################
34/159: lib64gif7 #############################################
35/159: lua-posix #############################################
36/159: copy-jdk-configs #############################################
37/159: lib64sctp1 #############################################
38/159: lksctp-tools #############################################
39/159: libalsa-data #############################################
shell-init: error retrieving current directory: getcwd: cannot access parent directories: No such file or directory
40/159: lib64alsa2 #############################################
41/159: timezone-java #############################################
42/159: java-25-openjdk-headless
#############################################
shell-init: error retrieving current directory: getcwd: cannot access parent directories: No such file or directory
43/159: java-25-openjdk #############################################
shell-init: error retrieving current directory: getcwd: cannot access parent directories: No such file or directory
44/159: java-25-openjdk-devel #############################################
shell-init: error retrieving current directory: getcwd: cannot access parent directories: No such file or directory
45/159: plexus-utils4 #############################################
46/159: dola-transformer #############################################
47/159: lujavrite #############################################
48/159: dola-gleaner #############################################
49/159: python3-lxml #############################################
50/159: publicsuffix-list #############################################
shell-init: error retrieving current directory: getcwd: cannot access parent directories: No such file or directory
shell-init: error retrieving current directory: getcwd: cannot access parent directories: No such file or directory
shell-init: error retrieving current directory: getcwd: cannot access parent directories: No such file or directory
shell-init: error retrieving current directory: getcwd: cannot access parent directories: No such file or directory
shell-init: error retrieving current directory: getcwd: cannot access parent directories: No such file or directory
shell-init: error retrieving current directory: getcwd: cannot access parent directories: No such file or directory
shell-init: error retrieving current directory: getcwd: cannot access parent directories: No such file or directory
shell-init: error retrieving current directory: getcwd: cannot access parent directories: No such file or directory
shell-init: error retrieving current directory: getcwd: cannot access parent directories: No such file or directory
retrieving rpm files from medium "core_release"...
http://repository.mageia.org/distrib/cauldron/x86_64/media/core/release/woodstox-core-7.1.0-1.mga11.noarch.rpm
0% of 0 completed, ETA = --:--:--, speed = 0
100% of 488k completed, ETA = --:--:--, speed = 95.4M
http://repository.mageia.org/distrib/cauldron/x86_64/media/core/release/mockito-5.8.0-3.mga11.noarch.rpm
0% of 0 completed, ETA = --:--:--, speed = 0
100% of 590k completed, ETA = --:--:--, speed = 115M
http://repository.mageia.org/distrib/cauldron/x86_64/media/core/release/httpcomponents-core-4.4.16-4.mga11.noarch.rpm
0% of 0 completed, ETA = --:--:--, speed = 0
100% of 631k completed, ETA = --:--:--, speed = 123M
http://repository.mageia.org/distrib/cauldron/x86_64/media/core/release/apache-commons-codec-1.19.0-1.mga11.noarch.rpm
0% of 0 completed, ETA = --:--:--, speed = 0
100% of 315k completed, ETA = --:--:--, speed = 154M
http://repository.mageia.org/distrib/cauldron/x86_64/media/core/release/jline-3.30.4-1.mga11.x86_64.rpm
0% of 0 completed, ETA = --:--:--, speed = 0
100% of 1120k completed, ETA = --:--:--, speed = 121M
http://repository.mageia.org/distrib/cauldron/x86_64/media/core/release/maven4-4.0.0~rc.4-1.mga11.noarch.rpm
0% of 0 completed, ETA = --:--:--, speed = 0
100% of 18856 completed, ETA = --:--:--, speed = 17.9M
http://repository.mageia.org/distrib/cauldron/x86_64/media/core/release/apache-commons-lang3-3.19.0-2.mga11.noarch.rpm
0% of 0 completed, ETA = --:--:--, speed = 0
100% of 666k completed, ETA = --:--:--, speed = 130M
http://repository.mageia.org/distrib/cauldron/x86_64/media/core/release/maven-resolver2-2.0.9-1.mga11.noarch.rpm
0% of 0 completed, ETA = --:--:--, speed = 0
100% of 935k completed, ETA = --:--:--, speed = 114M
http://repository.mageia.org/distrib/cauldron/x86_64/media/core/release/plexus-sec-dispatcher4-4.1.0-1.mga11.noarch.rpm
0% of 0 completed, ETA = --:--:--, speed = 0
100% of 81478 completed, ETA = --:--:--, speed = 77.7M
http://repository.mageia.org/distrib/cauldron/x86_64/media/core/release/jakarta-annotations-1.3.5-19.mga11.noarch.rpm
0% of 0 completed, ETA = --:--:--, speed = 0
100% of 44469 completed, ETA = --:--:--, speed = 42.4M
http://repository.mageia.org/distrib/cauldron/x86_64/media/core/release/xz-java-1.12-1.mga11.noarch.rpm
0% of 0 completed, ETA = --:--:--, speed = 0
100% of 158k completed, ETA = --:--:--, speed = 154M
http://repository.mageia.org/distrib/cauldron/x86_64/media/core/release/jansi-2.4.3-1.mga11.x86_64.rpm
0% of 0 completed, ETA = --:--:--, speed = 0
100% of 115k completed, ETA = --:--:--, speed = 112M
http://repository.mageia.org/distrib/cauldron/x86_64/media/core/release/maven4-lib-4.0.0~rc.4-1.mga11.noarch.rpm
0% of 0 completed, ETA = --:--:--, speed = 0
100% of 16.1M completed, ETA = --:--:--, speed = 112M
http://repository.mageia.org/distrib/cauldron/x86_64/media/core/release/google-gson-2.12.1-1.mga11.noarch.rpm
0% of 0 completed, ETA = --:--:--, speed = 0
100% of 305k completed, ETA = --:--:--, speed = 99.5M
http://repository.mageia.org/distrib/cauldron/x86_64/media/core/release/maven-source-plugin-3.3.0-3.mga11.noarch.rpm
0% of 0 completed, ETA = --:--:--, speed = 0
100% of 31902 completed, ETA = --:--:--, speed = 30.4M
http://repository.mageia.org/distrib/cauldron/x86_64/media/core/release/byte-buddy-1.18.7-1.mga11.noarch.rpm
0% of 0 completed, ETA = --:--:--, speed = 0
100% of 3502k completed, ETA = --:--:--, speed = 114M
http://repository.mageia.org/distrib/cauldron/x86_64/media/core/release/plexus-xml-4.0.4-1.mga11.noarch.rpm
0% of 0 completed, ETA = --:--:--, speed = 0
100% of 98643 completed, ETA = --:--:--, speed = 94.0M
http://repository.mageia.org/distrib/cauldron/x86_64/media/core/release/sisu-1.0.0-1.mga11.noarch.rpm
0% of 0 completed, ETA = --:--:--, speed = 0
100% of 452k completed, ETA = --:--:--, speed = 110M
http://repository.mageia.org/distrib/cauldron/x86_64/media/core/release/plexus-io-3.5.2-1.mga11.noarch.rpm
0% of 0 completed, ETA = --:--:--, speed = 0
100% of 78233 completed, ETA = --:--:--, speed = 74.6M
http://repository.mageia.org/distrib/cauldron/x86_64/media/core/release/slf4j2-2.0.17-1.mga11.noarch.rpm
0% of 0 completed, ETA = --:--:--, speed = 0
100% of 93131 completed, ETA = --:--:--, speed = 88.8M
http://repository.mageia.org/distrib/cauldron/x86_64/media/core/release/aopalliance-1.0-22.mga11.noarch.rpm
0% of 0 completed, ETA = --:--:--, speed = 0
100% of 14349 completed, ETA = --:--:--, speed = 13.6M
http://repository.mageia.org/distrib/cauldron/x86_64/media/core/release/junit-4.13.2-6.mga11.noarch.rpm
0% of 0 completed, ETA = --:--:--, speed = 0
100% of 344k completed, ETA = --:--:--, speed = 112M
http://repository.mageia.org/distrib/cauldron/x86_64/media/core/release/google-guice-5.1.0-3.mga11.noarch.rpm
0% of 0 completed, ETA = --:--:--, speed = 0
100% of 597k completed, ETA = --:--:--, speed = 116M
http://repository.mageia.org/distrib/cauldron/x86_64/media/core/release/jakarta-inject1.0-1.0.5-4.mga11.noarch.rpm
0% of 0 completed, ETA = --:--:--, speed = 0
100% of 22407 completed, ETA = --:--:--, speed = 21.3M
http://repository.mageia.org/distrib/cauldron/x86_64/media/core/release/plexus-classworlds-2.12.0-1.mga11.noarch.rpm
0% of 0 completed, ETA = --:--:--, speed = 0
100% of 60915 completed, ETA = --:--:--, speed = 58.0M
http://repository.mageia.org/distrib/cauldron/x86_64/media/core/release/plexus-interpolation-1.28-1.mga11.noarch.rpm
0% of 0 completed, ETA = --:--:--, speed = 0
100% of 81333 completed, ETA = --:--:--, speed = 77.5M
http://repository.mageia.org/distrib/cauldron/x86_64/media/core/release/slf4j-1.7.36-3.mga11.noarch.rpm
0% of 0 completed, ETA = --:--:--, speed = 0
100% of 69687 completed, ETA = --:--:--, speed = 66.4M
http://repository.mageia.org/distrib/cauldron/x86_64/media/core/release/maven-archiver-3.6.2-2.mga11.noarch.rpm
0% of 0 completed, ETA = --:--:--, speed = 0
100% of 35962 completed, ETA = --:--:--, speed = 34.2M
http://repository.mageia.org/distrib/cauldron/x86_64/media/core/release/apache-commons-io-2.20.0-1.mga11.noarch.rpm
0% of 0 completed, ETA = --:--:--, speed = 0
100% of 523k completed, ETA = --:--:--, speed = 127M
http://repository.mageia.org/distrib/cauldron/x86_64/media/core/release/jcl-over-slf4j-1.7.36-3.mga11.noarch.rpm
0% of 0 completed, ETA = --:--:--, speed = 0
100% of 22901 completed, ETA = --:--:--, speed = 21.8M
http://repository.mageia.org/distrib/cauldron/x86_64/media/core/release/stax2-api-4.3.0-1.mga11.noarch.rpm
0% of 0 completed, ETA = --:--:--, speed = 0
100% of 178k completed, ETA = --:--:--, speed = 174M
http://repository.mageia.org/distrib/cauldron/x86_64/media/core/release/hamcrest-3.0-1.mga11.noarch.rpm
0% of 0 completed, ETA = --:--:--, speed = 0
100% of 119k completed, ETA = --:--:--, speed = 116M
http://repository.mageia.org/distrib/cauldron/x86_64/media/core/release/guava-33.5.0-1.mga11.noarch.rpm
0% of 0 completed, ETA = --:--:--, speed = 0
100% of 2495k completed, ETA = --:--:--, speed = 110M
http://repository.mageia.org/distrib/cauldron/x86_64/media/core/release/plexus-interactivity-1.3-1.mga11.noarch.rpm
0% of 0 completed, ETA = --:--:--, speed = 0
100% of 17245 completed, ETA = --:--:--, speed = 16.4M
http://repository.mageia.org/distrib/cauldron/x86_64/media/core/release/jdom2-2.0.6.1-4.mga11.noarch.rpm
0% of 0 completed, ETA = --:--:--, speed = 0
100% of 311k completed, ETA = --:--:--, speed = 151M
http://repository.mageia.org/distrib/cauldron/x86_64/media/core/release/objectweb-asm-9.10.1-1.mga11.noarch.rpm
0% of 0 completed, ETA = --:--:--, speed = 0
100% of 363k completed, ETA = --:--:--, speed = 118M
http://repository.mageia.org/distrib/cauldron/x86_64/media/core/release/httpcomponents-client-4.5.14-3.mga11.noarch.rpm
0% of 0 completed, ETA = --:--:--, speed = 0
100% of 654k completed, ETA = --:--:--, speed = 127M
http://repository.mageia.org/distrib/cauldron/x86_64/media/core/release/jcl-over-slf4j2-2.0.17-1.mga11.noarch.rpm
0% of 0 completed, ETA = --:--:--, speed = 0
100% of 23983 completed, ETA = --:--:--, speed = 22.8M
http://repository.mageia.org/distrib/cauldron/x86_64/media/core/release/plexus-archiver-4.12.0-1.mga11.noarch.rpm
0% of 0 completed, ETA = --:--:--, speed = 0
100% of 188k completed, ETA = --:--:--, speed = 184M
http://repository.mageia.org/distrib/cauldron/x86_64/media/core/release/maven-wagon-3.5.3-3.mga11.noarch.rpm
0% of 0 completed, ETA = --:--:--, speed = 0
100% of 100k completed, ETA = --:--:--, speed = 98.1M
http://repository.mageia.org/distrib/cauldron/x86_64/media/core/release/apache-commons-compress-1.28.0-2.mga11.noarch.rpm
0% of 0 completed, ETA = --:--:--, speed = 0
100% of 614k completed, ETA = --:--:--, speed = 120M
http://repository.mageia.org/distrib/cauldron/x86_64/media/core/release/plexus-utils-3.6.1-1.mga11.noarch.rpm
0% of 0 completed, ETA = --:--:--, speed = 0
100% of 260k completed, ETA = --:--:--, speed = 127M
http://repository.mageia.org/distrib/cauldron/x86_64/media/core/release/byte-buddy-agent-1.18.7-1.mga11.noarch.rpm
0% of 0 completed, ETA = --:--:--, speed = 0
100% of 216k completed, ETA = --:--:--, speed = 105M
http://repository.mageia.org/distrib/cauldron/x86_64/media/core/release/objenesis-3.5-1.mga11.noarch.rpm
0% of 0 completed, ETA = --:--:--, speed = 0
6% of 107k completed, ETA = --:--:--, speed = 6810k
100% of 107k completed, ETA = --:--:--, speed = 52.6M
http://repository.mageia.org/distrib/cauldron/x86_64/media/core/release/maven4-openjdk25-4.0.0~rc.4-1.mga11.noarch.rpm
0% of 0 completed, ETA = --:--:--, speed = 0
100% of 7161 completed, ETA = --:--:--, speed = 6993k
http://repository.mageia.org/distrib/cauldron/x86_64/media/core/release/jsr-305-3.0.2-5.mga11.noarch.rpm
0% of 0 completed, ETA = --:--:--, speed = 0
100% of 34468 completed, ETA = --:--:--, speed = 32.8M
http://repository.mageia.org/distrib/cauldron/x86_64/media/core/release/javapackages-tools-6.5.1-8.mga11.noarch.rpm
0% of 0 completed, ETA = --:--:--, speed = 0
100% of 34337 completed, ETA = --:--:--, speed = 32.7M
http://repository.mageia.org/distrib/cauldron/x86_64/media/core/release/plexus-containers-component-annotations-2.2.0-4.mga11.noarch.rpm
0% of 0 completed, ETA = --:--:--, speed = 0
100% of 15901 completed, ETA = --:--:--, speed = 15.1M
http://repository.mageia.org/distrib/cauldron/x86_64/media/core/release/opentest4j-1.3.0-4.mga11.noarch.rpm
0% of 0 completed, ETA = --:--:--, speed = 0
100% of 25525 completed, ETA = --:--:--, speed = 24.3M
http://repository.mageia.org/distrib/cauldron/x86_64/media/core/release/apache-commons-cli-1.10.0-1.mga11.noarch.rpm
0% of 0 completed, ETA = --:--:--, speed = 0
100% of 119k completed, ETA = --:--:--, speed = 116M
retrieved woodstox-core-7.1.0-1.mga11.noarch.rpm mockito-5.8.0-3.mga11.noarch.rpm httpcomponents-core-4.4.16-4.mga11.noarch.rpm apache-commons-codec-1.19.0-1.mga11.noarch.rpm jline-3.30.4-1.mga11.x86_64.rpm maven4-4.0.0~rc.4-1.mga11.noarch.rpm apache-commons-lang3-3.19.0-2.mga11.noarch.rpm maven-resolver2-2.0.9-1.mga11.noarch.rpm plexus-sec-dispatcher4-4.1.0-1.mga11.noarch.rpm jakarta-annotations-1.3.5-19.mga11.noarch.rpm xz-java-1.12-1.mga11.noarch.rpm jansi-2.4.3-1.mga11.x86_64.rpm maven4-lib-4.0.0~rc.4-1.mga11.noarch.rpm google-gson-2.12.1-1.mga11.noarch.rpm maven-source-plugin-3.3.0-3.mga11.noarch.rpm byte-buddy-1.18.7-1.mga11.noarch.rpm plexus-xml-4.0.4-1.mga11.noarch.rpm sisu-1.0.0-1.mga11.noarch.rpm plexus-io-3.5.2-1.mga11.noarch.rpm slf4j2-2.0.17-1.mga11.noarch.rpm aopalliance-1.0-22.mga11.noarch.rpm junit-4.13.2-6.mga11.noarch.rpm google-guice-5.1.0-3.mga11.noarch.rpm jakarta-inject1.0-1.0.5-4.mga11.noarch.rpm plexus-classworlds-2.12.0-1.mga11.noarch.rpm plexus-interpolation-1.28-1.mga11.noarch.rpm slf4j-1.7.36-3.mga11.noarch.rpm maven-archiver-3.6.2-2.mga11.noarch.rpm apache-commons-io-2.20.0-1.mga11.noarch.rpm jcl-over-slf4j-1.7.36-3.mga11.noarch.rpm stax2-api-4.3.0-1.mga11.noarch.rpm hamcrest-3.0-1.mga11.noarch.rpm guava-33.5.0-1.mga11.noarch.rpm plexus-interactivity-1.3-1.mga11.noarch.rpm jdom2-2.0.6.1-4.mga11.noarch.rpm objectweb-asm-9.10.1-1.mga11.noarch.rpm httpcomponents-client-4.5.14-3.mga11.noarch.rpm jcl-over-slf4j2-2.0.17-1.mga11.noarch.rpm plexus-archiver-4.12.0-1.mga11.noarch.rpm maven-wagon-3.5.3-3.mga11.noarch.rpm apache-commons-compress-1.28.0-2.mga11.noarch.rpm plexus-utils-3.6.1-1.mga11.noarch.rpm byte-buddy-agent-1.18.7-1.mga11.noarch.rpm objenesis-3.5-1.mga11.noarch.rpm maven4-openjdk25-4.0.0~rc.4-1.mga11.noarch.rpm jsr-305-3.0.2-5.mga11.noarch.rpm javapackages-tools-6.5.1-8.mga11.noarch.rpm plexus-containers-component-annotations-2.2.0-4.mga11.noarch.rpm opentest4j-1.3.0-4.mga11.noarch.rpm apache-commons-cli-1.10.0-1.mga11.noarch.rpm
...retrieving done
installing httpcomponents-client-4.5.14-3.mga11.noarch.rpm jcl-over-slf4j2-2.0.17-1.mga11.noarch.rpm stax2-api-4.3.0-1.mga11.noarch.rpm hamcrest-3.0-1.mga11.noarch.rpm guava-33.5.0-1.mga11.noarch.rpm jdom2-2.0.6.1-4.mga11.noarch.rpm plexus-interactivity-1.3-1.mga11.noarch.rpm objectweb-asm-9.10.1-1.mga11.noarch.rpm jcl-over-slf4j-1.7.36-3.mga11.noarch.rpm plexus-classworlds-2.12.0-1.mga11.noarch.rpm plexus-interpolation-1.28-1.mga11.noarch.rpm slf4j-1.7.36-3.mga11.noarch.rpm maven-archiver-3.6.2-2.mga11.noarch.rpm apache-commons-io-2.20.0-1.mga11.noarch.rpm apache-commons-cli-1.10.0-1.mga11.noarch.rpm maven4-openjdk25-4.0.0~rc.4-1.mga11.noarch.rpm jsr-305-3.0.2-5.mga11.noarch.rpm javapackages-tools-6.5.1-8.mga11.noarch.rpm plexus-containers-component-annotations-2.2.0-4.mga11.noarch.rpm opentest4j-1.3.0-4.mga11.noarch.rpm maven-wagon-3.5.3-3.mga11.noarch.rpm apache-commons-compress-1.28.0-2.mga11.noarch.rpm plexus-utils-3.6.1-1.mga11.noarch.rpm byte-buddy-agent-1.18.7-1.mga11.noarch.rpm objenesis-3.5-1.mga11.noarch.rpm plexus-archiver-4.12.0-1.mga11.noarch.rpm maven-resolver2-2.0.9-1.mga11.noarch.rpm plexus-sec-dispatcher4-4.1.0-1.mga11.noarch.rpm jline-3.30.4-1.mga11.x86_64.rpm maven4-4.0.0~rc.4-1.mga11.noarch.rpm apache-commons-lang3-3.19.0-2.mga11.noarch.rpm httpcomponents-core-4.4.16-4.mga11.noarch.rpm apache-commons-codec-1.19.0-1.mga11.noarch.rpm woodstox-core-7.1.0-1.mga11.noarch.rpm mockito-5.8.0-3.mga11.noarch.rpm junit-4.13.2-6.mga11.noarch.rpm aopalliance-1.0-22.mga11.noarch.rpm google-guice-5.1.0-3.mga11.noarch.rpm jakarta-inject1.0-1.0.5-4.mga11.noarch.rpm byte-buddy-1.18.7-1.mga11.noarch.rpm plexus-xml-4.0.4-1.mga11.noarch.rpm sisu-1.0.0-1.mga11.noarch.rpm plexus-io-3.5.2-1.mga11.noarch.rpm slf4j2-2.0.17-1.mga11.noarch.rpm maven4-lib-4.0.0~rc.4-1.mga11.noarch.rpm google-gson-2.12.1-1.mga11.noarch.rpm maven-source-plugin-3.3.0-3.mga11.noarch.rpm jakarta-annotations-1.3.5-19.mga11.noarch.rpm jansi-2.4.3-1.mga11.x86_64.rpm xz-java-1.12-1.mga11.noarch.rpm from /home/iurt/chroot_tmp/iurt/chroot_cauldron.x86_64.0.20261003104844/var/cache/urpmi/rpms
starting installing packages
created transaction for installing on /home/iurt/chroot_tmp/iurt/chroot_cauldron.x86_64.0.20261003104844 (remove=0, install=0, upgrade=50)
Preparing... #############################################
51/159: slf4j2 #############################################
52/159: jakarta-inject1.0 #############################################
53/159: apache-commons-codec #############################################
54/159: httpcomponents-core #############################################
55/159: httpcomponents-client #############################################
56/159: plexus-utils #############################################
57/159: apache-commons-io #############################################
58/159: objectweb-asm #############################################
59/159: maven-wagon #############################################
60/159: jcl-over-slf4j2 #############################################
61/159: jakarta-annotations #############################################
62/159: google-gson #############################################
63/159: aopalliance #############################################
64/159: plexus-containers-component-annotations
#############################################
65/159: slf4j #############################################
66/159: plexus-interpolation #############################################
67/159: plexus-classworlds #############################################
68/159: guava #############################################
69/159: stax2-api #############################################
70/159: woodstox-core #############################################
71/159: sisu #############################################
72/159: byte-buddy #############################################
73/159: plexus-io #############################################
74/159: plexus-sec-dispatcher4
#############################################
75/159: xz-java #############################################
76/159: apache-commons-lang3 #############################################
77/159: apache-commons-compress
#############################################
78/159: plexus-archiver #############################################
79/159: maven-archiver #############################################
80/159: jline #############################################
81/159: objenesis #############################################
82/159: byte-buddy-agent #############################################
83/159: opentest4j #############################################
84/159: javapackages-tools #############################################
85/159: maven4-openjdk25 #############################################
86/159: jsr-305 #############################################
87/159: google-guice #############################################
88/159: apache-commons-cli #############################################
89/159: plexus-interactivity #############################################
90/159: jdom2 #############################################
91/159: hamcrest #############################################
92/159: junit #############################################
93/159: mockito #############################################
94/159: maven-resolver2 #############################################
95/159: plexus-xml #############################################
96/159: maven4-lib #############################################
97/159: maven4 #############################################
shell-init: error retrieving current directory: getcwd: cannot access parent directories: No such file or directory
98/159: maven-source-plugin #############################################
99/159: jcl-over-slf4j #############################################
100/159: jansi #############################################
shell-init: error retrieving current directory: getcwd: cannot access parent directories: No such file or directory
shell-init: error retrieving current directory: getcwd: cannot access parent directories: No such file or directory
retrieving rpm files from medium "core_release"...
http://repository.mageia.org/distrib/cauldron/x86_64/media/core/release/kojan-xml-1.0.1-1.mga11.noarch.rpm
0% of 0 completed, ETA = --:--:--, speed = 0
100% of 29751 completed, ETA = --:--:--, speed = 28.3M
http://repository.mageia.org/distrib/cauldron/x86_64/media/core/release/maven-jar-plugin-3.3.0-3.mga11.noarch.rpm
0% of 0 completed, ETA = --:--:--, speed = 0
100% of 28239 completed, ETA = --:--:--, speed = 26.9M
http://repository.mageia.org/distrib/cauldron/x86_64/media/core/release/dola-1.3.2-6.mga11.noarch.rpm
0% of 0 completed, ETA = --:--:--, speed = 0
100% of 116k completed, ETA = --:--:--, speed = 113M
http://repository.mageia.org/distrib/cauldron/x86_64/media/core/release/xmvn5-minimal-5.1.0-1.mga11.noarch.rpm
0% of 0 completed, ETA = --:--:--, speed = 0
100% of 12.5M completed, ETA = --:--:--, speed = 112M
http://repository.mageia.org/distrib/cauldron/x86_64/media/core/release/maven-resources-plugin-3.3.1-3.mga11.noarch.rpm
0% of 0 completed, ETA = --:--:--, speed = 0
100% of 31601 completed, ETA = --:--:--, speed = 30.1M
http://repository.mageia.org/distrib/cauldron/x86_64/media/core/release/osgi-core-8.0.0-10.mga11.noarch.rpm
0% of 0 completed, ETA = --:--:--, speed = 0
100% of 188k completed, ETA = --:--:--, speed = 183M
http://repository.mageia.org/distrib/cauldron/x86_64/media/core/release/aqute-bndlib-6.3.1-6.mga11.noarch.rpm
0% of 0 completed, ETA = --:--:--, speed = 0
100% of 2093k completed, ETA = --:--:--, speed = 113M
http://repository.mageia.org/distrib/cauldron/x86_64/media/core/release/maven-surefire-provider-junit5-3.2.2-4.mga11.noarch.rpm
0% of 0 completed, ETA = --:--:--, speed = 0
100% of 32688 completed, ETA = --:--:--, speed = 31.1M
http://repository.mageia.org/distrib/cauldron/x86_64/media/core/release/xmvn-tools-4.3.0-2.mga11.noarch.rpm
0% of 0 completed, ETA = --:--:--, speed = 0
100% of 110k completed, ETA = --:--:--, speed = 108M
http://repository.mageia.org/distrib/cauldron/x86_64/media/core/release/xmvn-minimal-4.3.0-2.mga11.noarch.rpm
0% of 0 completed, ETA = --:--:--, speed = 0
100% of 8406k completed, ETA = --:--:--, speed = 112M
http://repository.mageia.org/distrib/cauldron/x86_64/media/core/release/maven-lib-3.9.11-4.mga11.noarch.rpm
0% of 0 completed, ETA = --:--:--, speed = 0
100% of 9871k completed, ETA = --:--:--, speed = 112M
http://repository.mageia.org/distrib/cauldron/x86_64/media/core/release/plexus-compiler-2.16.2-1.mga11.noarch.rpm
0% of 0 completed, ETA = --:--:--, speed = 0
100% of 69269 completed, ETA = --:--:--, speed = 66.0M
http://repository.mageia.org/distrib/cauldron/x86_64/media/core/release/maven-surefire-provider-testng-3.2.2-4.mga11.noarch.rpm
0% of 0 completed, ETA = --:--:--, speed = 0
100% of 54444 completed, ETA = --:--:--, speed = 51.9M
http://repository.mageia.org/distrib/cauldron/x86_64/media/core/release/maven-shared-incremental-1.1-30.mga11.noarch.rpm
0% of 0 completed, ETA = --:--:--, speed = 0
100% of 20339 completed, ETA = --:--:--, speed = 19.3M
http://repository.mageia.org/distrib/cauldron/x86_64/media/core/release/plexus-languages-1.5.2-1.mga11.noarch.rpm
0% of 0 completed, ETA = --:--:--, speed = 0
100% of 60242 completed, ETA = --:--:--, speed = 57.4M
http://repository.mageia.org/distrib/cauldron/x86_64/media/core/release/beust-jcommander-1.82-4.mga11.noarch.rpm
0% of 0 completed, ETA = --:--:--, speed = 0
100% of 89893 completed, ETA = --:--:--, speed = 85.7M
http://repository.mageia.org/distrib/cauldron/x86_64/media/core/release/maven-3.9.11-4.mga11.noarch.rpm
0% of 0 completed, ETA = --:--:--, speed = 0
100% of 16753 completed, ETA = --:--:--, speed = 15.9M
http://repository.mageia.org/distrib/cauldron/x86_64/media/core/release/maven-dependency-tree-3.3.0-1.mga11.noarch.rpm
0% of 0 completed, ETA = --:--:--, speed = 0
100% of 44454 completed, ETA = --:--:--, speed = 42.3M
http://repository.mageia.org/distrib/cauldron/x86_64/media/core/release/maven-openjdk25-3.9.11-4.mga11.noarch.rpm
0% of 0 completed, ETA = --:--:--, speed = 0
100% of 7537 completed, ETA = --:--:--, speed = 7360k
http://repository.mageia.org/distrib/cauldron/x86_64/media/core/release/aqute-bnd-6.3.1-6.mga11.noarch.rpm
0% of 0 completed, ETA = --:--:--, speed = 0
100% of 428k completed, ETA = --:--:--, speed = 139M
http://repository.mageia.org/distrib/cauldron/x86_64/media/core/release/maven-surefire-provider-junit-3.2.2-4.mga11.noarch.rpm
0% of 0 completed, ETA = --:--:--, speed = 0
100% of 146k completed, ETA = --:--:--, speed = 142M
http://repository.mageia.org/distrib/cauldron/x86_64/media/core/release/maven-resolver-1.9.27-1.mga11.noarch.rpm
0% of 0 completed, ETA = --:--:--, speed = 0
100% of 745k completed, ETA = --:--:--, speed = 121M
http://repository.mageia.org/distrib/cauldron/x86_64/media/core/release/plexus-build-api0-0.0.7-42.mga11.noarch.rpm
0% of 0 completed, ETA = --:--:--, speed = 0
100% of 24423 completed, ETA = --:--:--, speed = 23.2M
http://repository.mageia.org/distrib/cauldron/x86_64/media/core/release/junit5-5.14.4-1.mga11.noarch.rpm
0% of 0 completed, ETA = --:--:--, speed = 0
100% of 1426k completed, ETA = --:--:--, speed = 116M
http://repository.mageia.org/distrib/cauldron/x86_64/media/core/release/maven-surefire-plugin-3.2.2-4.mga11.noarch.rpm
0% of 0 completed, ETA = --:--:--, speed = 0
100% of 44025 completed, ETA = --:--:--, speed = 41.9M
http://repository.mageia.org/distrib/cauldron/x86_64/media/core/release/ant-lib-1.10.15-8.mga11.noarch.rpm
0% of 0 completed, ETA = --:--:--, speed = 0
100% of 2091k completed, ETA = --:--:--, speed = 113M
http://repository.mageia.org/distrib/cauldron/x86_64/media/core/release/assertj-core-3.26.3-1.mga11.noarch.rpm
0% of 0 completed, ETA = --:--:--, speed = 0
100% of 1279k completed, ETA = --:--:--, speed = 113M
http://repository.mageia.org/distrib/cauldron/x86_64/media/core/release/xmvn5-tools-5.1.0-1.mga11.noarch.rpm
0% of 0 completed, ETA = --:--:--, speed = 0
100% of 106k completed, ETA = --:--:--, speed = 104M
http://repository.mageia.org/distrib/cauldron/x86_64/media/core/release/xmvn-core-4.3.0-2.mga11.noarch.rpm
0% of 0 completed, ETA = --:--:--, speed = 0
100% of 114k completed, ETA = --:--:--, speed = 111M
http://repository.mageia.org/distrib/cauldron/x86_64/media/core/release/maven-common-artifact-filters-3.4.0-2.mga11.noarch.rpm
0% of 0 completed, ETA = --:--:--, speed = 0
100% of 57070 completed, ETA = --:--:--, speed = 54.4M
http://repository.mageia.org/distrib/cauldron/x86_64/media/core/release/xmvn-generator-2.1.1-1.mga11.noarch.rpm
0% of 0 completed, ETA = --:--:--, speed = 0
100% of 61209 completed, ETA = --:--:--, speed = 58.3M
http://repository.mageia.org/distrib/cauldron/x86_64/media/core/release/osgi-annotation-8.1.0-3.mga11.noarch.rpm
0% of 0 completed, ETA = --:--:--, speed = 0
100% of 21233 completed, ETA = --:--:--, speed = 20.2M
http://repository.mageia.org/distrib/cauldron/x86_64/media/core/release/maven-compiler-plugin-3.12.1-3.mga11.noarch.rpm
0% of 0 completed, ETA = --:--:--, speed = 0
100% of 74598 completed, ETA = --:--:--, speed = 71.1M
http://repository.mageia.org/distrib/cauldron/x86_64/media/core/release/plexus-sec-dispatcher-2.0-6.mga11.noarch.rpm
0% of 0 completed, ETA = --:--:--, speed = 0
100% of 32777 completed, ETA = --:--:--, speed = 31.2M
http://repository.mageia.org/distrib/cauldron/x86_64/media/core/release/maven-bundle-plugin-5.1.9-3.mga11.noarch.rpm
0% of 0 completed, ETA = --:--:--, speed = 0
100% of 150k completed, ETA = --:--:--, speed = 146M
http://repository.mageia.org/distrib/cauldron/x86_64/media/core/release/univocity-parsers-2.9.1-12.mga11.noarch.rpm
0% of 0 completed, ETA = --:--:--, speed = 0
100% of 403k completed, ETA = --:--:--, speed = 131M
http://repository.mageia.org/distrib/cauldron/x86_64/media/core/release/xmvn-toolchain-openjdk25-4.3.0-2.mga11.noarch.rpm
0% of 0 completed, ETA = --:--:--, speed = 0
100% of 7366 completed, ETA = --:--:--, speed = 7193k
http://repository.mageia.org/distrib/cauldron/x86_64/media/core/release/maven-shared-utils-3.4.2-3.mga11.noarch.rpm
0% of 0 completed, ETA = --:--:--, speed = 0
100% of 142k completed, ETA = --:--:--, speed = 139M
http://repository.mageia.org/distrib/cauldron/x86_64/media/core/release/xmvn5-mojo-5.1.0-1.mga11.noarch.rpm
0% of 0 completed, ETA = --:--:--, speed = 0
100% of 18888 completed, ETA = --:--:--, speed = 18.0M
http://repository.mageia.org/distrib/cauldron/x86_64/media/core/release/easymock-5.6.0-1.mga11.noarch.rpm
0% of 0 completed, ETA = --:--:--, speed = 0
100% of 146k completed, ETA = --:--:--, speed = 15.8M
http://repository.mageia.org/distrib/cauldron/x86_64/media/core/release/xmvn5-core-5.1.0-1.mga11.noarch.rpm
0% of 0 completed, ETA = --:--:--, speed = 0
100% of 85908 completed, ETA = --:--:--, speed = 81.9M
http://repository.mageia.org/distrib/cauldron/x86_64/media/core/release/picocli-4.7.7-1.mga11.noarch.rpm
0% of 0 completed, ETA = --:--:--, speed = 0
100% of 515k completed, ETA = --:--:--, speed = 125M
http://repository.mageia.org/distrib/cauldron/x86_64/media/core/release/maven-filtering-3.3.2-1.mga11.noarch.rpm
0% of 0 completed, ETA = --:--:--, speed = 0
100% of 60608 completed, ETA = --:--:--, speed = 57.8M
http://repository.mageia.org/distrib/cauldron/x86_64/media/core/release/maven-file-management-3.2.0-1.mga11.noarch.rpm
0% of 0 completed, ETA = --:--:--, speed = 0
100% of 31044 completed, ETA = --:--:--, speed = 29.6M
http://repository.mageia.org/distrib/cauldron/x86_64/media/core/release/xmvn-mojo-4.3.0-2.mga11.noarch.rpm
0% of 0 completed, ETA = --:--:--, speed = 0
100% of 46413 completed, ETA = --:--:--, speed = 44.2M
http://repository.mageia.org/distrib/cauldron/x86_64/media/core/release/qdox-2.2.0-1.mga11.noarch.rpm
0% of 0 completed, ETA = --:--:--, speed = 0
100% of 310k completed, ETA = --:--:--, speed = 151M
http://repository.mageia.org/distrib/cauldron/x86_64/media/core/release/osgi-compendium-7.0.0-17.mga11.noarch.rpm
0% of 0 completed, ETA = --:--:--, speed = 0
100% of 476k completed, ETA = --:--:--, speed = 116M
http://repository.mageia.org/distrib/cauldron/x86_64/media/core/release/felix-utils-1.11.8-6.mga11.noarch.rpm
0% of 0 completed, ETA = --:--:--, speed = 0
100% of 165k completed, ETA = --:--:--, speed = 162M
http://repository.mageia.org/distrib/cauldron/x86_64/media/core/release/plexus-cipher-2.0-5.mga11.noarch.rpm
0% of 0 completed, ETA = --:--:--, speed = 0
100% of 25028 completed, ETA = --:--:--, speed = 23.8M
http://repository.mageia.org/distrib/cauldron/x86_64/media/core/release/maven-surefire-3.2.2-4.mga11.noarch.rpm
0% of 0 completed, ETA = --:--:--, speed = 0
100% of 1023k completed, ETA = --:--:--, speed = 111M
retrieved kojan-xml-1.0.1-1.mga11.noarch.rpm maven-jar-plugin-3.3.0-3.mga11.noarch.rpm dola-1.3.2-6.mga11.noarch.rpm xmvn5-minimal-5.1.0-1.mga11.noarch.rpm maven-resources-plugin-3.3.1-3.mga11.noarch.rpm osgi-core-8.0.0-10.mga11.noarch.rpm aqute-bndlib-6.3.1-6.mga11.noarch.rpm maven-surefire-provider-junit5-3.2.2-4.mga11.noarch.rpm xmvn-tools-4.3.0-2.mga11.noarch.rpm xmvn-minimal-4.3.0-2.mga11.noarch.rpm maven-lib-3.9.11-4.mga11.noarch.rpm plexus-compiler-2.16.2-1.mga11.noarch.rpm maven-surefire-provider-testng-3.2.2-4.mga11.noarch.rpm maven-shared-incremental-1.1-30.mga11.noarch.rpm plexus-languages-1.5.2-1.mga11.noarch.rpm beust-jcommander-1.82-4.mga11.noarch.rpm maven-3.9.11-4.mga11.noarch.rpm maven-dependency-tree-3.3.0-1.mga11.noarch.rpm maven-openjdk25-3.9.11-4.mga11.noarch.rpm aqute-bnd-6.3.1-6.mga11.noarch.rpm maven-surefire-provider-junit-3.2.2-4.mga11.noarch.rpm maven-resolver-1.9.27-1.mga11.noarch.rpm plexus-build-api0-0.0.7-42.mga11.noarch.rpm junit5-5.14.4-1.mga11.noarch.rpm maven-surefire-plugin-3.2.2-4.mga11.noarch.rpm ant-lib-1.10.15-8.mga11.noarch.rpm assertj-core-3.26.3-1.mga11.noarch.rpm xmvn5-tools-5.1.0-1.mga11.noarch.rpm xmvn-core-4.3.0-2.mga11.noarch.rpm maven-common-artifact-filters-3.4.0-2.mga11.noarch.rpm xmvn-generator-2.1.1-1.mga11.noarch.rpm osgi-annotation-8.1.0-3.mga11.noarch.rpm maven-compiler-plugin-3.12.1-3.mga11.noarch.rpm plexus-sec-dispatcher-2.0-6.mga11.noarch.rpm maven-bundle-plugin-5.1.9-3.mga11.noarch.rpm univocity-parsers-2.9.1-12.mga11.noarch.rpm xmvn-toolchain-openjdk25-4.3.0-2.mga11.noarch.rpm maven-shared-utils-3.4.2-3.mga11.noarch.rpm xmvn5-mojo-5.1.0-1.mga11.noarch.rpm easymock-5.6.0-1.mga11.noarch.rpm xmvn5-core-5.1.0-1.mga11.noarch.rpm picocli-4.7.7-1.mga11.noarch.rpm maven-filtering-3.3.2-1.mga11.noarch.rpm maven-file-management-3.2.0-1.mga11.noarch.rpm xmvn-mojo-4.3.0-2.mga11.noarch.rpm qdox-2.2.0-1.mga11.noarch.rpm osgi-compendium-7.0.0-17.mga11.noarch.rpm felix-utils-1.11.8-6.mga11.noarch.rpm plexus-cipher-2.0-5.mga11.noarch.rpm maven-surefire-3.2.2-4.mga11.noarch.rpm
...retrieving done
installing xmvn5-tools-5.1.0-1.mga11.noarch.rpm xmvn-generator-2.1.1-1.mga11.noarch.rpm osgi-annotation-8.1.0-3.mga11.noarch.rpm xmvn-core-4.3.0-2.mga11.noarch.rpm maven-common-artifact-filters-3.4.0-2.mga11.noarch.rpm maven-compiler-plugin-3.12.1-3.mga11.noarch.rpm plexus-sec-dispatcher-2.0-6.mga11.noarch.rpm xmvn-toolchain-openjdk25-4.3.0-2.mga11.noarch.rpm maven-bundle-plugin-5.1.9-3.mga11.noarch.rpm univocity-parsers-2.9.1-12.mga11.noarch.rpm maven-shared-utils-3.4.2-3.mga11.noarch.rpm xmvn5-mojo-5.1.0-1.mga11.noarch.rpm easymock-5.6.0-1.mga11.noarch.rpm picocli-4.7.7-1.mga11.noarch.rpm xmvn5-core-5.1.0-1.mga11.noarch.rpm maven-filtering-3.3.2-1.mga11.noarch.rpm maven-file-management-3.2.0-1.mga11.noarch.rpm qdox-2.2.0-1.mga11.noarch.rpm xmvn-mojo-4.3.0-2.mga11.noarch.rpm osgi-compendium-7.0.0-17.mga11.noarch.rpm felix-utils-1.11.8-6.mga11.noarch.rpm plexus-cipher-2.0-5.mga11.noarch.rpm maven-surefire-3.2.2-4.mga11.noarch.rpm maven-jar-plugin-3.3.0-3.mga11.noarch.rpm kojan-xml-1.0.1-1.mga11.noarch.rpm dola-1.3.2-6.mga11.noarch.rpm xmvn5-minimal-5.1.0-1.mga11.noarch.rpm maven-resources-plugin-3.3.1-3.mga11.noarch.rpm osgi-core-8.0.0-10.mga11.noarch.rpm aqute-bndlib-6.3.1-6.mga11.noarch.rpm maven-surefire-provider-junit5-3.2.2-4.mga11.noarch.rpm xmvn-minimal-4.3.0-2.mga11.noarch.rpm xmvn-tools-4.3.0-2.mga11.noarch.rpm maven-lib-3.9.11-4.mga11.noarch.rpm plexus-compiler-2.16.2-1.mga11.noarch.rpm maven-surefire-provider-testng-3.2.2-4.mga11.noarch.rpm plexus-languages-1.5.2-1.mga11.noarch.rpm maven-shared-incremental-1.1-30.mga11.noarch.rpm beust-jcommander-1.82-4.mga11.noarch.rpm maven-dependency-tree-3.3.0-1.mga11.noarch.rpm maven-openjdk25-3.9.11-4.mga11.noarch.rpm maven-3.9.11-4.mga11.noarch.rpm aqute-bnd-6.3.1-6.mga11.noarch.rpm maven-resolver-1.9.27-1.mga11.noarch.rpm maven-surefire-provider-junit-3.2.2-4.mga11.noarch.rpm junit5-5.14.4-1.mga11.noarch.rpm maven-surefire-plugin-3.2.2-4.mga11.noarch.rpm plexus-build-api0-0.0.7-42.mga11.noarch.rpm ant-lib-1.10.15-8.mga11.noarch.rpm assertj-core-3.26.3-1.mga11.noarch.rpm from /home/iurt/chroot_tmp/iurt/chroot_cauldron.x86_64.0.20261003104844/var/cache/urpmi/rpms
starting installing packages
created transaction for installing on /home/iurt/chroot_tmp/iurt/chroot_cauldron.x86_64.0.20261003104844 (remove=0, install=0, upgrade=50)
Preparing... #############################################
101/159: maven-shared-utils #############################################
102/159: xmvn-core #############################################
103/159: plexus-cipher #############################################
104/159: kojan-xml #############################################
105/159: xmvn5-core #############################################
106/159: plexus-sec-dispatcher #############################################
107/159: plexus-build-api0 #############################################
108/159: picocli #############################################
109/159: osgi-annotation #############################################
110/159: xmvn5-tools #############################################
111/159: maven-filtering #############################################
112/159: maven-openjdk25 #############################################
113/159: maven #############################################
shell-init: error retrieving current directory: getcwd: cannot access parent directories: No such file or directory
114/159: maven-resolver #############################################
115/159: maven-lib #############################################
116/159: xmvn-minimal #############################################
117/159: maven-shared-incremental
#############################################
118/159: maven-common-artifact-filters
#############################################
119/159: maven-dependency-tree #############################################
120/159: xmvn5-mojo #############################################
121/159: xmvn5-minimal #############################################
122/159: dola #############################################
123/159: assertj-core #############################################
124/159: ant-lib #############################################
125/159: beust-jcommander #############################################
126/159: plexus-compiler #############################################
127/159: osgi-core #############################################
128/159: felix-utils #############################################
129/159: osgi-compendium #############################################
130/159: aqute-bndlib #############################################
131/159: aqute-bnd #############################################
132/159: qdox #############################################
133/159: plexus-languages #############################################
134/159: maven-surefire #############################################
135/159: maven-surefire-provider-testng
#############################################
136/159: maven-surefire-provider-junit
#############################################
137/159: maven-file-management #############################################
138/159: univocity-parsers #############################################
139/159: junit5 #############################################
140/159: maven-surefire-provider-junit5
#############################################
141/159: maven-surefire-plugin #############################################
142/159: maven-jar-plugin #############################################
143/159: maven-compiler-plugin #############################################
144/159: maven-bundle-plugin #############################################
145/159: xmvn-tools #############################################
146/159: xmvn-generator #############################################
147/159: xmvn-mojo #############################################
148/159: maven-resources-plugin
#############################################
149/159: easymock #############################################
150/159: xmvn-toolchain-openjdk25
#############################################
shell-init: error retrieving current directory: getcwd: cannot access parent directories: No such file or directory
shell-init: error retrieving current directory: getcwd: cannot access parent directories: No such file or directory
retrieving rpm files from medium "core_release"...
http://repository.mageia.org/distrib/cauldron/x86_64/media/core/release/javapackages-common-6.5.1-8.mga11.noarch.rpm
0% of 0 completed, ETA = --:--:--, speed = 0
100% of 58383 completed, ETA = --:--:--, speed = 27.8M
http://repository.mageia.org/distrib/cauldron/x86_64/media/core/release/javapackages-local-openjdk25-6.5.1-8.mga11.noarch.rpm
0% of 0 completed, ETA = --:--:--, speed = 0
100% of 8279 completed, ETA = --:--:--, speed = 8084k
http://repository.mageia.org/distrib/cauldron/x86_64/media/core/release/ant-1.10.15-8.mga11.noarch.rpm
0% of 0 completed, ETA = --:--:--, speed = 0
100% of 168k completed, ETA = --:--:--, speed = 164M
http://repository.mageia.org/distrib/cauldron/x86_64/media/core/release/ant-openjdk25-1.10.15-8.mga11.noarch.rpm
0% of 0 completed, ETA = --:--:--, speed = 0
100% of 7756 completed, ETA = --:--:--, speed = 7574k
http://repository.mageia.org/distrib/cauldron/x86_64/media/core/release/jansi1-1.18-6.mga11.noarch.rpm
0% of 0 completed, ETA = --:--:--, speed = 0
100% of 79326 completed, ETA = --:--:--, speed = 75.6M
http://repository.mageia.org/distrib/cauldron/x86_64/media/core/release/jansi-native-1.8-8.mga11.x86_64.rpm
0% of 0 completed, ETA = --:--:--, speed = 0
100% of 45508 completed, ETA = --:--:--, speed = 43.3M
http://repository.mageia.org/distrib/cauldron/x86_64/media/core/release/maven-local-openjdk25-6.5.1-8.mga11.noarch.rpm
0% of 0 completed, ETA = --:--:--, speed = 0
100% of 7745 completed, ETA = --:--:--, speed = 7563k
http://repository.mageia.org/distrib/cauldron/x86_64/media/core/release/hawtjni-runtime-1.18-5.mga11.noarch.rpm
0% of 0 completed, ETA = --:--:--, speed = 0
100% of 45379 completed, ETA = --:--:--, speed = 43.2M
http://repository.mageia.org/distrib/cauldron/x86_64/media/core/release/python3-javapackages-6.5.1-8.mga11.noarch.rpm
0% of 0 completed, ETA = --:--:--, speed = 0
100% of 88518 completed, ETA = --:--:--, speed = 84.4M
retrieved javapackages-common-6.5.1-8.mga11.noarch.rpm javapackages-local-openjdk25-6.5.1-8.mga11.noarch.rpm ant-1.10.15-8.mga11.noarch.rpm ant-openjdk25-1.10.15-8.mga11.noarch.rpm jansi1-1.18-6.mga11.noarch.rpm jansi-native-1.8-8.mga11.x86_64.rpm maven-local-openjdk25-6.5.1-8.mga11.noarch.rpm hawtjni-runtime-1.18-5.mga11.noarch.rpm python3-javapackages-6.5.1-8.mga11.noarch.rpm
...retrieving done
installing javapackages-common-6.5.1-8.mga11.noarch.rpm javapackages-local-openjdk25-6.5.1-8.mga11.noarch.rpm ant-1.10.15-8.mga11.noarch.rpm ant-openjdk25-1.10.15-8.mga11.noarch.rpm hawtjni-runtime-1.18-5.mga11.noarch.rpm python3-javapackages-6.5.1-8.mga11.noarch.rpm jansi1-1.18-6.mga11.noarch.rpm maven-local-openjdk25-6.5.1-8.mga11.noarch.rpm jansi-native-1.8-8.mga11.x86_64.rpm from /home/iurt/chroot_tmp/iurt/chroot_cauldron.x86_64.0.20261003104844/var/cache/urpmi/rpms
starting installing packages
created transaction for installing on /home/iurt/chroot_tmp/iurt/chroot_cauldron.x86_64.0.20261003104844 (remove=0, install=0, upgrade=9)
Preparing... #############################################
151/159: hawtjni-runtime #############################################
152/159: ant-openjdk25 #############################################
153/159: jansi-native #############################################
154/159: python3-javapackages #############################################
155/159: javapackages-common #############################################
156/159: javapackages-local-openjdk25
#############################################
157/159: maven-local-openjdk25 #############################################
158/159: jansi1 #############################################
159/159: ant #############################################
shell-init: error retrieving current directory: getcwd: cannot access parent directories: No such file or directory
shell-init: error retrieving current directory: getcwd: cannot access parent directories: No such file or directory
D: [iurt_root_command] Success!
__
I: [iurt] [iurt] installation successful
I: [iurt] [iurt] handling dynamic buildrequires
D: [iurt] [iurt] DynamicBuildRequires not required for @2374644:jline2-2.14.6-9.mga11.src.rpm
D: [iurt] [iurt] Using timeout of 60 seconds.
D: [iurt] [iurt] rpm --root /home/iurt/chroot_tmp/iurt/chroot_cauldron.x86_64.0.20261003104844 -qa | sort
D: [iurt] [iurt] Forking to monitor log size
D: [iurt] [iurt] Command exited with 0.
N: [iurt] [iurt] Building @2374644:jline2-2.14.6-9.mga11.src.rpm
D: [iurt] [iurt] Using timeout of 36000 seconds.
D: [iurt] [iurt] Forking to monitor log size
D: [iurt] [iurt] /usr/bin/sudo /usr/sbin/iurt_root_command --chroot /home/iurt/chroot_tmp/iurt/chroot_cauldron.x86_64.0.20261003104844 /bin/su - iurt -c "TMP=/home/iurt/tmp/ rpmbuild --target noarch --rebuild /home/iurt/rpmbuild/SRPMS/@2374644:jline2-2.14.6-9.mga11.src.rpm"
D: [iurt] [iurt] Command exited with 256.
D: [iurt] [iurt] calling callback for build_@2374644:jline2-2.14.6-9.mga11.src.rpm
E: [iurt] [iurt] ERROR: call_ret=1 kill= err=256 ()
F: [iurt] [iurt] See https://pkgsubmit.mageia.org/queue/build//cauldron/x86_64//log/@2374644:jline2-2.14.6-9.mga11.src.rpm/
Command failed: /usr/bin/sudo /usr/sbin/iurt_root_command --chroot /home/iurt/chroot_tmp/iurt/chroot_cauldron.x86_64.0.20261003104844 /bin/su - iurt -c "TMP=/home/iurt/tmp/ rpmbuild --target noarch --rebuild /home/iurt/rpmbuild/SRPMS/@2374644:jline2-2.14.6-9.mga11.src.rpm"
I: [iurt] [iurt] --------------- Command failed, full output follows ---------------
I: [iurt] [iurt] D: [iurt_root_command] chroot
RTNETLINK answers: Invalid argument
RTNETLINK answers: Invalid argument
RTNETLINK answers: Invalid argument
RTNETLINK answers: Invalid argument
RTNETLINK answers: Invalid argument
RTNETLINK answers: Invalid argument
RTNETLINK answers: Invalid argument
RTNETLINK answers: Invalid argument
RTNETLINK answers: Invalid argument
RTNETLINK answers: Invalid argument
RTNETLINK answers: Invalid argument
RTNETLINK answers: Invalid argument
RTNETLINK answers: Invalid argument
RTNETLINK answers: Invalid argument
RTNETLINK answers: Invalid argument
RTNETLINK answers: Invalid argument
RTNETLINK answers: Invalid argument
RTNETLINK answers: Invalid argument
RTNETLINK answers: Invalid argument
RTNETLINK answers: Invalid argument
RTNETLINK answers: Invalid argument
RTNETLINK answers: Invalid argument
RTNETLINK answers: Invalid argument
RTNETLINK answers: Invalid argument
RTNETLINK answers: Invalid argument
RTNETLINK answers: Invalid argument
RTNETLINK answers: Invalid argument
RTNETLINK answers: Invalid argument
RTNETLINK answers: Invalid argument
RTNETLINK answers: Invalid argument
RTNETLINK answers: Invalid argument
RTNETLINK answers: Invalid argument
RTNETLINK answers: Invalid argument
RTNETLINK answers: Invalid argument
RTNETLINK answers: Invalid argument
RTNETLINK answers: Invalid argument
RTNETLINK answers: Invalid argument
RTNETLINK answers: Invalid argument
RTNETLINK answers: Invalid argument
RTNETLINK answers: Invalid argument
RTNETLINK answers: Invalid argument
RTNETLINK answers: Invalid argument
RTNETLINK answers: Invalid argument
RTNETLINK answers: Invalid argument
RTNETLINK answers: Invalid argument
RTNETLINK answers: Invalid argument
RTNETLINK answers: Invalid argument
RTNETLINK answers: Invalid argument
RTNETLINK answers: Invalid argument
RTNETLINK answers: Invalid argument
RTNETLINK answers: Invalid argument
RTNETLINK answers: Invalid argument
RTNETLINK answers: Invalid argument
RTNETLINK answers: Invalid argument
RTNETLINK answers: Invalid argument
RTNETLINK answers: Invalid argument
RTNETLINK answers: Invalid argument
RTNETLINK answers: Invalid argument
RTNETLINK answers: Invalid argument
RTNETLINK answers: Invalid argument
RTNETLINK answers: Invalid argument
RTNETLINK answers: Invalid argument
RTNETLINK answers: Invalid argument
RTNETLINK answers: Invalid argument
RTNETLINK answers: Invalid argument
RTNETLINK answers: Invalid argument
RTNETLINK answers: Invalid argument
RTNETLINK answers: Invalid argument
RTNETLINK answers: Invalid argument
RTNETLINK answers: Invalid argument
RTNETLINK answers: Invalid argument
RTNETLINK answers: Invalid argument
RTNETLINK answers: Invalid argument
RTNETLINK answers: Invalid argument
RTNETLINK answers: Invalid argument
RTNETLINK answers: Invalid argument
RTNETLINK answers: Invalid argument
RTNETLINK answers: Invalid argument
RTNETLINK answers: Invalid argument
RTNETLINK answers: Invalid argument
RTNETLINK answers: Invalid argument
RTNETLINK answers: Invalid argument
RTNETLINK answers: Invalid argument
RTNETLINK answers: Invalid argument
RTNETLINK answers: Invalid argument
RTNETLINK answers: Invalid argument
RTNETLINK answers: Invalid argument
RTNETLINK answers: Invalid argument
RTNETLINK answers: Invalid argument
RTNETLINK answers: Invalid argument
RTNETLINK answers: Invalid argument
RTNETLINK answers: Invalid argument
RTNETLINK answers: Invalid argument
RTNETLINK answers: Invalid argument
RTNETLINK answers: Invalid argument
RTNETLINK answers: Invalid argument
RTNETLINK answers: Invalid argument
RTNETLINK answers: Invalid argument
RTNETLINK answers: Invalid argument
RTNETLINK answers: Invalid argument
RTNETLINK answers: Invalid argument
RTNETLINK answers: Invalid argument
RTNETLINK answers: Invalid argument
RTNETLINK answers: Invalid argument
RTNETLINK answers: Invalid argument
RTNETLINK answers: Invalid argument
RTNETLINK answers: Invalid argument
RTNETLINK answers: Invalid argument
RTNETLINK answers: Invalid argument
RTNETLINK answers: Invalid argument
RTNETLINK answers: Invalid argument
RTNETLINK answers: Invalid argument
RTNETLINK answers: Invalid argument
RTNETLINK answers: Invalid argument
RTNETLINK answers: Invalid argument
RTNETLINK answers: Invalid argument
RTNETLINK answers: Invalid argument
RTNETLINK answers: Invalid argument
RTNETLINK answers: Invalid argument
RTNETLINK answers: Invalid argument
RTNETLINK answers: Invalid argument
RTNETLINK answers: Invalid argument
RTNETLINK answers: Invalid argument
RTNETLINK answers: Invalid argument
RTNETLINK answers: Invalid argument
RTNETLINK answers: Invalid argument
RTNETLINK answers: Invalid argument
RTNETLINK answers: Invalid argument
RTNETLINK answers: Invalid argument
RTNETLINK answers: Invalid argument
RTNETLINK answers: Invalid argument
RTNETLINK answers: Invalid argument
RTNETLINK answers: Invalid argument
RTNETLINK answers: Invalid argument
RTNETLINK answers: Invalid argument
RTNETLINK answers: Invalid argument
RTNETLINK answers: Invalid argument
RTNETLINK answers: Invalid argument
RTNETLINK answers: Invalid argument
RTNETLINK answers: Invalid argument
RTNETLINK answers: Invalid argument
RTNETLINK answers: Invalid argument
RTNETLINK answers: Invalid argument
RTNETLINK answers: Invalid argument
RTNETLINK answers: Invalid argument
RTNETLINK answers: Invalid argument
RTNETLINK answers: Invalid argument
RTNETLINK answers: Invalid argument
RTNETLINK answers: Invalid argument
RTNETLINK answers: Invalid argument
RTNETLINK answers: Invalid argument
RTNETLINK answers: Invalid argument
RTNETLINK answers: Invalid argument
RTNETLINK answers: Invalid argument
RTNETLINK answers: Invalid argument
RTNETLINK answers: Invalid argument
RTNETLINK answers: Invalid argument
RTNETLINK answers: Invalid argument
RTNETLINK answers: Invalid argument
RTNETLINK answers: Invalid argument
RTNETLINK answers: Invalid argument
RTNETLINK answers: Invalid argument
RTNETLINK answers: Invalid argument
RTNETLINK answers: Invalid argument
RTNETLINK answers: Invalid argument
RTNETLINK answers: Invalid argument
RTNETLINK answers: Invalid argument
RTNETLINK answers: Invalid argument
RTNETLINK answers: Invalid argument
RTNETLINK answers: Invalid argument
RTNETLINK answers: Invalid argument
RTNETLINK answers: Invalid argument
RTNETLINK answers: Invalid argument
RTNETLINK answers: Invalid argument
RTNETLINK answers: Invalid argument
RTNETLINK answers: Invalid argument
RTNETLINK answers: Invalid argument
RTNETLINK answers: Invalid argument
RTNETLINK answers: Invalid argument
RTNETLINK answers: Invalid argument
RTNETLINK answers: Invalid argument
RTNETLINK answers: Invalid argument
RTNETLINK answers: Invalid argument
RTNETLINK answers: Invalid argument
RTNETLINK answers: Invalid argument
RTNETLINK answers: Invalid argument
RTNETLINK answers: Invalid argument
RTNETLINK answers: Invalid argument
RTNETLINK answers: Invalid argument
RTNETLINK answers: Invalid argument
RTNETLINK answers: Invalid argument
RTNETLINK answers: Invalid argument
RTNETLINK answers: Invalid argument
RTNETLINK answers: Invalid argument
RTNETLINK answers: Invalid argument
RTNETLINK answers: Invalid argument
RTNETLINK answers: Invalid argument
RTNETLINK answers: Invalid argument
RTNETLINK answers: Invalid argument
RTNETLINK answers: Invalid argument
RTNETLINK answers: Invalid argument
RTNETLINK answers: Invalid argument
RTNETLINK answers: Invalid argument
RTNETLINK answers: Invalid argument
RTNETLINK answers: Invalid argument
RTNETLINK answers: Invalid argument
RTNETLINK answers: Invalid argument
RTNETLINK answers: Invalid argument
RTNETLINK answers: Invalid argument
RTNETLINK answers: Invalid argument
RTNETLINK answers: Invalid argument
RTNETLINK answers: Invalid argument
RTNETLINK answers: Invalid argument
RTNETLINK answers: Invalid argument
RTNETLINK answers: Invalid argument
RTNETLINK answers: Invalid argument
RTNETLINK answers: Invalid argument
RTNETLINK answers: Invalid argument
RTNETLINK answers: Invalid argument
RTNETLINK answers: Invalid argument
RTNETLINK answers: Invalid argument
RTNETLINK answers: Invalid argument
RTNETLINK answers: Invalid argument
RTNETLINK answers: Invalid argument
RTNETLINK answers: Invalid argument
RTNETLINK answers: Invalid argument
RTNETLINK answers: Invalid argument
RTNETLINK answers: Invalid argument
RTNETLINK answers: Invalid argument
RTNETLINK answers: Invalid argument
RTNETLINK answers: Invalid argument
RTNETLINK answers: Invalid argument
RTNETLINK answers: Invalid argument
RTNETLINK answers: Invalid argument
RTNETLINK answers: Invalid argument
RTNETLINK answers: Invalid argument
RTNETLINK answers: Invalid argument
RTNETLINK answers: Invalid argument
RTNETLINK answers: Invalid argument
RTNETLINK answers: Invalid argument
RTNETLINK answers: Invalid argument
RTNETLINK answers: Invalid argument
RTNETLINK answers: Invalid argument
RTNETLINK answers: Invalid argument
RTNETLINK answers: Invalid argument
RTNETLINK answers: Invalid argument
RTNETLINK answers: Invalid argument
RTNETLINK answers: Invalid argument
RTNETLINK answers: Invalid argument
RTNETLINK answers: Invalid argument
RTNETLINK answers: Invalid argument
RTNETLINK answers: Invalid argument
RTNETLINK answers: Invalid argument
RTNETLINK answers: Invalid argument
RTNETLINK answers: Invalid argument
RTNETLINK answers: Invalid argument
RTNETLINK answers: Invalid argument
RTNETLINK answers: Invalid argument
RTNETLINK answers: Invalid argument
RTNETLINK answers: Invalid argument
RTNETLINK answers: Invalid argument
RTNETLINK answers: Invalid argument
RTNETLINK answers: Invalid argument
RTNETLINK answers: Invalid argument
RTNETLINK answers: Invalid argument
RTNETLINK answers: Invalid argument
RTNETLINK answers: Invalid argument
RTNETLINK answers: Invalid argument
RTNETLINK answers: Invalid argument
RTNETLINK answers: Invalid argument
RTNETLINK answers: Invalid argument
RTNETLINK answers: Invalid argument
RTNETLINK answers: Invalid argument
RTNETLINK answers: Invalid argument
RTNETLINK answers: Invalid argument
RTNETLINK answers: Invalid argument
RTNETLINK answers: Invalid argument
RTNETLINK answers: Invalid argument
RTNETLINK answers: Invalid argument
RTNETLINK answers: Invalid argument
RTNETLINK answers: Invalid argument
RTNETLINK answers: Invalid argument
RTNETLINK answers: Invalid argument
RTNETLINK answers: Invalid argument
RTNETLINK answers: Invalid argument
RTNETLINK answers: Invalid argument
RTNETLINK answers: Invalid argument
RTNETLINK answers: Invalid argument
RTNETLINK answers: Invalid argument
RTNETLINK answers: Invalid argument
RTNETLINK answers: Invalid argument
RTNETLINK answers: Invalid argument
RTNETLINK answers: Invalid argument
RTNETLINK answers: Invalid argument
RTNETLINK answers: Invalid argument
RTNETLINK answers: Invalid argument
RTNETLINK answers: Invalid argument
RTNETLINK answers: Invalid argument
RTNETLINK answers: Invalid argument
RTNETLINK answers: Invalid argument
RTNETLINK answers: Invalid argument
RTNETLINK answers: Invalid argument
RTNETLINK answers: Invalid argument
RTNETLINK answers: Invalid argument
RTNETLINK answers: Invalid argument
RTNETLINK answers: Invalid argument
RTNETLINK answers: Invalid argument
RTNETLINK answers: Invalid argument
RTNETLINK answers: Invalid argument
RTNETLINK answers: Invalid argument
RTNETLINK answers: Invalid argument
RTNETLINK answers: Invalid argument
RTNETLINK answers: Invalid argument
RTNETLINK answers: Invalid argument
RTNETLINK answers: Invalid argument
RTNETLINK answers: Invalid argument
RTNETLINK answers: Invalid argument
RTNETLINK answers: Invalid argument
RTNETLINK answers: Invalid argument
RTNETLINK answers: Invalid argument
RTNETLINK answers: Invalid argument
RTNETLINK answers: Invalid argument
RTNETLINK answers: Invalid argument
RTNETLINK answers: Invalid argument
RTNETLINK answers: Invalid argument
RTNETLINK answers: Invalid argument
RTNETLINK answers: Invalid argument
RTNETLINK answers: Invalid argument
RTNETLINK answers: Invalid argument
RTNETLINK answers: Invalid argument
RTNETLINK answers: Invalid argument
RTNETLINK answers: Invalid argument
RTNETLINK answers: Invalid argument
RTNETLINK answers: Invalid argument
RTNETLINK answers: Invalid argument
RTNETLINK answers: Invalid argument
RTNETLINK answers: Invalid argument
RTNETLINK answers: Invalid argument
RTNETLINK answers: Invalid argument
RTNETLINK answers: Invalid argument
RTNETLINK answers: Invalid argument
RTNETLINK answers: Invalid argument
RTNETLINK answers: Invalid argument
RTNETLINK answers: Invalid argument
RTNETLINK answers: Invalid argument
RTNETLINK answers: Invalid argument
RTNETLINK answers: Invalid argument
RTNETLINK answers: Invalid argument
RTNETLINK answers: Invalid argument
RTNETLINK answers: Invalid argument
RTNETLINK answers: Invalid argument
RTNETLINK answers: Invalid argument
RTNETLINK answers: Invalid argument
RTNETLINK answers: Invalid argument
RTNETLINK answers: Invalid argument
RTNETLINK answers: Invalid argument
RTNETLINK answers: Invalid argument
RTNETLINK answers: Invalid argument
RTNETLINK answers: Invalid argument
RTNETLINK answers: Invalid argument
RTNETLINK answers: Invalid argument
RTNETLINK answers: Invalid argument
RTNETLINK answers: Invalid argument
RTNETLINK answers: Invalid argument
RTNETLINK answers: Invalid argument
RTNETLINK answers: Invalid argument
RTNETLINK answers: Invalid argument
RTNETLINK answers: Invalid argument
RTNETLINK answers: Invalid argument
RTNETLINK answers: Invalid argument
RTNETLINK answers: Invalid argument
RTNETLINK answers: Invalid argument
RTNETLINK answers: Invalid argument
RTNETLINK answers: Invalid argument
RTNETLINK answers: Invalid argument
RTNETLINK answers: Invalid argument
RTNETLINK answers: Invalid argument
RTNETLINK answers: Invalid argument
RTNETLINK answers: Invalid argument
RTNETLINK answers: Invalid argument
RTNETLINK answers: Invalid argument
RTNETLINK answers: Invalid argument
RTNETLINK answers: Invalid argument
RTNETLINK answers: Invalid argument
RTNETLINK answers: Invalid argument
RTNETLINK answers: Invalid argument
RTNETLINK answers: Invalid argument
RTNETLINK answers: Invalid argument
RTNETLINK answers: Invalid argument
RTNETLINK answers: Invalid argument
RTNETLINK answers: Invalid argument
RTNETLINK answers: Invalid argument
RTNETLINK answers: Invalid argument
RTNETLINK answers: Invalid argument
RTNETLINK answers: Invalid argument
RTNETLINK answers: Invalid argument
RTNETLINK answers: Invalid argument
RTNETLINK answers: Invalid argument
RTNETLINK answers: Invalid argument
RTNETLINK answers: Invalid argument
RTNETLINK answers: Invalid argument
RTNETLINK answers: Invalid argument
RTNETLINK answers: Invalid argument
RTNETLINK answers: Invalid argument
RTNETLINK answers: Invalid argument
RTNETLINK answers: Invalid argument
RTNETLINK answers: Invalid argument
RTNETLINK answers: Invalid argument
RTNETLINK answers: Invalid argument
RTNETLINK answers: Invalid argument
RTNETLINK answers: Invalid argument
RTNETLINK answers: Invalid argument
RTNETLINK answers: Invalid argument
RTNETLINK answers: Invalid argument
RTNETLINK answers: Invalid argument
RTNETLINK answers: Invalid argument
RTNETLINK answers: Invalid argument
RTNETLINK answers: Invalid argument
RTNETLINK answers: Invalid argument
RTNETLINK answers: Invalid argument
RTNETLINK answers: Invalid argument
RTNETLINK answers: Invalid argument
RTNETLINK answers: Invalid argument
RTNETLINK answers: Invalid argument
RTNETLINK answers: Invalid argument
RTNETLINK answers: Invalid argument
RTNETLINK answers: Invalid argument
RTNETLINK answers: Invalid argument
RTNETLINK answers: Invalid argument
RTNETLINK answers: Invalid argument
RTNETLINK answers: Invalid argument
RTNETLINK answers: Invalid argument
RTNETLINK answers: Invalid argument
RTNETLINK answers: Invalid argument
RTNETLINK answers: Invalid argument
RTNETLINK answers: Invalid argument
RTNETLINK answers: Invalid argument
RTNETLINK answers: Invalid argument
RTNETLINK answers: Invalid argument
RTNETLINK answers: Invalid argument
RTNETLINK answers: Invalid argument
RTNETLINK answers: Invalid argument
RTNETLINK answers: Invalid argument
RTNETLINK answers: Invalid argument
RTNETLINK answers: Invalid argument
RTNETLINK answers: Invalid argument
RTNETLINK answers: Invalid argument
RTNETLINK answers: Invalid argument
RTNETLINK answers: Invalid argument
RTNETLINK answers: Invalid argument
RTNETLINK answers: Invalid argument
RTNETLINK answers: Invalid argument
RTNETLINK answers: Invalid argument
RTNETLINK answers: Invalid argument
RTNETLINK answers: Invalid argument
RTNETLINK answers: Invalid argument
RTNETLINK answers: Invalid argument
RTNETLINK answers: Invalid argument
RTNETLINK answers: Invalid argument
RTNETLINK answers: Invalid argument
RTNETLINK answers: Invalid argument
RTNETLINK answers: Invalid argument
RTNETLINK answers: Invalid argument
RTNETLINK answers: Invalid argument
RTNETLINK answers: Invalid argument
RTNETLINK answers: Invalid argument
RTNETLINK answers: Invalid argument
RTNETLINK answers: Invalid argument
RTNETLINK answers: Invalid argument
RTNETLINK answers: Invalid argument
RTNETLINK answers: Invalid argument
RTNETLINK answers: Invalid argument
RTNETLINK answers: Invalid argument
RTNETLINK answers: Invalid argument
RTNETLINK answers: Invalid argument
RTNETLINK answers: Invalid argument
RTNETLINK answers: Invalid argument
RTNETLINK answers: Invalid argument
RTNETLINK answers: Invalid argument
RTNETLINK answers: Invalid argument
RTNETLINK answers: Invalid argument
RTNETLINK answers: Invalid argument
RTNETLINK answers: Invalid argument
RTNETLINK answers: Invalid argument
RTNETLINK answers: Invalid argument
RTNETLINK answers: Invalid argument
RTNETLINK answers: Invalid argument
RTNETLINK answers: Invalid argument
RTNETLINK answers: Invalid argument
RTNETLINK answers: Invalid argument
RTNETLINK answers: Invalid argument
RTNETLINK answers: Invalid argument
RTNETLINK answers: Invalid argument
RTNETLINK answers: Invalid argument
RTNETLINK answers: Invalid argument
RTNETLINK answers: Invalid argument
RTNETLINK answers: Invalid argument
RTNETLINK answers: Invalid argument
RTNETLINK answers: Invalid argument
RTNETLINK answers: Invalid argument
RTNETLINK answers: Invalid argument
RTNETLINK answers: Invalid argument
RTNETLINK answers: Invalid argument
RTNETLINK answers: Invalid argument
RTNETLINK answers: Invalid argument
RTNETLINK answers: Invalid argument
RTNETLINK answers: Invalid argument
RTNETLINK answers: Invalid argument
RTNETLINK answers: Invalid argument
RTNETLINK answers: Invalid argument
RTNETLINK answers: Invalid argument
RTNETLINK answers: Invalid argument
RTNETLINK answers: Invalid argument
RTNETLINK answers: Invalid argument
RTNETLINK answers: Invalid argument
RTNETLINK answers: Invalid argument
RTNETLINK answers: Invalid argument
RTNETLINK answers: Invalid argument
RTNETLINK answers: Invalid argument
RTNETLINK answers: Invalid argument
RTNETLINK answers: Invalid argument
RTNETLINK answers: Invalid argument
RTNETLINK answers: Invalid argument
RTNETLINK answers: Invalid argument
RTNETLINK answers: Invalid argument
RTNETLINK answers: Invalid argument
RTNETLINK answers: Invalid argument
RTNETLINK answers: Invalid argument
RTNETLINK answers: Invalid argument
RTNETLINK answers: Invalid argument
RTNETLINK answers: Invalid argument
RTNETLINK answers: Invalid argument
RTNETLINK answers: Invalid argument
RTNETLINK answers: Invalid argument
RTNETLINK answers: Invalid argument
RTNETLINK answers: Invalid argument
RTNETLINK answers: Invalid argument
RTNETLINK answers: Invalid argument
RTNETLINK answers: Invalid argument
RTNETLINK answers: Invalid argument
RTNETLINK answers: Invalid argument
RTNETLINK answers: Invalid argument
RTNETLINK answers: Invalid argument
RTNETLINK answers: Invalid argument
RTNETLINK answers: Invalid argument
RTNETLINK answers: Invalid argument
RTNETLINK answers: Invalid argument
RTNETLINK answers: Invalid argument
RTNETLINK answers: Invalid argument
RTNETLINK answers: Invalid argument
RTNETLINK answers: Invalid argument
RTNETLINK answers: Invalid argument
RTNETLINK answers: Invalid argument
RTNETLINK answers: Invalid argument
RTNETLINK answers: Invalid argument
RTNETLINK answers: Invalid argument
RTNETLINK answers: Invalid argument
RTNETLINK answers: Invalid argument
RTNETLINK answers: Invalid argument
RTNETLINK answers: Invalid argument
RTNETLINK answers: Invalid argument
RTNETLINK answers: Invalid argument
RTNETLINK answers: Invalid argument
RTNETLINK answers: Invalid argument
RTNETLINK answers: Invalid argument
RTNETLINK answers: Invalid argument
RTNETLINK answers: Invalid argument
RTNETLINK answers: Invalid argument
RTNETLINK answers: Invalid argument
RTNETLINK answers: Invalid argument
RTNETLINK answers: Invalid argument
RTNETLINK answers: Invalid argument
RTNETLINK answers: Invalid argument
RTNETLINK answers: Invalid argument
RTNETLINK answers: Invalid argument
RTNETLINK answers: Invalid argument
RTNETLINK answers: Invalid argument
RTNETLINK answers: Invalid argument
RTNETLINK answers: Invalid argument
RTNETLINK answers: Invalid argument
RTNETLINK answers: Invalid argument
RTNETLINK answers: Invalid argument
RTNETLINK answers: Invalid argument
RTNETLINK answers: Invalid argument
RTNETLINK answers: Invalid argument
RTNETLINK answers: Invalid argument
RTNETLINK answers: Invalid argument
RTNETLINK answers: Invalid argument
RTNETLINK answers: Invalid argument
RTNETLINK answers: Invalid argument
RTNETLINK answers: Invalid argument
RTNETLINK answers: Invalid argument
RTNETLINK answers: Invalid argument
RTNETLINK answers: Invalid argument
RTNETLINK answers: Invalid argument
RTNETLINK answers: Invalid argument
RTNETLINK answers: Invalid argument
RTNETLINK answers: Invalid argument
RTNETLINK answers: Invalid argument
RTNETLINK answers: Invalid argument
RTNETLINK answers: Invalid argument
RTNETLINK answers: Invalid argument
RTNETLINK answers: Invalid argument
RTNETLINK answers: Invalid argument
RTNETLINK answers: Invalid argument
RTNETLINK answers: Invalid argument
RTNETLINK answers: Invalid argument
RTNETLINK answers: Invalid argument
RTNETLINK answers: Invalid argument
RTNETLINK answers: Invalid argument
RTNETLINK answers: Invalid argument
RTNETLINK answers: Invalid argument
RTNETLINK answers: Invalid argument
RTNETLINK answers: Invalid argument
RTNETLINK answers: Invalid argument
RTNETLINK answers: Invalid argument
RTNETLINK answers: Invalid argument
RTNETLINK answers: Invalid argument
RTNETLINK answers: Invalid argument
RTNETLINK answers: Invalid argument
RTNETLINK answers: Invalid argument
RTNETLINK answers: Invalid argument
RTNETLINK answers: Invalid argument
RTNETLINK answers: Invalid argument
RTNETLINK answers: Invalid argument
RTNETLINK answers: Invalid argument
RTNETLINK answers: Invalid argument
RTNETLINK answers: Invalid argument
RTNETLINK answers: Invalid argument
RTNETLINK answers: Invalid argument
RTNETLINK answers: Invalid argument
RTNETLINK answers: Invalid argument
RTNETLINK answers: Invalid argument
RTNETLINK answers: Invalid argument
RTNETLINK answers: Invalid argument
RTNETLINK answers: Invalid argument
RTNETLINK answers: Invalid argument
RTNETLINK answers: Invalid argument
RTNETLINK answers: Invalid argument
RTNETLINK answers: Invalid argument
RTNETLINK answers: Invalid argument
RTNETLINK answers: Invalid argument
RTNETLINK answers: Invalid argument
RTNETLINK answers: Invalid argument
RTNETLINK answers: Invalid argument
RTNETLINK answers: Invalid argument
RTNETLINK answers: Invalid argument
RTNETLINK answers: Invalid argument
RTNETLINK answers: Invalid argument
RTNETLINK answers: Invalid argument
RTNETLINK answers: Invalid argument
RTNETLINK answers: Invalid argument
RTNETLINK answers: Invalid argument
RTNETLINK answers: Invalid argument
RTNETLINK answers: Invalid argument
RTNETLINK answers: Invalid argument
RTNETLINK answers: Invalid argument
RTNETLINK answers: Invalid argument
RTNETLINK answers: Invalid argument
RTNETLINK answers: Invalid argument
RTNETLINK answers: Invalid argument
RTNETLINK answers: Invalid argument
RTNETLINK answers: Invalid argument
RTNETLINK answers: Invalid argument
RTNETLINK answers: Invalid argument
RTNETLINK answers: Invalid argument
RTNETLINK answers: Invalid argument
RTNETLINK answers: Invalid argument
RTNETLINK answers: Invalid argument
RTNETLINK answers: Invalid argument
RTNETLINK answers: Invalid argument
RTNETLINK answers: Invalid argument
RTNETLINK answers: Invalid argument
RTNETLINK answers: Invalid argument
RTNETLINK answers: Invalid argument
RTNETLINK answers: Invalid argument
RTNETLINK answers: Invalid argument
RTNETLINK answers: Invalid argument
RTNETLINK answers: Invalid argument
RTNETLINK answers: Invalid argument
RTNETLINK answers: Invalid argument
RTNETLINK answers: Invalid argument
RTNETLINK answers: Invalid argument
RTNETLINK answers: Invalid argument
RTNETLINK answers: Invalid argument
RTNETLINK answers: Invalid argument
RTNETLINK answers: Invalid argument
RTNETLINK answers: Invalid argument
RTNETLINK answers: Invalid argument
RTNETLINK answers: Invalid argument
RTNETLINK answers: Invalid argument
RTNETLINK answers: Invalid argument
RTNETLINK answers: Invalid argument
RTNETLINK answers: Invalid argument
RTNETLINK answers: Invalid argument
RTNETLINK answers: Invalid argument
RTNETLINK answers: Invalid argument
RTNETLINK answers: Invalid argument
RTNETLINK answers: Invalid argument
RTNETLINK answers: Invalid argument
RTNETLINK answers: Invalid argument
RTNETLINK answers: Invalid argument
RTNETLINK answers: Invalid argument
RTNETLINK answers: Invalid argument
RTNETLINK answers: Invalid argument
RTNETLINK answers: Invalid argument
RTNETLINK answers: Invalid argument
RTNETLINK answers: Invalid argument
RTNETLINK answers: Invalid argument
RTNETLINK answers: Invalid argument
RTNETLINK answers: Invalid argument
RTNETLINK answers: Invalid argument
RTNETLINK answers: Invalid argument
RTNETLINK answers: Invalid argument
RTNETLINK answers: Invalid argument
RTNETLINK answers: Invalid argument
RTNETLINK answers: Invalid argument
RTNETLINK answers: Invalid argument
RTNETLINK answers: Invalid argument
RTNETLINK answers: Invalid argument
RTNETLINK answers: Invalid argument
RTNETLINK answers: Invalid argument
RTNETLINK answers: Invalid argument
RTNETLINK answers: Invalid argument
RTNETLINK answers: Invalid argument
RTNETLINK answers: Invalid argument
RTNETLINK answers: Invalid argument
RTNETLINK answers: Invalid argument
RTNETLINK answers: Invalid argument
RTNETLINK answers: Invalid argument
RTNETLINK answers: Invalid argument
RTNETLINK answers: Invalid argument
RTNETLINK answers: Invalid argument
RTNETLINK answers: Invalid argument
RTNETLINK answers: Invalid argument
RTNETLINK answers: Invalid argument
RTNETLINK answers: Invalid argument
RTNETLINK answers: Invalid argument
RTNETLINK answers: Invalid argument
RTNETLINK answers: Invalid argument
RTNETLINK answers: Invalid argument
RTNETLINK answers: Invalid argument
RTNETLINK answers: Invalid argument
RTNETLINK answers: Invalid argument
RTNETLINK answers: Invalid argument
RTNETLINK answers: Invalid argument
RTNETLINK answers: Invalid argument
RTNETLINK answers: Invalid argument
RTNETLINK answers: Invalid argument
RTNETLINK answers: Invalid argument
RTNETLINK answers: Invalid argument
RTNETLINK answers: Invalid argument
RTNETLINK answers: Invalid argument
RTNETLINK answers: Invalid argument
RTNETLINK answers: Invalid argument
RTNETLINK answers: Invalid argument
RTNETLINK answers: Invalid argument
RTNETLINK answers: Invalid argument
RTNETLINK answers: Invalid argument
RTNETLINK answers: Invalid argument
RTNETLINK answers: Invalid argument
RTNETLINK answers: Invalid argument
RTNETLINK answers: Invalid argument
RTNETLINK answers: Invalid argument
RTNETLINK answers: Invalid argument
RTNETLINK answers: Invalid argument
RTNETLINK answers: Invalid argument
RTNETLINK answers: Invalid argument
RTNETLINK answers: Invalid argument
RTNETLINK answers: Invalid argument
RTNETLINK answers: Invalid argument
RTNETLINK answers: Invalid argument
RTNETLINK answers: Invalid argument
RTNETLINK answers: Invalid argument
RTNETLINK answers: Invalid argument
RTNETLINK answers: Invalid argument
RTNETLINK answers: Invalid argument
RTNETLINK answers: Invalid argument
RTNETLINK answers: Invalid argument
RTNETLINK answers: Invalid argument
RTNETLINK answers: Invalid argument
RTNETLINK answers: Invalid argument
RTNETLINK answers: Invalid argument
RTNETLINK answers: Invalid argument
RTNETLINK answers: Invalid argument
RTNETLINK answers: Invalid argument
RTNETLINK answers: Invalid argument
RTNETLINK answers: Invalid argument
RTNETLINK answers: Invalid argument
RTNETLINK answers: Invalid argument
RTNETLINK answers: Invalid argument
RTNETLINK answers: Invalid argument
RTNETLINK answers: Invalid argument
RTNETLINK answers: Invalid argument
RTNETLINK answers: Invalid argument
RTNETLINK answers: Invalid argument
RTNETLINK answers: Invalid argument
RTNETLINK answers: Invalid argument
RTNETLINK answers: Invalid argument
RTNETLINK answers: Invalid argument
RTNETLINK answers: Invalid argument
RTNETLINK answers: Invalid argument
RTNETLINK answers: Invalid argument
RTNETLINK answers: Invalid argument
RTNETLINK answers: Invalid argument
RTNETLINK answers: Invalid argument
RTNETLINK answers: Invalid argument
RTNETLINK answers: Invalid argument
RTNETLINK answers: Invalid argument
RTNETLINK answers: Invalid argument
RTNETLINK answers: Invalid argument
RTNETLINK answers: Invalid argument
RTNETLINK answers: Invalid argument
RTNETLINK answers: Invalid argument
RTNETLINK answers: Invalid argument
RTNETLINK answers: Invalid argument
RTNETLINK answers: Invalid argument
RTNETLINK answers: Invalid argument
RTNETLINK answers: Invalid argument
RTNETLINK answers: Invalid argument
RTNETLINK answers: Invalid argument
RTNETLINK answers: Invalid argument
RTNETLINK answers: Invalid argument
RTNETLINK answers: Invalid argument
RTNETLINK answers: Invalid argument
RTNETLINK answers: Invalid argument
RTNETLINK answers: Invalid argument
RTNETLINK answers: Invalid argument
RTNETLINK answers: Invalid argument
RTNETLINK answers: Invalid argument
RTNETLINK answers: Invalid argument
RTNETLINK answers: Invalid argument
RTNETLINK answers: Invalid argument
RTNETLINK answers: Invalid argument
RTNETLINK answers: Invalid argument
RTNETLINK answers: Invalid argument
RTNETLINK answers: Invalid argument
RTNETLINK answers: Invalid argument
RTNETLINK answers: Invalid argument
RTNETLINK answers: Invalid argument
RTNETLINK answers: Invalid argument
RTNETLINK answers: Invalid argument
RTNETLINK answers: Invalid argument
RTNETLINK answers: Invalid argument
RTNETLINK answers: Invalid argument
RTNETLINK answers: Invalid argument
RTNETLINK answers: Invalid argument
RTNETLINK answers: Invalid argument
RTNETLINK answers: Invalid argument
RTNETLINK answers: Invalid argument
RTNETLINK answers: Invalid argument
RTNETLINK answers: Invalid argument
RTNETLINK answers: Invalid argument
RTNETLINK answers: Invalid argument
RTNETLINK answers: Invalid argument
RTNETLINK answers: Invalid argument
RTNETLINK answers: Invalid argument
RTNETLINK answers: Invalid argument
RTNETLINK answers: Invalid argument
RTNETLINK answers: Invalid argument
RTNETLINK answers: Invalid argument
RTNETLINK answers: Invalid argument
RTNETLINK answers: Invalid argument
RTNETLINK answers: Invalid argument
RTNETLINK answers: Invalid argument
RTNETLINK answers: Invalid argument
RTNETLINK answers: Invalid argument
RTNETLINK answers: Invalid argument
RTNETLINK answers: Invalid argument
RTNETLINK answers: Invalid argument
RTNETLINK answers: Invalid argument
RTNETLINK answers: Invalid argument
RTNETLINK answers: Invalid argument
RTNETLINK answers: Invalid argument
RTNETLINK answers: Invalid argument
RTNETLINK answers: Invalid argument
RTNETLINK answers: Invalid argument
RTNETLINK answers: Invalid argument
RTNETLINK answers: Invalid argument
RTNETLINK answers: Invalid argument
RTNETLINK answers: Invalid argument
RTNETLINK answers: Invalid argument
RTNETLINK answers: Invalid argument
RTNETLINK answers: Invalid argument
RTNETLINK answers: Invalid argument
RTNETLINK answers: Invalid argument
RTNETLINK answers: Invalid argument
RTNETLINK answers: Invalid argument
RTNETLINK answers: Invalid argument
RTNETLINK answers: Invalid argument
RTNETLINK answers: Invalid argument
RTNETLINK answers: Invalid argument
RTNETLINK answers: Invalid argument
RTNETLINK answers: Invalid argument
RTNETLINK answers: Invalid argument
RTNETLINK answers: Invalid argument
RTNETLINK answers: Invalid argument
RTNETLINK answers: Invalid argument
RTNETLINK answers: Invalid argument
RTNETLINK answers: Invalid argument
RTNETLINK answers: Invalid argument
RTNETLINK answers: Invalid argument
RTNETLINK answers: Invalid argument
RTNETLINK answers: Invalid argument
RTNETLINK answers: Invalid argument
RTNETLINK answers: Invalid argument
RTNETLINK answers: Invalid argument
RTNETLINK answers: Invalid argument
RTNETLINK answers: Invalid argument
RTNETLINK answers: Invalid argument
RTNETLINK answers: Invalid argument
RTNETLINK answers: Invalid argument
RTNETLINK answers: Invalid argument
RTNETLINK answers: Invalid argument
RTNETLINK answers: Invalid argument
RTNETLINK answers: Invalid argument
RTNETLINK answers: Invalid argument
RTNETLINK answers: Invalid argument
RTNETLINK answers: Invalid argument
RTNETLINK answers: Invalid argument
RTNETLINK answers: Invalid argument
RTNETLINK answers: Invalid argument
RTNETLINK answers: Invalid argument
RTNETLINK answers: Invalid argument
RTNETLINK answers: Invalid argument
RTNETLINK answers: Invalid argument
RTNETLINK answers: Invalid argument
RTNETLINK answers: Invalid argument
RTNETLINK answers: Invalid argument
RTNETLINK answers: Invalid argument
RTNETLINK answers: Invalid argument
RTNETLINK answers: Invalid argument
RTNETLINK answers: Invalid argument
RTNETLINK answers: Invalid argument
RTNETLINK answers: Invalid argument
RTNETLINK answers: Invalid argument
RTNETLINK answers: Invalid argument
RTNETLINK answers: Invalid argument
RTNETLINK answers: Invalid argument
RTNETLINK answers: Invalid argument
RTNETLINK answers: Invalid argument
RTNETLINK answers: Invalid argument
RTNETLINK answers: Invalid argument
RTNETLINK answers: Invalid argument
RTNETLINK answers: Invalid argument
RTNETLINK answers: Invalid argument
RTNETLINK answers: Invalid argument
RTNETLINK answers: Invalid argument
RTNETLINK answers: Invalid argument
RTNETLINK answers: Invalid argument
RTNETLINK answers: Invalid argument
RTNETLINK answers: Invalid argument
RTNETLINK answers: Invalid argument
RTNETLINK answers: Invalid argument
RTNETLINK answers: Invalid argument
RTNETLINK answers: Invalid argument
RTNETLINK answers: Invalid argument
RTNETLINK answers: Invalid argument
RTNETLINK answers: Invalid argument
RTNETLINK answers: Invalid argument
RTNETLINK answers: Invalid argument
RTNETLINK answers: Invalid argument
RTNETLINK answers: Invalid argument
RTNETLINK answers: Invalid argument
RTNETLINK answers: Invalid argument
RTNETLINK answers: Invalid argument
RTNETLINK answers: Invalid argument
RTNETLINK answers: Invalid argument
RTNETLINK answers: Invalid argument
RTNETLINK answers: Invalid argument
RTNETLINK answers: Invalid argument
RTNETLINK answers: Invalid argument
RTNETLINK answers: Invalid argument
RTNETLINK answers: Invalid argument
RTNETLINK answers: Invalid argument
RTNETLINK answers: Invalid argument
RTNETLINK answers: Invalid argument
RTNETLINK answers: Invalid argument
RTNETLINK answers: Invalid argument
RTNETLINK answers: Invalid argument
RTNETLINK answers: Invalid argument
RTNETLINK answers: Invalid argument
RTNETLINK answers: Invalid argument
RTNETLINK answers: Invalid argument
RTNETLINK answers: Invalid argument
RTNETLINK answers: Invalid argument
RTNETLINK answers: Invalid argument
RTNETLINK answers: Invalid argument
RTNETLINK answers: Invalid argument
RTNETLINK answers: Invalid argument
RTNETLINK answers: Invalid argument
RTNETLINK answers: Invalid argument
RTNETLINK answers: Invalid argument
RTNETLINK answers: Invalid argument
RTNETLINK answers: Invalid argument
RTNETLINK answers: Invalid argument
RTNETLINK answers: Invalid argument
RTNETLINK answers: Invalid argument
RTNETLINK answers: Invalid argument
RTNETLINK answers: Invalid argument
RTNETLINK answers: Invalid argument
RTNETLINK answers: Invalid argument
RTNETLINK answers: Invalid argument
RTNETLINK answers: Invalid argument
RTNETLINK answers: Invalid argument
RTNETLINK answers: Invalid argument
RTNETLINK answers: Invalid argument
RTNETLINK answers: Invalid argument
RTNETLINK answers: Invalid argument
RTNETLINK answers: Invalid argument
RTNETLINK answers: Invalid argument
RTNETLINK answers: Invalid argument
RTNETLINK answers: Invalid argument
RTNETLINK answers: Invalid argument
RTNETLINK answers: Invalid argument
RTNETLINK answers: Invalid argument
RTNETLINK answers: Invalid argument
RTNETLINK answers: Invalid argument
RTNETLINK answers: Invalid argument
RTNETLINK answers: Invalid argument
RTNETLINK answers: Invalid argument
RTNETLINK answers: Invalid argument
RTNETLINK answers: Invalid argument
RTNETLINK answers: Invalid argument
RTNETLINK answers: Invalid argument
RTNETLINK answers: Invalid argument
RTNETLINK answers: Invalid argument
RTNETLINK answers: Invalid argument
RTNETLINK answers: Invalid argument
RTNETLINK answers: Invalid argument
RTNETLINK answers: Invalid argument
RTNETLINK answers: Invalid argument
RTNETLINK answers: Invalid argument
RTNETLINK answers: Invalid argument
RTNETLINK answers: Invalid argument
RTNETLINK answers: Invalid argument
RTNETLINK answers: Invalid argument
RTNETLINK answers: Invalid argument
RTNETLINK answers: Invalid argument
RTNETLINK answers: Invalid argument
RTNETLINK answers: Invalid argument
RTNETLINK answers: Invalid argument
RTNETLINK answers: Invalid argument
RTNETLINK answers: Invalid argument
RTNETLINK answers: Invalid argument
RTNETLINK answers: Invalid argument
RTNETLINK answers: Invalid argument
RTNETLINK answers: Invalid argument
RTNETLINK answers: Invalid argument
RTNETLINK answers: Invalid argument
RTNETLINK answers: Invalid argument
RTNETLINK answers: Invalid argument
RTNETLINK answers: Invalid argument
RTNETLINK answers: Invalid argument
RTNETLINK answers: Invalid argument
RTNETLINK answers: Invalid argument
RTNETLINK answers: Invalid argument
RTNETLINK answers: Invalid argument
RTNETLINK answers: Invalid argument
RTNETLINK answers: Invalid argument
RTNETLINK answers: Invalid argument
RTNETLINK answers: Invalid argument
RTNETLINK answers: Invalid argument
RTNETLINK answers: Invalid argument
RTNETLINK answers: Invalid argument
RTNETLINK answers: Invalid argument
RTNETLINK answers: Invalid argument
RTNETLINK answers: Invalid argument
RTNETLINK answers: Invalid argument
RTNETLINK answers: Invalid argument
RTNETLINK answers: Invalid argument
RTNETLINK answers: Invalid argument
RTNETLINK answers: Invalid argument
RTNETLINK answers: Invalid argument
RTNETLINK answers: Invalid argument
RTNETLINK answers: Invalid argument
RTNETLINK answers: Invalid argument
RTNETLINK answers: Invalid argument
RTNETLINK answers: Invalid argument
RTNETLINK answers: Invalid argument
RTNETLINK answers: Invalid argument
RTNETLINK answers: Invalid argument
RTNETLINK answers: Invalid argument
RTNETLINK answers: Invalid argument
RTNETLINK answers: Invalid argument
RTNETLINK answers: Invalid argument
RTNETLINK answers: Invalid argument
RTNETLINK answers: Invalid argument
RTNETLINK answers: Invalid argument
RTNETLINK answers: Invalid argument
RTNETLINK answers: Invalid argument
RTNETLINK answers: Invalid argument
RTNETLINK answers: Invalid argument
RTNETLINK answers: Invalid argument
RTNETLINK answers: Invalid argument
RTNETLINK answers: Invalid argument
RTNETLINK answers: Invalid argument
RTNETLINK answers: Invalid argument
RTNETLINK answers: Invalid argument
RTNETLINK answers: Invalid argument
RTNETLINK answers: Invalid argument
RTNETLINK answers: Invalid argument
RTNETLINK answers: Invalid argument
RTNETLINK answers: Invalid argument
RTNETLINK answers: Invalid argument
RTNETLINK answers: Invalid argument
RTNETLINK answers: Invalid argument
RTNETLINK answers: Invalid argument
RTNETLINK answers: Invalid argument
RTNETLINK answers: Invalid argument
RTNETLINK answers: Invalid argument
RTNETLINK answers: Invalid argument
RTNETLINK answers: Invalid argument
RTNETLINK answers: Invalid argument
RTNETLINK answers: Invalid argument
RTNETLINK answers: Invalid argument
RTNETLINK answers: Invalid argument
RTNETLINK answers: Invalid argument
RTNETLINK answers: Invalid argument
RTNETLINK answers: Invalid argument
RTNETLINK answers: Invalid argument
RTNETLINK answers: Invalid argument
RTNETLINK answers: Invalid argument
RTNETLINK answers: Invalid argument
RTNETLINK answers: Invalid argument
RTNETLINK answers: Invalid argument
RTNETLINK answers: Invalid argument
RTNETLINK answers: Invalid argument
RTNETLINK answers: Invalid argument
RTNETLINK answers: Invalid argument
RTNETLINK answers: Invalid argument
RTNETLINK answers: Invalid argument
RTNETLINK answers: Invalid argument
RTNETLINK answers: Invalid argument
RTNETLINK answers: Invalid argument
RTNETLINK answers: Invalid argument
RTNETLINK answers: Invalid argument
RTNETLINK answers: Invalid argument
RTNETLINK answers: Invalid argument
RTNETLINK answers: Invalid argument
RTNETLINK answers: Invalid argument
RTNETLINK answers: Invalid argument
RTNETLINK answers: Invalid argument
RTNETLINK answers: Invalid argument
RTNETLINK answers: Invalid argument
RTNETLINK answers: Invalid argument
RTNETLINK answers: Invalid argument
RTNETLINK answers: Invalid argument
RTNETLINK answers: Invalid argument
RTNETLINK answers: Invalid argument
RTNETLINK answers: Invalid argument
RTNETLINK answers: Invalid argument
RTNETLINK answers: Invalid argument
RTNETLINK answers: Invalid argument
RTNETLINK answers: Invalid argument
RTNETLINK answers: Invalid argument
RTNETLINK answers: Invalid argument
RTNETLINK answers: Invalid argument
RTNETLINK answers: Invalid argument
RTNETLINK answers: Invalid argument
RTNETLINK answers: Invalid argument
RTNETLINK answers: Invalid argument
RTNETLINK answers: Invalid argument
RTNETLINK answers: Invalid argument
RTNETLINK answers: Invalid argument
RTNETLINK answers: Invalid argument
RTNETLINK answers: Invalid argument
RTNETLINK answers: Invalid argument
RTNETLINK answers: Invalid argument
RTNETLINK answers: Invalid argument
RTNETLINK answers: Invalid argument
RTNETLINK answers: Invalid argument
RTNETLINK answers: Invalid argument
RTNETLINK answers: Invalid argument
RTNETLINK answers: Invalid argument
RTNETLINK answers: Invalid argument
RTNETLINK answers: Invalid argument
RTNETLINK answers: Invalid argument
RTNETLINK answers: Invalid argument
RTNETLINK answers: Invalid argument
RTNETLINK answers: Invalid argument
RTNETLINK answers: Invalid argument
RTNETLINK answers: Invalid argument
RTNETLINK answers: Invalid argument
RTNETLINK answers: Invalid argument
RTNETLINK answers: Invalid argument
RTNETLINK answers: Invalid argument
RTNETLINK answers: Invalid argument
RTNETLINK answers: Invalid argument
RTNETLINK answers: Invalid argument
RTNETLINK answers: Invalid argument
RTNETLINK answers: Invalid argument
RTNETLINK answers: Invalid argument
RTNETLINK answers: Invalid argument
RTNETLINK answers: Invalid argument
RTNETLINK answers: Invalid argument
RTNETLINK answers: Invalid argument
RTNETLINK answers: Invalid argument
RTNETLINK answers: Invalid argument
RTNETLINK answers: Invalid argument
RTNETLINK answers: Invalid argument
RTNETLINK answers: Invalid argument
RTNETLINK answers: Invalid argument
RTNETLINK answers: Invalid argument
RTNETLINK answers: Invalid argument
RTNETLINK answers: Invalid argument
RTNETLINK answers: Invalid argument
RTNETLINK answers: Invalid argument
RTNETLINK answers: Invalid argument
RTNETLINK answers: Invalid argument
RTNETLINK answers: Invalid argument
RTNETLINK answers: Invalid argument
RTNETLINK answers: Invalid argument
RTNETLINK answers: Invalid argument
RTNETLINK answers: Invalid argument
RTNETLINK answers: Invalid argument
RTNETLINK answers: Invalid argument
RTNETLINK answers: Invalid argument
RTNETLINK answers: Invalid argument
RTNETLINK answers: Invalid argument
RTNETLINK answers: Invalid argument
RTNETLINK answers: Invalid argument
RTNETLINK answers: Invalid argument
RTNETLINK answers: Invalid argument
RTNETLINK answers: Invalid argument
RTNETLINK answers: Invalid argument
RTNETLINK answers: Invalid argument
RTNETLINK answers: Invalid argument
RTNETLINK answers: Invalid argument
RTNETLINK answers: Invalid argument
RTNETLINK answers: Invalid argument
RTNETLINK answers: Invalid argument
RTNETLINK answers: Invalid argument
RTNETLINK answers: Invalid argument
RTNETLINK answers: Invalid argument
RTNETLINK answers: Invalid argument
RTNETLINK answers: Invalid argument
RTNETLINK answers: Invalid argument
RTNETLINK answers: Invalid argument
RTNETLINK answers: Invalid argument
RTNETLINK answers: Invalid argument
RTNETLINK answers: Invalid argument
RTNETLINK answers: Invalid argument
RTNETLINK answers: Invalid argument
RTNETLINK answers: Invalid argument
RTNETLINK answers: Invalid argument
RTNETLINK answers: Invalid argument
RTNETLINK answers: Invalid argument
RTNETLINK answers: Invalid argument
RTNETLINK answers: Invalid argument
RTNETLINK answers: Invalid argument
RTNETLINK answers: Invalid argument
RTNETLINK answers: Invalid argument
RTNETLINK answers: Invalid argument
RTNETLINK answers: Invalid argument
RTNETLINK answers: Invalid argument
RTNETLINK answers: Invalid argument
RTNETLINK answers: Invalid argument
RTNETLINK answers: Invalid argument
RTNETLINK answers: Invalid argument
RTNETLINK answers: Invalid argument
RTNETLINK answers: Invalid argument
RTNETLINK answers: Invalid argument
RTNETLINK answers: Invalid argument
RTNETLINK answers: Invalid argument
RTNETLINK answers: Invalid argument
RTNETLINK answers: Invalid argument
RTNETLINK answers: Invalid argument
RTNETLINK answers: Invalid argument
RTNETLINK answers: Invalid argument
RTNETLINK answers: Invalid argument
RTNETLINK answers: Invalid argument
RTNETLINK answers: Invalid argument
RTNETLINK answers: Invalid argument
RTNETLINK answers: Invalid argument
RTNETLINK answers: Invalid argument
RTNETLINK answers: Invalid argument
RTNETLINK answers: Invalid argument
RTNETLINK answers: Invalid argument
RTNETLINK answers: Invalid argument
RTNETLINK answers: Invalid argument
RTNETLINK answers: Invalid argument
RTNETLINK answers: Invalid argument
RTNETLINK answers: Invalid argument
RTNETLINK answers: Invalid argument
RTNETLINK answers: Invalid argument
RTNETLINK answers: Invalid argument
RTNETLINK answers: Invalid argument
RTNETLINK answers: Invalid argument
RTNETLINK answers: Invalid argument
RTNETLINK answers: Invalid argument
RTNETLINK answers: Invalid argument
RTNETLINK answers: Invalid argument
RTNETLINK answers: Invalid argument
RTNETLINK answers: Invalid argument
RTNETLINK answers: Invalid argument
RTNETLINK answers: Invalid argument
RTNETLINK answers: Invalid argument
RTNETLINK answers: Invalid argument
RTNETLINK answers: Invalid argument
RTNETLINK answers: Invalid argument
RTNETLINK answers: Invalid argument
RTNETLINK answers: Invalid argument
RTNETLINK answers: Invalid argument
RTNETLINK answers: Invalid argument
RTNETLINK answers: Invalid argument
RTNETLINK answers: Invalid argument
RTNETLINK answers: Invalid argument
RTNETLINK answers: Invalid argument
RTNETLINK answers: Invalid argument
RTNETLINK answers: Invalid argument
RTNETLINK answers: Invalid argument
RTNETLINK answers: Invalid argument
RTNETLINK answers: Invalid argument
RTNETLINK answers: Invalid argument
RTNETLINK answers: Invalid argument
RTNETLINK answers: Invalid argument
RTNETLINK answers: Invalid argument
RTNETLINK answers: Invalid argument
RTNETLINK answers: Invalid argument
RTNETLINK answers: Invalid argument
RTNETLINK answers: Invalid argument
RTNETLINK answers: Invalid argument
RTNETLINK answers: Invalid argument
RTNETLINK answers: Invalid argument
RTNETLINK answers: Invalid argument
RTNETLINK answers: Invalid argument
RTNETLINK answers: Invalid argument
RTNETLINK answers: Invalid argument
RTNETLINK answers: Invalid argument
RTNETLINK answers: Invalid argument
RTNETLINK answers: Invalid argument
RTNETLINK answers: Invalid argument
RTNETLINK answers: Invalid argument
RTNETLINK answers: Invalid argument
RTNETLINK answers: Invalid argument
RTNETLINK answers: Invalid argument
RTNETLINK answers: Invalid argument
RTNETLINK answers: Invalid argument
RTNETLINK answers: Invalid argument
RTNETLINK answers: Invalid argument
RTNETLINK answers: Invalid argument
RTNETLINK answers: Invalid argument
RTNETLINK answers: Invalid argument
RTNETLINK answers: Invalid argument
RTNETLINK answers: Invalid argument
RTNETLINK answers: Invalid argument
RTNETLINK answers: Invalid argument
RTNETLINK answers: Invalid argument
RTNETLINK answers: Invalid argument
RTNETLINK answers: Invalid argument
RTNETLINK answers: Invalid argument
RTNETLINK answers: Invalid argument
RTNETLINK answers: Invalid argument
RTNETLINK answers: Invalid argument
RTNETLINK answers: Invalid argument
RTNETLINK answers: Invalid argument
RTNETLINK answers: Invalid argument
RTNETLINK answers: Invalid argument
RTNETLINK answers: Invalid argument
RTNETLINK answers: Invalid argument
RTNETLINK answers: Invalid argument
RTNETLINK answers: Invalid argument
RTNETLINK answers: Invalid argument
RTNETLINK answers: Invalid argument
RTNETLINK answers: Invalid argument
RTNETLINK answers: Invalid argument
RTNETLINK answers: Invalid argument
RTNETLINK answers: Invalid argument
RTNETLINK answers: Invalid argument
RTNETLINK answers: Invalid argument
RTNETLINK answers: Invalid argument
RTNETLINK answers: Invalid argument
RTNETLINK answers: Invalid argument
RTNETLINK answers: Invalid argument
RTNETLINK answers: Invalid argument
RTNETLINK answers: Invalid argument
RTNETLINK answers: Invalid argument
RTNETLINK answers: Invalid argument
RTNETLINK answers: Invalid argument
RTNETLINK answers: Invalid argument
RTNETLINK answers: Invalid argument
RTNETLINK answers: Invalid argument
RTNETLINK answers: Invalid argument
RTNETLINK answers: Invalid argument
RTNETLINK answers: Invalid argument
RTNETLINK answers: Invalid argument
RTNETLINK answers: Invalid argument
RTNETLINK answers: Invalid argument
RTNETLINK answers: Invalid argument
RTNETLINK answers: Invalid argument
RTNETLINK answers: Invalid argument
RTNETLINK answers: Invalid argument
RTNETLINK answers: Invalid argument
RTNETLINK answers: Invalid argument
RTNETLINK answers: Invalid argument
RTNETLINK answers: Invalid argument
RTNETLINK answers: Invalid argument
RTNETLINK answers: Invalid argument
RTNETLINK answers: Invalid argument
RTNETLINK answers: Invalid argument
RTNETLINK answers: Invalid argument
RTNETLINK answers: Invalid argument
RTNETLINK answers: Invalid argument
RTNETLINK answers: Invalid argument
RTNETLINK answers: Invalid argument
RTNETLINK answers: Invalid argument
RTNETLINK answers: Invalid argument
RTNETLINK answers: Invalid argument
RTNETLINK answers: Invalid argument
RTNETLINK answers: Invalid argument
RTNETLINK answers: Invalid argument
RTNETLINK answers: Invalid argument
RTNETLINK answers: Invalid argument
RTNETLINK answers: Invalid argument
RTNETLINK answers: Invalid argument
RTNETLINK answers: Invalid argument
RTNETLINK answers: Invalid argument
RTNETLINK answers: Invalid argument
RTNETLINK answers: Invalid argument
RTNETLINK answers: Invalid argument
RTNETLINK answers: Invalid argument
RTNETLINK answers: Invalid argument
RTNETLINK answers: Invalid argument
RTNETLINK answers: Invalid argument
RTNETLINK answers: Invalid argument
RTNETLINK answers: Invalid argument
RTNETLINK answers: Invalid argument
RTNETLINK answers: Invalid argument
RTNETLINK answers: Invalid argument
RTNETLINK answers: Invalid argument
RTNETLINK answers: Invalid argument
RTNETLINK answers: Invalid argument
RTNETLINK answers: Invalid argument
RTNETLINK answers: Invalid argument
RTNETLINK answers: Invalid argument
RTNETLINK answers: Invalid argument
RTNETLINK answers: Invalid argument
RTNETLINK answers: Invalid argument
RTNETLINK answers: Invalid argument
RTNETLINK answers: Invalid argument
RTNETLINK answers: Invalid argument
RTNETLINK answers: Invalid argument
RTNETLINK answers: Invalid argument
RTNETLINK answers: Invalid argument
RTNETLINK answers: Invalid argument
RTNETLINK answers: Invalid argument
RTNETLINK answers: Invalid argument
RTNETLINK answers: Invalid argument
RTNETLINK answers: Invalid argument
RTNETLINK answers: Invalid argument
RTNETLINK answers: Invalid argument
RTNETLINK answers: Invalid argument
RTNETLINK answers: Invalid argument
RTNETLINK answers: Invalid argument
RTNETLINK answers: Invalid argument
RTNETLINK answers: Invalid argument
RTNETLINK answers: Invalid argument
RTNETLINK answers: Invalid argument
RTNETLINK answers: Invalid argument
RTNETLINK answers: Invalid argument
RTNETLINK answers: Invalid argument
RTNETLINK answers: Invalid argument
RTNETLINK answers: Invalid argument
RTNETLINK answers: Invalid argument
RTNETLINK answers: Invalid argument
RTNETLINK answers: Invalid argument
RTNETLINK answers: Invalid argument
RTNETLINK answers: Invalid argument
RTNETLINK answers: Invalid argument
RTNETLINK answers: Invalid argument
RTNETLINK answers: Invalid argument
RTNETLINK answers: Invalid argument
RTNETLINK answers: Invalid argument
RTNETLINK answers: Invalid argument
RTNETLINK answers: Invalid argument
RTNETLINK answers: Invalid argument
RTNETLINK answers: Invalid argument
RTNETLINK answers: Invalid argument
RTNETLINK answers: Invalid argument
RTNETLINK answers: Invalid argument
RTNETLINK answers: Invalid argument
RTNETLINK answers: Invalid argument
RTNETLINK answers: Invalid argument
RTNETLINK answers: Invalid argument
RTNETLINK answers: Invalid argument
RTNETLINK answers: Invalid argument
RTNETLINK answers: Invalid argument
RTNETLINK answers: Invalid argument
RTNETLINK answers: Invalid argument
RTNETLINK answers: Invalid argument
RTNETLINK answers: Invalid argument
RTNETLINK answers: Invalid argument
RTNETLINK answers: Invalid argument
RTNETLINK answers: Invalid argument
RTNETLINK answers: Invalid argument
RTNETLINK answers: Invalid argument
RTNETLINK answers: Invalid argument
RTNETLINK answers: Invalid argument
RTNETLINK answers: Invalid argument
RTNETLINK answers: Invalid argument
RTNETLINK answers: Invalid argument
RTNETLINK answers: Invalid argument
RTNETLINK answers: Invalid argument
RTNETLINK answers: Invalid argument
RTNETLINK answers: Invalid argument
RTNETLINK answers: Invalid argument
RTNETLINK answers: Invalid argument
RTNETLINK answers: Invalid argument
RTNETLINK answers: Invalid argument
RTNETLINK answers: Invalid argument
RTNETLINK answers: Invalid argument
RTNETLINK answers: Invalid argument
RTNETLINK answers: Invalid argument
RTNETLINK answers: Invalid argument
RTNETLINK answers: Invalid argument
RTNETLINK answers: Invalid argument
RTNETLINK answers: Invalid argument
RTNETLINK answers: Invalid argument
RTNETLINK answers: Invalid argument
RTNETLINK answers: Invalid argument
RTNETLINK answers: Invalid argument
RTNETLINK answers: Invalid argument
RTNETLINK answers: Invalid argument
RTNETLINK answers: Invalid argument
RTNETLINK answers: Invalid argument
RTNETLINK answers: Invalid argument
RTNETLINK answers: Invalid argument
RTNETLINK answers: Invalid argument
RTNETLINK answers: Invalid argument
RTNETLINK answers: Invalid argument
RTNETLINK answers: Invalid argument
RTNETLINK answers: Invalid argument
RTNETLINK answers: Invalid argument
RTNETLINK answers: Invalid argument
RTNETLINK answers: Invalid argument
RTNETLINK answers: Invalid argument
RTNETLINK answers: Invalid argument
RTNETLINK answers: Invalid argument
RTNETLINK answers: Invalid argument
RTNETLINK answers: Invalid argument
RTNETLINK answers: Invalid argument
RTNETLINK answers: Invalid argument
RTNETLINK answers: Invalid argument
RTNETLINK answers: Invalid argument
RTNETLINK answers: Invalid argument
RTNETLINK answers: Invalid argument
RTNETLINK answers: Invalid argument
RTNETLINK answers: Invalid argument
RTNETLINK answers: Invalid argument
RTNETLINK answers: Invalid argument
RTNETLINK answers: Invalid argument
RTNETLINK answers: Invalid argument
RTNETLINK answers: Invalid argument
RTNETLINK answers: Invalid argument
RTNETLINK answers: Invalid argument
RTNETLINK answers: Invalid argument
RTNETLINK answers: Invalid argument
RTNETLINK answers: Invalid argument
RTNETLINK answers: Invalid argument
RTNETLINK answers: Invalid argument
RTNETLINK answers: Invalid argument
RTNETLINK answers: Invalid argument
RTNETLINK answers: Invalid argument
RTNETLINK answers: Invalid argument
RTNETLINK answers: Invalid argument
RTNETLINK answers: Invalid argument
RTNETLINK answers: Invalid argument
RTNETLINK answers: Invalid argument
RTNETLINK answers: Invalid argument
RTNETLINK answers: Invalid argument
RTNETLINK answers: Invalid argument
RTNETLINK answers: Invalid argument
RTNETLINK answers: Invalid argument
RTNETLINK answers: Invalid argument
RTNETLINK answers: Invalid argument
RTNETLINK answers: Invalid argument
RTNETLINK answers: Invalid argument
RTNETLINK answers: Invalid argument
RTNETLINK answers: Invalid argument
RTNETLINK answers: Invalid argument
RTNETLINK answers: Invalid argument
RTNETLINK answers: Invalid argument
RTNETLINK answers: Invalid argument
RTNETLINK answers: Invalid argument
RTNETLINK answers: Invalid argument
RTNETLINK answers: Invalid argument
RTNETLINK answers: Invalid argument
RTNETLINK answers: Invalid argument
RTNETLINK answers: Invalid argument
RTNETLINK answers: Invalid argument
RTNETLINK answers: Invalid argument
RTNETLINK answers: Invalid argument
RTNETLINK answers: Invalid argument
RTNETLINK answers: Invalid argument
RTNETLINK answers: Invalid argument
RTNETLINK answers: Invalid argument
RTNETLINK answers: Invalid argument
RTNETLINK answers: Invalid argument
RTNETLINK answers: Invalid argument
RTNETLINK answers: Invalid argument
RTNETLINK answers: Invalid argument
RTNETLINK answers: Invalid argument
RTNETLINK answers: Invalid argument
Building target platforms: noarch
Building for target noarch
Installing /home/iurt/rpmbuild/SRPMS/@2374644:jline2-2.14.6-9.mga11.src.rpm
Executing(%mkbuilddir): /bin/sh -e /home/iurt/rpmbuild/tmp/rpm-tmp.t9UbiI
Executing(%prep): /bin/sh -e /home/iurt/rpmbuild/tmp/rpm-tmp.oMXov1
+ umask 022
+ cd /home/iurt/rpmbuild/BUILD/jline2-2.14.6-build
+ '[' 1 -eq 1 ']'
+ '[' 1 -eq 1 ']'
+ '[' 1 -eq 1 ']'
+ cd /home/iurt/rpmbuild/BUILD/jline2-2.14.6-build
+ rm -rf jline2-jline-2.14.6
+ /usr/lib/rpm/rpmuncompress -x /home/iurt/rpmbuild/SOURCES/jline-2.14.6.tar.gz
+ STATUS=0
+ '[' 0 -ne 0 ']'
+ cd jline2-jline-2.14.6
+ /usr/bin/chmod -Rf a+rX,u+w,g-w,o-w .
+ /usr/bin/python3 /usr/share/java-utils/pom_editor.py pom_remove_parent
+ /usr/bin/python3 /usr/share/java-utils/pom_editor.py pom_remove_plugin org.apache.maven.plugins:maven-shade-plugin
+ /usr/bin/python3 /usr/share/java-utils/pom_editor.py pom_remove_plugin org.codehaus.mojo:animal-sniffer-maven-plugin
+ /usr/bin/python3 /usr/share/java-utils/pom_editor.py pom_xpath_remove pom:build/pom:extensions
+ /usr/bin/python3 /usr/share/java-utils/pom_editor.py pom_remove_plugin :maven-site-plugin
+ /usr/bin/python3 /usr/share/java-utils/pom_editor.py pom_remove_plugin :maven-enforcer-plugin
+ /usr/bin/python3 /usr/share/java-utils/pom_editor.py pom_remove_plugin :maven-javadoc-plugin
+ /usr/bin/python3 /usr/share/java-utils/pom_editor.py pom_xpath_remove 'pom:arg[text()="-Werror"]'
+ /usr/bin/python3 /usr/share/java-utils/pom_editor.py pom_xpath_remove 'pom:build/pom:plugins/pom:plugin[pom:artifactId = '\''maven-bundle-plugin'\'']/pom:executions/pom:execution/pom:configuration/pom:instructions/pom:Import-Package'
+ /usr/bin/python3 /usr/share/java-utils/pom_editor.py pom_xpath_inject 'pom:build/pom:plugins/pom:plugin[pom:artifactId = '\''maven-bundle-plugin'\'']/pom:executions/pom:execution/pom:configuration/pom:instructions' 'javax.swing;resolution:=optional,org.fusesource.jansi,!org.fusesource.jansi.internal'
+ /usr/bin/python3 /usr/share/java-utils/pom_editor.py pom_xpath_set 'pom:build/pom:plugins/pom:plugin[pom:artifactId = '\''maven-bundle-plugin'\'']/pom:executions/pom:execution/pom:configuration/pom:instructions/pom:Export-Package' 'jline.*;-noimport:=true'
+ /usr/bin/python3 /usr/share/java-utils/pom_editor.py pom_xpath_set //pom:jansi.version 1.18
+ find -name TerminalFactoryTest.java -delete
+ /usr/bin/python3 /usr/share/java-utils/pom_editor.py pom_remove_dep org.powermock:
+ /usr/bin/python3 /usr/share/java-utils/pom_editor.py pom_xpath_inject pom:build/pom:plugins $'\n\nmaven-javadoc-plugin\n1.8\n'
+ RPM_EC=0
++ jobs -p
+ exit 0
Executing(%build): /bin/sh -e /home/iurt/rpmbuild/tmp/rpm-tmp.kfFdbT
+ umask 022
+ cd /home/iurt/rpmbuild/BUILD/jline2-2.14.6-build
+ CFLAGS='-O2 -g -pipe -Wformat -Werror=format-security -Wp,-U_FORTIFY_SOURCE,-D_FORTIFY_SOURCE=3 -specs=/usr/lib/rpm/redhat/redhat-hardened-cc1 -fstack-protector-strong -m64 -fasynchronous-unwind-tables -fstack-clash-protection -fcf-protection=full'
+ export CFLAGS
+ CXXFLAGS='-O2 -g -pipe -Wformat -Werror=format-security -Wp,-U_FORTIFY_SOURCE,-D_FORTIFY_SOURCE=3 -specs=/usr/lib/rpm/redhat/redhat-hardened-cc1 -fstack-protector-strong -m64 -fasynchronous-unwind-tables -fstack-clash-protection -fcf-protection=full'
+ export CXXFLAGS
+ FFLAGS='-O2 -g -pipe -Wformat -Werror=format-security -Wp,-U_FORTIFY_SOURCE,-D_FORTIFY_SOURCE=3 -specs=/usr/lib/rpm/redhat/redhat-hardened-cc1 -fstack-protector-strong -m64 -fasynchronous-unwind-tables -fstack-clash-protection -fcf-protection=full '
+ export FFLAGS
+ FCFLAGS='-O2 -g -pipe -Wformat -Werror=format-security -Wp,-U_FORTIFY_SOURCE,-D_FORTIFY_SOURCE=3 -specs=/usr/lib/rpm/redhat/redhat-hardened-cc1 -fstack-protector-strong -m64 -fasynchronous-unwind-tables -fstack-clash-protection -fcf-protection=full '
+ export FCFLAGS
+ VALAFLAGS=-g
+ export VALAFLAGS
+ RUSTFLAGS='-Copt-level=3 -Cdebuginfo=2 -Ccodegen-units=1 -Cstrip=none --cap-lints=warn'
+ export RUSTFLAGS
+ LDFLAGS='-Wl,--as-needed -Wl,--no-undefined -Wl,-z,relro -Wl,-z,now -Wl,-O1 -Wl,--build-id=sha1 -Wl,--enable-new-dtags -specs=/usr/lib/rpm/redhat/redhat-hardened-ld'
+ export LDFLAGS
+ LT_SYS_LIBRARY_PATH=/usr/lib:
+ export LT_SYS_LIBRARY_PATH
+ CC=gcc
+ export CC
+ CXX=g++
+ export CXX
+ cd jline2-jline-2.14.6
+ '[' 1 -eq 1 ']'
+ '[' 1 -eq 1 ']'
+ /usr/bin/python3 /usr/share/java-utils/mvn_build.py --xmvn-javadoc -- -Dmaven.compiler.source=1.8 -Dmaven.compiler.target=1.8
Executing: xmvn --batch-mode --offline -Dmaven.compiler.source=1.8 -Dmaven.compiler.target=1.8 verify org.fedoraproject.xmvn:xmvn-mojo:install org.fedoraproject.xmvn:xmvn-mojo:javadoc org.fedoraproject.xmvn:xmvn-mojo:builddep
['xmvn', '--batch-mode', '--offline', '-Dmaven.compiler.source=1.8', '-Dmaven.compiler.target=1.8', 'verify', 'org.fedoraproject.xmvn:xmvn-mojo:install', 'org.fedoraproject.xmvn:xmvn-mojo:javadoc', 'org.fedoraproject.xmvn:xmvn-mojo:builddep']
SLF4J: Class path contains multiple SLF4J bindings.
SLF4J: Found binding in [jar:file:/usr/share/xmvn/lib/slf4j-api-1.7.36.jar!/org/slf4j/impl/StaticLoggerBinder.class]
SLF4J: Found binding in [jar:file:/usr/share/xmvn/lib/maven-slf4j-provider-3.9.11.jar!/org/slf4j/impl/StaticLoggerBinder.class]
SLF4J: See http://www.slf4j.org/codes.html#multiple_bindings for an explanation.
SLF4J: Actual binding is of type [org.slf4j.impl.SimpleLoggerFactory]
SLF4J: Class path contains multiple SLF4J bindings.
SLF4J: Found binding in [jar:file:/usr/share/xmvn/lib/slf4j-api-1.7.36.jar!/org/slf4j/impl/StaticLoggerBinder.class]
SLF4J: Found binding in [jar:file:/usr/share/xmvn/lib/maven-slf4j-provider-3.9.11.jar!/org/slf4j/impl/StaticLoggerBinder.class]
SLF4J: See http://www.slf4j.org/codes.html#multiple_bindings for an explanation.
SLF4J: Actual binding is of type [org.slf4j.impl.SimpleLoggerFactory]
WARNING: A terminally deprecated method in sun.misc.Unsafe has been called
WARNING: sun.misc.Unsafe::objectFieldOffset has been called by com.google.common.util.concurrent.AbstractFuture$UnsafeAtomicHelper (file:/usr/share/xmvn/lib/failureaccess-1.0.3.jar)
WARNING: Please consider reporting this to the maintainers of class com.google.common.util.concurrent.AbstractFuture$UnsafeAtomicHelper
WARNING: sun.misc.Unsafe::objectFieldOffset will be removed in a future release
[INFO] Scanning for projects...
[WARNING]
[WARNING] Some problems were encountered while building the effective model for jline:jline:jar:2.14.6
[WARNING] 'build.plugins.plugin.version' for org.apache.maven.plugins:maven-javadoc-plugin is missing. @ line 216, column 21
[WARNING]
[WARNING] It is highly recommended to fix these problems because they threaten the stability of your build.
[WARNING]
[WARNING] For this reason, future Maven versions might no longer support building such malformed projects.
[WARNING]
[WARNING] The project jline:jline:jar:2.14.6 uses prerequisites which is only intended for maven-plugin projects but not for non maven-plugin projects. For such purposes you should use the maven-enforcer-plugin. See https://maven.apache.org/enforcer/enforcer-rules/requireMavenVersion.html
[INFO]
[INFO] ----------------------------< jline:jline >-----------------------------
[INFO] Building JLine 2.14.6
[INFO] from pom.xml
[INFO] --------------------------------[ jar ]---------------------------------
[WARNING] Parameter 'forkMode' is unknown for plugin 'maven-surefire-plugin:3.2.2:test (default-test)'
[INFO]
[INFO] --- resources:3.3.1:resources (default-resources) @ jline ---
[INFO] Copying 1 resource from src/main/resources to target/classes
[INFO] skip non existing resourceDirectory /home/iurt/rpmbuild/BUILD/jline2-2.14.6-build/jline2-jline-2.14.6/src/main/filtered-resources
[INFO]
[INFO] --- compiler:3.12.1:compile (default-compile) @ jline ---
[INFO] Toolchain in maven-compiler-plugin: JDK[/usr/lib/jvm/java-25-openjdk]
[INFO] Recompiling the module because of changed source code.
[INFO] Compiling 53 source files with javac [forked debug target 1.8] to target/classes
[WARNING] /home/iurt/rpmbuild/BUILD/jline2-2.14.6-build/jline2-jline-2.14.6/src/main/java/jline/AnsiWindowsTerminal.java:[14,27] [deprecation] WindowsAnsiOutputStream in org.fusesource.jansi has been deprecated
[WARNING] /home/iurt/rpmbuild/BUILD/jline2-2.14.6-build/jline2-jline-2.14.6/src/main/java/jline/AnsiWindowsTerminal.java:[45,27] [deprecation] WindowsAnsiOutputStream in org.fusesource.jansi has been deprecated
[WARNING] /home/iurt/rpmbuild/BUILD/jline2-2.14.6-build/jline2-jline-2.14.6/src/main/java/jline/AnsiWindowsTerminal.java:[57,38] [deprecation] wrapOutputStream(OutputStream) in AnsiConsole has been deprecated
[WARNING] /home/iurt/rpmbuild/BUILD/jline2-2.14.6-build/jline2-jline-2.14.6/src/main/java/jline/AnsiWindowsTerminal.java:[64,30] [deprecation] WindowsAnsiOutputStream in org.fusesource.jansi has been deprecated
[WARNING] /home/iurt/rpmbuild/BUILD/jline2-2.14.6-build/jline2-jline-2.14.6/src/main/java/jline/DefaultTerminal2.java:[36,23] [this-escape] possible 'this' escape before subclass is fully initialized
[WARNING] /home/iurt/rpmbuild/BUILD/jline2-2.14.6-build/jline2-jline-2.14.6/src/main/java/jline/OSvTerminal.java:[40,32] [deprecation] newInstance() in Class has been deprecated
where T is a type-variable:
T extends Object declared in class Class
[WARNING] /home/iurt/rpmbuild/BUILD/jline2-2.14.6-build/jline2-jline-2.14.6/src/main/java/jline/OSvTerminal.java:[35,24] [this-escape] possible 'this' escape before subclass is fully initialized
[WARNING] /home/iurt/rpmbuild/BUILD/jline2-2.14.6-build/jline2-jline-2.14.6/src/main/java/jline/TerminalFactory.java:[100,101] [deprecation] newInstance() in Class has been deprecated
where T is a type-variable:
T extends Object declared in class Class
[WARNING] /home/iurt/rpmbuild/BUILD/jline2-2.14.6-build/jline2-jline-2.14.6/src/main/java/jline/TerminalFactory.java:[202,24] [deprecation] newInstance() in Class has been deprecated
where T is a type-variable:
T extends Object declared in class Class
[WARNING] /home/iurt/rpmbuild/BUILD/jline2-2.14.6-build/jline2-jline-2.14.6/src/main/java/jline/TerminalFactory.java:[205,29] [deprecation] newInstance() in Class has been deprecated
where T is a type-variable:
T extends Object declared in class Class
[WARNING] /home/iurt/rpmbuild/BUILD/jline2-2.14.6-build/jline2-jline-2.14.6/src/main/java/jline/UnsupportedTerminal.java:[27,24] [this-escape] possible 'this' escape before subclass is fully initialized
[WARNING] /home/iurt/rpmbuild/BUILD/jline2-2.14.6-build/jline2-jline-2.14.6/src/main/java/jline/console/ConsoleKeys.java:[36,16] [this-escape] possible 'this' escape before subclass is fully initialized
[WARNING] /home/iurt/rpmbuild/BUILD/jline2-2.14.6-build/jline2-jline-2.14.6/src/main/java/jline/console/ConsoleReader.java:[358,19] [removal] finalize() in Object has been deprecated and marked for removal
[WARNING] /home/iurt/rpmbuild/BUILD/jline2-2.14.6-build/jline2-jline-2.14.6/src/main/java/jline/console/ConsoleReader.java:[363,17] [removal] finalize() in Object has been deprecated and marked for removal
[WARNING] /home/iurt/rpmbuild/BUILD/jline2-2.14.6-build/jline2-jline-2.14.6/src/main/java/jline/console/ConsoleReader.java:[248,16] [this-escape] possible 'this' escape before subclass is fully initialized
[WARNING] /home/iurt/rpmbuild/BUILD/jline2-2.14.6-build/jline2-jline-2.14.6/src/main/java/jline/internal/NonBlockingInputStream.java:[59,34] [this-escape] possible 'this' escape before subclass is fully initialized
[WARNING] /home/iurt/rpmbuild/BUILD/jline2-2.14.6-build/jline2-jline-2.14.6/src/main/java/jline/console/completer/EnumCompleter.java:[30,27] [this-escape] possible 'this' escape before subclass is fully initialized
[WARNING] /home/iurt/rpmbuild/BUILD/jline2-2.14.6-build/jline2-jline-2.14.6/src/main/java/jline/console/completer/StringsCompleter.java:[36,18] [this-escape] possible 'this' escape before subclass is fully initialized
[WARNING] /home/iurt/rpmbuild/BUILD/jline2-2.14.6-build/jline2-jline-2.14.6/src/main/java/jline/console/history/FileHistory.java:[57,16] [this-escape] possible 'this' escape before subclass is fully initialized
[WARNING] /home/iurt/rpmbuild/BUILD/jline2-2.14.6-build/jline2-jline-2.14.6/src/main/java/jline/console/internal/ConsoleRunner.java:[65,55] [deprecation] newInstance() in Class has been deprecated
where T is a type-variable:
T extends Object declared in class Class
[WARNING] /home/iurt/rpmbuild/BUILD/jline2-2.14.6-build/jline2-jline-2.14.6/src/main/java/jline/internal/InputStreamReader.java:[26] [dangling-doc-comments] documentation comment is not attached to any declaration
[WARNING] /home/iurt/rpmbuild/BUILD/jline2-2.14.6-build/jline2-jline-2.14.6/src/main/java/jline/internal/Urls.java:[29,19] [deprecation] URL(String) in URL has been deprecated
[INFO]
[INFO] --- bundle:5.1.9:manifest (default) @ jline ---
[INFO] No MANIFEST.MF file found, generating manifest.
[INFO] Writing manifest: /home/iurt/rpmbuild/BUILD/jline2-2.14.6-build/jline2-jline-2.14.6/target/classes/META-INF/MANIFEST.MF
[INFO]
[INFO] --- resources:3.3.1:testResources (default-testResources) @ jline ---
[INFO] Copying 6 resources from src/test/resources to target/test-classes
[INFO] skip non existing resourceDirectory /home/iurt/rpmbuild/BUILD/jline2-2.14.6-build/jline2-jline-2.14.6/src/test/filtered-resources
[INFO]
[INFO] --- compiler:3.12.1:testCompile (default-testCompile) @ jline ---
[INFO] Toolchain in maven-compiler-plugin: JDK[/usr/lib/jvm/java-25-openjdk]
[INFO] Recompiling the module because of changed dependency.
[INFO] Compiling 22 source files with javac [forked debug target 1.8] to target/test-classes
[WARNING] /home/iurt/rpmbuild/BUILD/jline2-2.14.6-build/jline2-jline-2.14.6/src/test/java/jline/example/PasswordReader.java:[27,14] [deprecation] Character(char) in Character has been deprecated
[WARNING] /home/iurt/rpmbuild/BUILD/jline2-2.14.6-build/jline2-jline-2.14.6/src/test/java/jline/example/PasswordReader.java:[28,14] [deprecation] Character(char) in Character has been deprecated
[INFO]
[INFO] --- surefire:3.2.2:test (default-test) @ jline ---
[INFO] Toolchain in maven-surefire-plugin: JDK[/usr/lib/jvm/java-25-openjdk]
[INFO] Using auto detected provider org.apache.maven.surefire.junit4.JUnit4Provider
[INFO]
[INFO] -------------------------------------------------------
[INFO] T E S T S
[INFO] -------------------------------------------------------
[INFO] Running jline.console.HistorySearchTest
[INFO] Tests run: 6, Failures: 0, Errors: 0, Skipped: 0, Time elapsed: 0.314 s -- in jline.console.HistorySearchTest
[INFO] Running jline.console.ConsoleReaderTest
[ERROR] Tests run: 28, Failures: 1, Errors: 0, Skipped: 8, Time elapsed: 0.527 s <<< FAILURE! -- in jline.console.ConsoleReaderTest
[ERROR] jline.console.ConsoleReaderTest.testBell -- Time elapsed: 0.018 s <<< FAILURE!
java.lang.AssertionError: out should have received bell expected:<1> but was:<0>
at org.junit.Assert.fail(Assert.java:89)
at org.junit.Assert.failNotEquals(Assert.java:835)
at org.junit.Assert.assertEquals(Assert.java:647)
at jline.console.ConsoleReaderTest.testBell(ConsoleReaderTest.java:619)
at java.base/jdk.internal.reflect.DirectMethodHandleAccessor.invoke(DirectMethodHandleAccessor.java:104)
at java.base/java.lang.reflect.Method.invoke(Method.java:565)
at org.junit.runners.model.FrameworkMethod$1.runReflectiveCall(FrameworkMethod.java:59)
at org.junit.internal.runners.model.ReflectiveCallable.run(ReflectiveCallable.java:12)
at org.junit.runners.model.FrameworkMethod.invokeExplosively(FrameworkMethod.java:61)
at org.junit.internal.runners.statements.InvokeMethod.evaluate(InvokeMethod.java:17)
at org.junit.internal.runners.statements.RunBefores.evaluate(RunBefores.java:26)
at org.junit.internal.runners.statements.RunAfters.evaluate(RunAfters.java:27)
at org.junit.runners.ParentRunner$3.evaluate(ParentRunner.java:306)
at org.junit.runners.BlockJUnit4ClassRunner$1.evaluate(BlockJUnit4ClassRunner.java:100)
at org.junit.runners.ParentRunner.runLeaf(ParentRunner.java:366)
at org.junit.runners.BlockJUnit4ClassRunner.runChild(BlockJUnit4ClassRunner.java:103)
at org.junit.runners.BlockJUnit4ClassRunner.runChild(BlockJUnit4ClassRunner.java:63)
at org.junit.runners.ParentRunner$4.run(ParentRunner.java:331)
at org.junit.runners.ParentRunner$1.schedule(ParentRunner.java:79)
at org.junit.runners.ParentRunner.runChildren(ParentRunner.java:329)
at org.junit.runners.ParentRunner.access$100(ParentRunner.java:66)
at org.junit.runners.ParentRunner$2.evaluate(ParentRunner.java:293)
at org.junit.runners.ParentRunner$3.evaluate(ParentRunner.java:306)
at org.junit.runners.ParentRunner.run(ParentRunner.java:413)
at org.apache.maven.surefire.junit4.JUnit4Provider.execute(JUnit4Provider.java:316)
at org.apache.maven.surefire.junit4.JUnit4Provider.executeWithRerun(JUnit4Provider.java:240)
at org.apache.maven.surefire.junit4.JUnit4Provider.executeTestSet(JUnit4Provider.java:214)
at org.apache.maven.surefire.junit4.JUnit4Provider.invoke(JUnit4Provider.java:155)
at org.apache.maven.surefire.booter.ForkedBooter.runSuitesInProcess(ForkedBooter.java:385)
at org.apache.maven.surefire.booter.ForkedBooter.execute(ForkedBooter.java:162)
at org.apache.maven.surefire.booter.ForkedBooter.run(ForkedBooter.java:507)
at org.apache.maven.surefire.booter.ForkedBooter.main(ForkedBooter.java:495)
[INFO] Running jline.console.history.MemoryHistoryTest
[INFO] Tests run: 7, Failures: 0, Errors: 0, Skipped: 0, Time elapsed: 0.001 s -- in jline.console.history.MemoryHistoryTest
[INFO] Running jline.console.history.FileHistoryTest
[INFO] Tests run: 1, Failures: 0, Errors: 0, Skipped: 0, Time elapsed: 0.001 s -- in jline.console.history.FileHistoryTest
[INFO] Running jline.console.history.HistoryTest
[INFO] Tests run: 2, Failures: 0, Errors: 0, Skipped: 0, Time elapsed: 0.296 s -- in jline.console.history.HistoryTest
[INFO] Running jline.console.ViMoveModeTest
[INFO] Tests run: 34, Failures: 0, Errors: 0, Skipped: 0, Time elapsed: 0.157 s -- in jline.console.ViMoveModeTest
[INFO] Running jline.console.EditLineTest
[INFO] Tests run: 11, Failures: 0, Errors: 0, Skipped: 0, Time elapsed: 0.041 s -- in jline.console.EditLineTest
[INFO] Running jline.console.KillRingTest
[INFO] Tests run: 12, Failures: 0, Errors: 0, Skipped: 0, Time elapsed: 0.017 s -- in jline.console.KillRingTest
[INFO] Running jline.console.completer.ArgumentCompleterTest
[INFO] Tests run: 3, Failures: 0, Errors: 0, Skipped: 0, Time elapsed: 0.011 s -- in jline.console.completer.ArgumentCompleterTest
[INFO] Running jline.console.completer.NullCompleterTest
[INFO] Tests run: 1, Failures: 0, Errors: 0, Skipped: 0, Time elapsed: 0 s -- in jline.console.completer.NullCompleterTest
[INFO] Running jline.console.completer.StringsCompleterTest
[INFO] Tests run: 1, Failures: 0, Errors: 0, Skipped: 0, Time elapsed: 0.002 s -- in jline.console.completer.StringsCompleterTest
[INFO] Running jline.console.completer.WhitespaceDelimiterTest
[INFO] Tests run: 5, Failures: 0, Errors: 0, Skipped: 0, Time elapsed: 0.005 s -- in jline.console.completer.WhitespaceDelimiterTest
[INFO] Running jline.readline.KeyMapTest
[INFO] Tests run: 1, Failures: 0, Errors: 0, Skipped: 0, Time elapsed: 0.001 s -- in jline.readline.KeyMapTest
[INFO] Running jline.internal.LogTest
[INFO] Tests run: 5, Failures: 0, Errors: 0, Skipped: 0, Time elapsed: 0.003 s -- in jline.internal.LogTest
[INFO] Running jline.internal.ConfigurationTest
[INFO] Tests run: 11, Failures: 0, Errors: 0, Skipped: 0, Time elapsed: 0.005 s -- in jline.internal.ConfigurationTest
[INFO] Running jline.internal.TerminalLineSettingsTest
[INFO] Tests run: 8, Failures: 0, Errors: 0, Skipped: 0, Time elapsed: 0.006 s -- in jline.internal.TerminalLineSettingsTest
[INFO] Running jline.internal.CursesTest
[INFO] Tests run: 1, Failures: 0, Errors: 0, Skipped: 0, Time elapsed: 0 s -- in jline.internal.CursesTest
[INFO] Running jline.internal.InfoCmpTest
[INFO] Tests run: 2, Failures: 0, Errors: 0, Skipped: 0, Time elapsed: 0.005 s -- in jline.internal.InfoCmpTest
[INFO]
[INFO] Results:
[INFO]
[ERROR] Failures:
[ERROR] ConsoleReaderTest.testBell:619 out should have received bell expected:<1> but was:<0>
[INFO]
[ERROR] Tests run: 139, Failures: 1, Errors: 0, Skipped: 8
[INFO]
[INFO]
[INFO] ------------------------------------------------------------------------
[INFO] Skipping JLine
[INFO] This project has been banned from the build due to previous failures.
[INFO] ------------------------------------------------------------------------
[INFO] ------------------------------------------------------------------------
[INFO] BUILD FAILURE
[INFO] ------------------------------------------------------------------------
[INFO] Total time: 9.836 s
[INFO] Finished at: 2026-10-03T10:49:22Z
[INFO] ------------------------------------------------------------------------
[ERROR] Failed to execute goal org.apache.maven.plugins:maven-surefire-plugin:3.2.2:test (default-test) on project jline: There are test failures.
[ERROR]
[ERROR] Please refer to /home/iurt/rpmbuild/BUILD/jline2-2.14.6-build/jline2-jline-2.14.6/target/surefire-reports for the individual test results.
[ERROR] Please refer to dump files (if any exist) [date].dump, [date]-jvmRun[N].dump and [date].dumpstream.
[ERROR] -> [Help 1]
[ERROR]
[ERROR] To see the full stack trace of the errors, re-run Maven with the -e switch.
[ERROR] Re-run Maven using the -X switch to enable full debug logging.
[ERROR]
[ERROR] For more information about the errors and possible solutions, please read the following articles:
[ERROR] [Help 1] http://cwiki.apache.org/confluence/display/MAVEN/MojoFailureException
error: Bad exit status from /home/iurt/rpmbuild/tmp/rpm-tmp.kfFdbT (%build)
RPM build errors:
Bad exit status from /home/iurt/rpmbuild/tmp/rpm-tmp.kfFdbT (%build)
I: [iurt_root_command] ERROR: chroot
I: [iurt] [iurt] --------------- end of command output ---------------
D: [iurt] [iurt] clean chroot
D: [iurt_root_command] Running iurt_root_command --netns_delete /home/iurt/chroot_tmp/iurt/chroot_cauldron.x86_64.0.20261003104844
D: [iurt_root_command] Delete network namespace for given chroot, killing all processes
D: [iurt_root_command] Success!
D: [iurt_root_command] Running iurt_root_command --umount /home/iurt/chroot_tmp/iurt/chroot_cauldron.x86_64.0.20261003104844/proc
D: [iurt_root_command] Unmounting
D: [iurt_root_command] Success!
D: [iurt_root_command] Running iurt_root_command --umount /home/iurt/chroot_tmp/iurt/chroot_cauldron.x86_64.0.20261003104844/dev/pts
D: [iurt_root_command] Unmounting
D: [iurt_root_command] Success!
D: [iurt_root_command] Running iurt_root_command --umount /home/iurt/chroot_tmp/iurt/chroot_cauldron.x86_64.0.20261003104844/dev/shm
D: [iurt_root_command] Unmounting
D: [iurt_root_command] Success!
[iurt] [iurt] cleaning /home/iurt/chroot_tmp/iurt/chroot_cauldron.x86_64.0.20261003104844
[iurt] [iurt] removing /home/iurt/chroot_tmp/iurt/chroot_cauldron.x86_64.0.20261003104844
D: [iurt_root_command] Running iurt_root_command --rm -r /home/iurt/chroot_tmp/iurt/chroot_cauldron.x86_64.0.20261003104844
D: [iurt_root_command] Removing files
D: [iurt_root_command] removing /home/iurt/chroot_tmp/iurt/chroot_cauldron.x86_64.0.20261003104844
D: [iurt_root_command] Success!