*: [iurt] This is iurt version 0.9.4
D: [iurt] [iurt] load config: /home/iurt/.iurt.cauldron.conf
D: [iurt] [iurt] load config: /etc/iurt/build/cauldron.conf
D: [iurt] [iurt] Setting PERL_EXTUTILS_AUTOINSTALL to --skipdeps
D: [iurt] [iurt] Setting PERL_AUTOINSTALL to --skipdeps
I: [iurt] [iurt] local spool: /home/iurt/iurt/cauldron/core/release/20260922133846.ns80.duvel.4098665-x86_64
I: [iurt] [iurt] Packages to build: 1
D: [iurt] [iurt] using 0.20260922133902 as chroot extension
D: [iurt] [iurt] using local user iurt, id 517
I: [iurt] [iurt] Remove existing chroot
D: [iurt] [iurt] ... dir /home/iurt/chroot_tmp all prefix chroot_cauldron.x86_64
D: [iurt] [iurt] running with pid 3414741
N: [iurt] [iurt] Build package @2372383:guava-33.5.0-1.mga11.src.rpm [1/1]
D: [iurt] [iurt] Not reusing old chroot
I: [iurt] [iurt] Install new chroot
D: [iurt] [iurt] ... in /home/iurt/chroot_tmp/iurt/chroot_cauldron.x86_64.0.20260922133902
D: [iurt] [iurt] clean chroot
N: [iurt] [iurt] creating chroot
D: [iurt_root_command] Running iurt_root_command --mkdir -p /home/iurt/chroot_tmp/iurt/chroot_cauldron.x86_64.0.20260922133902.tmp.44dV3s
D: [iurt_root_command] Creating the path
D: [iurt_root_command] Success!
D: [iurt] [iurt] decompressing /var/log/qa from /home/iurt/chroot_cauldron.x86_64.tar in /home/iurt/chroot_tmp/iurt/chroot_cauldron.x86_64.0.20260922133902.tmp.44dV3s
D: [iurt_root_command] Running iurt_root_command --untar /home/iurt/chroot_cauldron.x86_64.tar /home/iurt/chroot_tmp/iurt/chroot_cauldron.x8...
D: [iurt_root_command] Uncompress tarball
D: [iurt_root_command] Success!
D: [iurt_root_command] Running iurt_root_command --mkdir -m 1023 /home/iurt/chroot_tmp/iurt/chroot_cauldron.x86_64.0.20260922133902.tmp.44dV...
D: [iurt_root_command] Creating the path
D: [iurt_root_command] Success!
/bin/cp: cannot create special file '/home/iurt/chroot_tmp/iurt/chroot_cauldron.x86_64.0.20260922133902.tmp.44dV3s/tmp/tmp.J2q_Ww/dev/null': Operation not permitted
% Total % Received % Xferd Average Speed Time Time Time Current
Dload Upload Total Spent Left Speed
0 0 0 0 0 0 0 0 --:--:-- --:--:-- --:--:-- 0
65 3316k 65 2160k 0 0 105M 0 --:--:-- --:--:-- --:--:-- 100M
100 3316k 100 3316k 0 0 107M 0 --:--:-- --:--:-- --:--:-- 104M
% Total % Received % Xferd Average Speed Time Time Time Current
Dload Upload Total Spent Left Speed
0 0 0 0 0 0 0 0 --:--:-- --:--:-- --:--:-- 0
100 32 100 32 0 0 32000 0 --:--:-- --:--:-- --:--:-- 32000
N: [iurt] [iurt] chroot tarball is already up-to-date
D: [iurt_root_command] Running iurt_root_command --rm -r /home/iurt/chroot_tmp/iurt/chroot_cauldron.x86_64.0.20260922133902.tmp.44dV3s
D: [iurt_root_command] Removing files
D: [iurt_root_command] removing /home/iurt/chroot_tmp/iurt/chroot_cauldron.x86_64.0.20260922133902.tmp.44dV3s
D: [iurt_root_command] Success!
D: [iurt_root_command] Running iurt_root_command --rm -r /home/iurt/chroot_tmp/iurt/chroot_cauldron.x86_64.0.20260922133902
D: [iurt_root_command] Removing files
D: [iurt_root_command] removing /home/iurt/chroot_tmp/iurt/chroot_cauldron.x86_64.0.20260922133902
D: [iurt_root_command] Success!
D: [iurt_root_command] Running iurt_root_command --mkdir -p /home/iurt/chroot_tmp/iurt/chroot_cauldron.x86_64.0.20260922133902
D: [iurt_root_command] Creating the path
D: [iurt_root_command] Success!
D: [iurt_root_command] Running iurt_root_command --untar /home/iurt/chroot_cauldron.x86_64.tar /home/iurt/chroot_tmp/iurt/chroot_cauldron.x8...
D: [iurt_root_command] Uncompress tarball
D: [iurt_root_command] Success!
N: [iurt] [iurt] chroot recreated in /home/iurt/chroot_tmp/iurt/chroot_cauldron.x86_64.0.20260922133902 (from /home/iurt/chroot_cauldron.x86_64.tar)
D: [iurt_root_command] Running iurt_root_command --netns_create /home/iurt/chroot_tmp/iurt/chroot_cauldron.x86_64.0.20260922133902
D: [iurt_root_command] Create network namespace for given chroot
D: [iurt_root_command] Success!
D: [iurt_root_command] Running iurt_root_command --cp /tmp/rpmmacros.DHc4cL /home/iurt/chroot_tmp/iurt/chroot_cauldron.x86_64.0.202609221339...
D: [iurt_root_command] Copying files
D: [iurt_root_command] copying /tmp/rpmmacros.DHc4cL -> /home/iurt/chroot_tmp/iurt/chroot_cauldron.x86_64.0.20260922133902/etc/rpm/macros
D: [iurt_root_command] Success!
D: [iurt_root_command] Running iurt_root_command --bindmount /proc /home/iurt/chroot_tmp/iurt/chroot_cauldron.x86_64.0.20260922133902/proc
D: [iurt_root_command] Bind mounting
D: [iurt_root_command] Success!
D: [iurt_root_command] Running iurt_root_command --bindmount /dev/pts /home/iurt/chroot_tmp/iurt/chroot_cauldron.x86_64.0.20260922133902/dev...
D: [iurt_root_command] Bind mounting
D: [iurt_root_command] Success!
D: [iurt_root_command] Running iurt_root_command --tmpfs /home/iurt/chroot_tmp/iurt/chroot_cauldron.x86_64.0.20260922133902/dev/shm
D: [iurt_root_command] Mount tmpfs
D: [iurt_root_command] Success!
I: [iurt] [iurt] add chroot media: http://repository.mageia.org/distrib//cauldron/x86_64
D: [iurt] [iurt] Using timeout of 600 seconds.
D: [iurt] [iurt] /usr/bin/sudo /usr/sbin/iurt_root_command --urpmi-addmedia -v --urpmi-root /home/iurt/chroot_tmp/iurt/chroot_cauldron.x86_64.0.20260922133902 core_release http://repository.mageia.org/distrib//cauldron/x86_64/media/core/release
D: [iurt] [iurt] Command exited with 0.
MEDIA core_release
(core_release)
D: [iurt] [iurt] creating user iurt in chroot /home/iurt/chroot_tmp/iurt/chroot_cauldron.x86_64.0.20260922133902
D: [iurt_root_command] Running iurt_root_command --useradd /home/iurt/chroot_tmp/iurt/chroot_cauldron.x86_64.0.20260922133902 iurt 517
D: [iurt_root_command] Useradd
useradd warning: iurt's uid 517 outside of the UID_MIN 1000 and UID_MAX 60000 range.
D: [iurt_root_command] Success!
N: [iurt] [iurt] recreate srpm: @2372383:guava-33.5.0-1.mga11.src.rpm
D: [iurt] [iurt] Using timeout of 600 seconds.
D: [iurt] [iurt] perl command
D: [iurt_root_command] Running iurt_root_command --cp /home/iurt/iurt/cauldron/core/release/20260922133846.ns80.duvel.4098665-x86_64//@23723...
D: [iurt_root_command] Copying files
D: [iurt_root_command] copying /home/iurt/iurt/cauldron/core/release/20260922133846.ns80.duvel.4098665-x86_64//@2372383:guava-33.5.0-1.mga11.src.rpm -> /home/iurt/chroot_tmp/iurt/chroot_cauldron.x86_64.0.20260922133902/home/iurt/rpmbuild/SRPMS/
D: [iurt_root_command] Success!
D: [iurt] [iurt] Command exited with 0.
D: [iurt] [iurt] recreating src.rpm...
D: [iurt] [iurt] Using timeout of 600 seconds.
D: [iurt] [iurt] /usr/bin/sudo /usr/sbin/iurt_root_command --chroot /home/iurt/chroot_tmp/iurt/chroot_cauldron.x86_64.0.20260922133902 su iurt -c "rpm -i /home/iurt/rpmbuild/SRPMS/@2372383:guava-33.5.0-1.mga11.src.rpm"
D: [iurt] [iurt] Command exited with 0.
D: [iurt] [iurt] calling callback for install_@2372383:guava-33.5.0-1.mga11.src.rpm
D: [iurt] [iurt] Using timeout of 600 seconds.
D: [iurt] [iurt] /usr/bin/sudo /usr/sbin/iurt_root_command --chroot /home/iurt/chroot_tmp/iurt/chroot_cauldron.x86_64.0.20260922133902 su iurt -c "rpmspec -q --qf %{NVR}.src.rpm --srpm /home/iurt/rpmbuild/SPECS/guava.spec | tail -n1 > /home/iurt/rpmbuild/SPECS/guava.spec.srpm_name"
D: [iurt] [iurt] Forking to monitor log size
D: [iurt] [iurt] Command exited with 0.
D: [iurt_root_command] Running iurt_root_command --rm /home/iurt/chroot_tmp/iurt/chroot_cauldron.x86_64.0.20260922133902/home/iurt/rpmbuild/...
D: [iurt_root_command] Removing files
D: [iurt_root_command] removing /home/iurt/chroot_tmp/iurt/chroot_cauldron.x86_64.0.20260922133902/home/iurt/rpmbuild/SRPMS/@2372383:guava-33.5.0-1.mga11.src.rpm
D: [iurt_root_command] Success!
D: [iurt] [iurt] Using timeout of 600 seconds.
D: [iurt] [iurt] /usr/bin/sudo /usr/sbin/iurt_root_command --chroot /home/iurt/chroot_tmp/iurt/chroot_cauldron.x86_64.0.20260922133902 su iurt -c "rpmbuild --target x86_64 --nodeps -bs /home/iurt/rpmbuild/SPECS/guava.spec"
D: [iurt] [iurt] Forking to monitor log size
D: [iurt] [iurt] Command exited with 0.
D: [iurt_root_command] Running iurt_root_command --ln /home/iurt/chroot_tmp/iurt/chroot_cauldron.x86_64.0.20260922133902/home/iurt/rpmbuild/...
D: [iurt_root_command] Linking files
D: [iurt_root_command] Success!
N: [iurt] [iurt] new srpm: @2372383:guava-33.5.0-1.mga11.src.rpm
I: [iurt] [iurt] updating packages in /home/iurt/chroot_tmp/iurt/chroot_cauldron.x86_64.0.20260922133902
D: [iurt] [iurt] Using timeout of 600 seconds.
D: [iurt] [iurt] /usr/bin/sudo /usr/sbin/iurt_root_command --urpmi --urpmi-root /home/iurt/chroot_tmp/iurt/chroot_cauldron.x86_64.0.20260922133902 --auto-update --auto
D: [iurt] [iurt] Command exited with 0.
I: [iurt] [iurt] Install build dependencies for @2372383:guava-33.5.0-1.mga11.src.rpm
D: [iurt] [iurt] installing /home/iurt/chroot_tmp/iurt/chroot_cauldron.x86_64.0.20260922133902/home/iurt/rpmbuild/SRPMS//@2372383:guava-33.5.0-1.mga11.src.rpm
I: [iurt] [iurt] install dependencies using urpmi
D: [iurt] [iurt] Using timeout of 3600 seconds.
D: [iurt] [iurt] Forking to monitor log size
D: [iurt] [iurt] /usr/bin/sudo /usr/sbin/iurt_root_command --urpmi -v --no-verify-rpm --tune-rpm=all --nolock --auto --no-recommends --ignoresize --noclean --urpmi-root /home/iurt/chroot_tmp/iurt/chroot_cauldron.x86_64.0.20260922133902 --buildrequires /home/iurt/chroot_tmp/iurt/chroot_cauldron.x86_64.0.20260922133902/home/iurt/rpmbuild/SRPMS//@2372383:guava-33.5.0-1.mga11.src.rpm
D: [iurt] [iurt] Command exited with 0.
D: [iurt] [iurt] calling callback for install_deps_@2372383:guava-33.5.0-1.mga11.src.rpm
D: [iurt] [iurt] missing_deps is empty, aborting.
D: [iurt] [iurt] output had: __ D: [iurt_root_command] urpmi
examining synthesis file [/home/iurt/chroot_tmp/iurt/chroot_cauldron.x86_64.0.20260922133902/var/lib/urpmi/synthesis.hdlist.core_release.cz]
would install instead of upgrade package kernel-desktop-6.18.44-1.mga11-1-1.mga11.x86_64
would install instead of upgrade package kernel-desktop-devel-6.18.44-1.mga11-1-1.mga11.x86_64
would install instead of upgrade package kernel-server-6.18.44-1.mga11-1-1.mga11.x86_64
would install instead of upgrade package kernel-server-devel-6.18.44-1.mga11-1-1.mga11.x86_64
would install instead of upgrade package kernel-linus-6.18.44-1.mga11.x86_64
would install instead of upgrade package kernel-linus-devel-6.18.44-1.mga11.x86_64
retrieving rpm files from medium "core_release"...
http://repository.mageia.org/distrib/cauldron/x86_64/media/core/release/lib64xcb-render0-1.17.0-2.mga10.x86_64.rpm
0% of 0 completed, ETA = --:--:--, speed = 0
100% of 22146 completed, ETA = --:--:--, speed = 21.1M
http://repository.mageia.org/distrib/cauldron/x86_64/media/core/release/libalsa-data-1.2.16.1-1.mga11.noarch.rpm
0% of 0 completed, ETA = --:--:--, speed = 0
100% of 274k completed, ETA = --:--:--, speed = 134M
http://repository.mageia.org/distrib/cauldron/x86_64/media/core/release/lib64xcomposite1-0.4.7-1.mga11.x86_64.rpm
0% of 0 completed, ETA = --:--:--, speed = 0
100% of 11892 completed, ETA = --:--:--, speed = 11.3M
http://repository.mageia.org/distrib/cauldron/x86_64/media/core/release/lib64harfbuzz0-14.5.0-1.mga11.x86_64.rpm
0% of 0 completed, ETA = --:--:--, speed = 0
100% of 1545k completed, ETA = --:--:--, speed = 71.8M
http://repository.mageia.org/distrib/cauldron/x86_64/media/core/release/x11-font-type1-1.0.0-19.mga10.noarch.rpm
0% of 0 completed, ETA = --:--:--, speed = 0
100% of 6421 completed, ETA = --:--:--, speed = 6270k
http://repository.mageia.org/distrib/cauldron/x86_64/media/core/release/timezone-java-2025b-1.mga10.noarch.rpm
0% of 0 completed, ETA = --:--:--, speed = 0
100% of 143k completed, ETA = --:--:--, speed = 70.0M
http://repository.mageia.org/distrib/cauldron/x86_64/media/core/release/lua-posix-35.0-5.mga10.x86_64.rpm
0% of 0 completed, ETA = --:--:--, speed = 0
100% of 126k completed, ETA = --:--:--, speed = 123M
http://repository.mageia.org/distrib/cauldron/x86_64/media/core/release/x11-font-bitstream-type1-1.0.4-2.mga10.noarch.rpm
0% of 0 completed, ETA = --:--:--, speed = 0
100% of 307k completed, ETA = --:--:--, speed = 150M
http://repository.mageia.org/distrib/cauldron/x86_64/media/core/release/lib64nss3-3.129.0-1.mga11.x86_64.rpm
0% of 0 completed, ETA = --:--:--, speed = 0
100% of 1433k completed, ETA = --:--:--, speed = 107M
http://repository.mageia.org/distrib/cauldron/x86_64/media/core/release/javapackages-tools-6.5.1-1.mga11.noarch.rpm
0% of 0 completed, ETA = --:--:--, speed = 0
100% of 33729 completed, ETA = --:--:--, speed = 32.1M
http://repository.mageia.org/distrib/cauldron/x86_64/media/core/release/lua-5.4.8-1.mga10.x86_64.rpm
0% of 0 completed, ETA = --:--:--, speed = 0
100% of 215k completed, ETA = --:--:--, speed = 104M
http://repository.mageia.org/distrib/cauldron/x86_64/media/core/release/lib64jpeg8-3.2.0-1.mga11.x86_64.rpm
0% of 0 completed, ETA = --:--:--, speed = 0
100% of 276k completed, ETA = --:--:--, speed = 67.5M
http://repository.mageia.org/distrib/cauldron/x86_64/media/core/release/lib64xdmcp6-1.1.5-2.mga10.x86_64.rpm
0% of 0 completed, ETA = --:--:--, speed = 0
100% of 16566 completed, ETA = --:--:--, speed = 15.7M
http://repository.mageia.org/distrib/cauldron/x86_64/media/core/release/lib64fontconfig1-2.17.1-2.mga10.x86_64.rpm
0% of 0 completed, ETA = --:--:--, speed = 0
100% of 146k completed, ETA = --:--:--, speed = 142M
http://repository.mageia.org/distrib/cauldron/x86_64/media/core/release/lib64nspr4-4.40.0-1.mga11.x86_64.rpm
0% of 0 completed, ETA = --:--:--, speed = 0
100% of 136k completed, ETA = --:--:--, speed = 133M
http://repository.mageia.org/distrib/cauldron/x86_64/media/core/release/javapackages-filesystem-6.5.1-1.mga11.noarch.rpm
0% of 0 completed, ETA = --:--:--, speed = 0
100% of 10647 completed, ETA = --:--:--, speed = 10.1M
http://repository.mageia.org/distrib/cauldron/x86_64/media/core/release/javapackages-common-6.5.1-1.mga11.noarch.rpm
0% of 0 completed, ETA = --:--:--, speed = 0
100% of 57756 completed, ETA = --:--:--, speed = 55.0M
http://repository.mageia.org/distrib/cauldron/x86_64/media/core/release/lib64pixman1_0-0.46.4-1.mga10.x86_64.rpm
0% of 0 completed, ETA = --:--:--, speed = 0
100% of 287k completed, ETA = --:--:--, speed = 70.2M
http://repository.mageia.org/distrib/cauldron/x86_64/media/core/release/lib64xi6-1.8.3-1.mga11.x86_64.rpm
0% of 0 completed, ETA = --:--:--, speed = 0
100% of 40476 completed, ETA = --:--:--, speed = 38.6M
http://repository.mageia.org/distrib/cauldron/x86_64/media/core/release/java-25-openjdk-headless-25.0.4.1.1-4.mga11.x86_64.rpm
0% of 0 completed, ETA = --:--:--, speed = 0
100% of 50.7M completed, ETA = --:--:--, speed = 91.6M
http://repository.mageia.org/distrib/cauldron/x86_64/media/core/release/lib64png16_16-1.6.58-1.mga11.x86_64.rpm
0% of 0 completed, ETA = --:--:--, speed = 0
100% of 198k completed, ETA = --:--:--, speed = 97.0M
http://repository.mageia.org/distrib/cauldron/x86_64/media/core/release/lib64gif7-5.2.2-5.mga11.x86_64.rpm
0% of 0 completed, ETA = --:--:--, speed = 0
100% of 42570 completed, ETA = --:--:--, speed = 40.5M
http://repository.mageia.org/distrib/cauldron/x86_64/media/core/release/lib64xau6-1.0.12-2.mga10.x86_64.rpm
0% of 0 completed, ETA = --:--:--, speed = 0
100% of 13251 completed, ETA = --:--:--, speed = 12.6M
http://repository.mageia.org/distrib/cauldron/x86_64/media/core/release/rootcerts-java-20260714.00-1.mga11.noarch.rpm
0% of 0 completed, ETA = --:--:--, speed = 0
100% of 8148 completed, ETA = --:--:--, speed = 7957k
http://repository.mageia.org/distrib/cauldron/x86_64/media/core/release/lib64xrender1-0.9.12-2.mga10.x86_64.rpm
0% of 0 completed, ETA = --:--:--, speed = 0
100% of 25003 completed, ETA = --:--:--, speed = 23.8M
http://repository.mageia.org/distrib/cauldron/x86_64/media/core/release/lib64alsa2-1.2.16.1-1.mga11.x86_64.rpm
0% of 0 completed, ETA = --:--:--, speed = 0
100% of 530k completed, ETA = --:--:--, speed = 129M
http://repository.mageia.org/distrib/cauldron/x86_64/media/core/release/lib64x11_6-1.8.13-1.mga11.x86_64.rpm
0% of 0 completed, ETA = --:--:--, speed = 0
100% of 672k completed, ETA = --:--:--, speed = 109M
http://repository.mageia.org/distrib/cauldron/x86_64/media/core/release/java-25-openjdk-25.0.4.1.1-4.mga11.x86_64.rpm
0% of 0 completed, ETA = --:--:--, speed = 0
100% of 226k completed, ETA = --:--:--, speed = 110M
http://repository.mageia.org/distrib/cauldron/x86_64/media/core/release/jurand-1.3.5-2.mga10.x86_64.rpm
0% of 0 completed, ETA = --:--:--, speed = 0
100% of 93572 completed, ETA = --:--:--, speed = 89.2M
http://repository.mageia.org/distrib/cauldron/x86_64/media/core/release/python3-lxml-6.0.2-1.mga10.x86_64.rpm
0% of 0 completed, ETA = --:--:--, speed = 0
100% of 2212k completed, ETA = --:--:--, speed = 65.4M
http://repository.mageia.org/distrib/cauldron/x86_64/media/core/release/lib64graphite2_3-1.3.15-1.mga11.x86_64.rpm
0% of 0 completed, ETA = --:--:--, speed = 0
100% of 81795 completed, ETA = --:--:--, speed = 78.0M
http://repository.mageia.org/distrib/cauldron/x86_64/media/core/release/python3-javapackages-6.5.1-1.mga11.noarch.rpm
0% of 0 completed, ETA = --:--:--, speed = 0
100% of 87882 completed, ETA = --:--:--, speed = 83.8M
http://repository.mageia.org/distrib/cauldron/x86_64/media/core/release/lib64xcb1-1.17.0-2.mga10.x86_64.rpm
0% of 0 completed, ETA = --:--:--, speed = 0
100% of 56093 completed, ETA = --:--:--, speed = 53.4M
http://repository.mageia.org/distrib/cauldron/x86_64/media/core/release/lksctp-tools-1.0.21-2.mga10.x86_64.rpm
0% of 0 completed, ETA = --:--:--, speed = 0
100% of 50628 completed, ETA = --:--:--, speed = 48.2M
http://repository.mageia.org/distrib/cauldron/x86_64/media/core/release/fontconfig-2.17.1-2.mga10.x86_64.rpm
0% of 0 completed, ETA = --:--:--, speed = 0
100% of 102k completed, ETA = --:--:--, speed = 100M
http://repository.mageia.org/distrib/cauldron/x86_64/media/core/release/copy-jdk-configs-4.1-3.mga10.noarch.rpm
0% of 0 completed, ETA = --:--:--, speed = 0
100% of 26999 completed, ETA = --:--:--, speed = 25.7M
http://repository.mageia.org/distrib/cauldron/x86_64/media/core/release/lib64sctp1-1.0.21-2.mga10.x86_64.rpm
0% of 0 completed, ETA = --:--:--, speed = 0
100% of 48395 completed, ETA = --:--:--, speed = 46.1M
http://repository.mageia.org/distrib/cauldron/x86_64/media/core/release/lib64xtst6-1.2.5-3.mga11.x86_64.rpm
0% of 0 completed, ETA = --:--:--, speed = 0
100% of 18546 completed, ETA = --:--:--, speed = 17.6M
http://repository.mageia.org/distrib/cauldron/x86_64/media/core/release/x11-font-xfree86-type1-1.0.5-2.mga10.noarch.rpm
0% of 0 completed, ETA = --:--:--, speed = 0
100% of 35747 completed, ETA = --:--:--, speed = 34.0M
http://repository.mageia.org/distrib/cauldron/x86_64/media/core/release/nss-3.129.0-1.mga11.x86_64.rpm
0% of 0 completed, ETA = --:--:--, speed = 0
100% of 7865k completed, ETA = --:--:--, speed = 97.2M
http://repository.mageia.org/distrib/cauldron/x86_64/media/core/release/lib64fontenc1-1.1.9-1.mga11.x86_64.rpm
0% of 0 completed, ETA = --:--:--, speed = 0
100% of 20749 completed, ETA = --:--:--, speed = 19.7M
http://repository.mageia.org/distrib/cauldron/x86_64/media/core/release/fonts-filesystem-2.0.5-7.mga10.noarch.rpm
0% of 0 completed, ETA = --:--:--, speed = 0
100% of 7335 completed, ETA = --:--:--, speed = 7163k
http://repository.mageia.org/distrib/cauldron/x86_64/media/core/release/lib64lcms2_2-2.19.1-1.mga11.x86_64.rpm
0% of 0 completed, ETA = --:--:--, speed = 0
100% of 188k completed, ETA = --:--:--, speed = 61.5M
http://repository.mageia.org/distrib/cauldron/x86_64/media/core/release/lib64xext6-1.3.7-1.mga11.x86_64.rpm
0% of 0 completed, ETA = --:--:--, speed = 0
100% of 63441 completed, ETA = --:--:--, speed = 60.5M
http://repository.mageia.org/distrib/cauldron/x86_64/media/core/release/lib64xcb-shm0-1.17.0-2.mga10.x86_64.rpm
0% of 0 completed, ETA = --:--:--, speed = 0
100% of 12066 completed, ETA = --:--:--, speed = 11.5M
http://repository.mageia.org/distrib/cauldron/x86_64/media/core/release/lujavrite-1.2.3-1.mga10.x86_64.rpm
0% of 0 completed, ETA = --:--:--, speed = 0
100% of 18339 completed, ETA = --:--:--, speed = 17.4M
http://repository.mageia.org/distrib/cauldron/x86_64/media/core/release/lib64cairo2-1.18.6-1.mga11.x86_64.rpm
0% of 0 completed, ETA = --:--:--, speed = 0
100% of 792k completed, ETA = --:--:--, speed = 64.5M
http://repository.mageia.org/distrib/cauldron/x86_64/media/core/release/java-25-openjdk-devel-25.0.4.1.1-4.mga11.x86_64.rpm
0% of 0 completed, ETA = --:--:--, speed = 0
100% of 6202k completed, ETA = --:--:--, speed = 97.6M
http://repository.mageia.org/distrib/cauldron/x86_64/media/core/release/mkfontscale-1.2.4-1.mga11.x86_64.rpm
0% of 0 completed, ETA = --:--:--, speed = 0
100% of 33771 completed, ETA = --:--:--, speed = 32.2M
http://repository.mageia.org/distrib/cauldron/x86_64/media/core/release/lib64freetype6-2.14.3-2.mga11.x86_64.rpm
0% of 0 completed, ETA = --:--:--, speed = 0
100% of 391k completed, ETA = --:--:--, speed = 127M
retrieved lib64xcb-render0-1.17.0-2.mga10.x86_64.rpm libalsa-data-1.2.16.1-1.mga11.noarch.rpm lib64xcomposite1-0.4.7-1.mga11.x86_64.rpm lib64harfbuzz0-14.5.0-1.mga11.x86_64.rpm x11-font-type1-1.0.0-19.mga10.noarch.rpm timezone-java-2025b-1.mga10.noarch.rpm lua-posix-35.0-5.mga10.x86_64.rpm x11-font-bitstream-type1-1.0.4-2.mga10.noarch.rpm lib64nss3-3.129.0-1.mga11.x86_64.rpm javapackages-tools-6.5.1-1.mga11.noarch.rpm lua-5.4.8-1.mga10.x86_64.rpm lib64jpeg8-3.2.0-1.mga11.x86_64.rpm lib64xdmcp6-1.1.5-2.mga10.x86_64.rpm lib64fontconfig1-2.17.1-2.mga10.x86_64.rpm lib64nspr4-4.40.0-1.mga11.x86_64.rpm javapackages-filesystem-6.5.1-1.mga11.noarch.rpm javapackages-common-6.5.1-1.mga11.noarch.rpm lib64pixman1_0-0.46.4-1.mga10.x86_64.rpm lib64xi6-1.8.3-1.mga11.x86_64.rpm java-25-openjdk-headless-25.0.4.1.1-4.mga11.x86_64.rpm lib64png16_16-1.6.58-1.mga11.x86_64.rpm lib64gif7-5.2.2-5.mga11.x86_64.rpm lib64xau6-1.0.12-2.mga10.x86_64.rpm rootcerts-java-20260714.00-1.mga11.noarch.rpm lib64xrender1-0.9.12-2.mga10.x86_64.rpm lib64alsa2-1.2.16.1-1.mga11.x86_64.rpm lib64x11_6-1.8.13-1.mga11.x86_64.rpm java-25-openjdk-25.0.4.1.1-4.mga11.x86_64.rpm jurand-1.3.5-2.mga10.x86_64.rpm python3-lxml-6.0.2-1.mga10.x86_64.rpm lib64graphite2_3-1.3.15-1.mga11.x86_64.rpm python3-javapackages-6.5.1-1.mga11.noarch.rpm lib64xcb1-1.17.0-2.mga10.x86_64.rpm lksctp-tools-1.0.21-2.mga10.x86_64.rpm fontconfig-2.17.1-2.mga10.x86_64.rpm copy-jdk-configs-4.1-3.mga10.noarch.rpm lib64sctp1-1.0.21-2.mga10.x86_64.rpm lib64xtst6-1.2.5-3.mga11.x86_64.rpm x11-font-xfree86-type1-1.0.5-2.mga10.noarch.rpm nss-3.129.0-1.mga11.x86_64.rpm lib64fontenc1-1.1.9-1.mga11.x86_64.rpm fonts-filesystem-2.0.5-7.mga10.noarch.rpm lib64lcms2_2-2.19.1-1.mga11.x86_64.rpm lib64xext6-1.3.7-1.mga11.x86_64.rpm lib64xcb-shm0-1.17.0-2.mga10.x86_64.rpm lujavrite-1.2.3-1.mga10.x86_64.rpm lib64cairo2-1.18.6-1.mga11.x86_64.rpm java-25-openjdk-devel-25.0.4.1.1-4.mga11.x86_64.rpm mkfontscale-1.2.4-1.mga11.x86_64.rpm lib64freetype6-2.14.3-2.mga11.x86_64.rpm
...retrieving done
installing javapackages-tools-6.5.1-1.mga11.noarch.rpm lib64nss3-3.129.0-1.mga11.x86_64.rpm lua-5.4.8-1.mga10.x86_64.rpm lib64jpeg8-3.2.0-1.mga11.x86_64.rpm timezone-java-2025b-1.mga10.noarch.rpm lua-posix-35.0-5.mga10.x86_64.rpm x11-font-bitstream-type1-1.0.4-2.mga10.noarch.rpm lib64xcb-render0-1.17.0-2.mga10.x86_64.rpm lib64xcomposite1-0.4.7-1.mga11.x86_64.rpm libalsa-data-1.2.16.1-1.mga11.noarch.rpm lib64harfbuzz0-14.5.0-1.mga11.x86_64.rpm x11-font-type1-1.0.0-19.mga10.noarch.rpm javapackages-common-6.5.1-1.mga11.noarch.rpm lib64pixman1_0-0.46.4-1.mga10.x86_64.rpm lib64xi6-1.8.3-1.mga11.x86_64.rpm javapackages-filesystem-6.5.1-1.mga11.noarch.rpm lib64nspr4-4.40.0-1.mga11.x86_64.rpm lib64xdmcp6-1.1.5-2.mga10.x86_64.rpm lib64fontconfig1-2.17.1-2.mga10.x86_64.rpm rootcerts-java-20260714.00-1.mga11.noarch.rpm lib64gif7-5.2.2-5.mga11.x86_64.rpm lib64xau6-1.0.12-2.mga10.x86_64.rpm java-25-openjdk-headless-25.0.4.1.1-4.mga11.x86_64.rpm lib64png16_16-1.6.58-1.mga11.x86_64.rpm lib64x11_6-1.8.13-1.mga11.x86_64.rpm java-25-openjdk-25.0.4.1.1-4.mga11.x86_64.rpm jurand-1.3.5-2.mga10.x86_64.rpm lib64alsa2-1.2.16.1-1.mga11.x86_64.rpm lib64xrender1-0.9.12-2.mga10.x86_64.rpm lib64xcb1-1.17.0-2.mga10.x86_64.rpm lksctp-tools-1.0.21-2.mga10.x86_64.rpm lib64graphite2_3-1.3.15-1.mga11.x86_64.rpm python3-javapackages-6.5.1-1.mga11.noarch.rpm python3-lxml-6.0.2-1.mga10.x86_64.rpm nss-3.129.0-1.mga11.x86_64.rpm x11-font-xfree86-type1-1.0.5-2.mga10.noarch.rpm lib64xtst6-1.2.5-3.mga11.x86_64.rpm fontconfig-2.17.1-2.mga10.x86_64.rpm copy-jdk-configs-4.1-3.mga10.noarch.rpm lib64sctp1-1.0.21-2.mga10.x86_64.rpm lib64fontenc1-1.1.9-1.mga11.x86_64.rpm fonts-filesystem-2.0.5-7.mga10.noarch.rpm lib64lcms2_2-2.19.1-1.mga11.x86_64.rpm lib64xext6-1.3.7-1.mga11.x86_64.rpm lib64freetype6-2.14.3-2.mga11.x86_64.rpm lib64cairo2-1.18.6-1.mga11.x86_64.rpm mkfontscale-1.2.4-1.mga11.x86_64.rpm java-25-openjdk-devel-25.0.4.1.1-4.mga11.x86_64.rpm lib64xcb-shm0-1.17.0-2.mga10.x86_64.rpm lujavrite-1.2.3-1.mga10.x86_64.rpm from /home/iurt/chroot_tmp/iurt/chroot_cauldron.x86_64.0.20260922133902/var/cache/urpmi/rpms
starting installing packages
created transaction for installing on /home/iurt/chroot_tmp/iurt/chroot_cauldron.x86_64.0.20260922133902 (remove=0, install=0, upgrade=50)
Preparing... #############################################
1/51: lib64png16_16 #############################################
2/51: lib64nspr4 #############################################
3/51: javapackages-filesystem
#############################################
4/51: lib64jpeg8 #############################################
5/51: javapackages-tools #############################################
6/51: nss #############################################
7/51: lib64nss3 #############################################
shell-init: error retrieving current directory: getcwd: cannot access parent directories: No such file or directory
shell-init: error retrieving current directory: getcwd: cannot access parent directories: No such file or directory
8/51: lib64lcms2_2 #############################################
9/51: fonts-filesystem #############################################
10/51: lib64fontenc1 #############################################
11/51: lib64sctp1 #############################################
12/51: lksctp-tools #############################################
13/51: python3-lxml #############################################
14/51: python3-javapackages #############################################
15/51: lib64graphite2_3 #############################################
16/51: lib64xau6 #############################################
17/51: lib64gif7 #############################################
18/51: rootcerts-java #############################################
19/51: lib64xdmcp6 #############################################
20/51: lib64xcb1 #############################################
21/51: lib64x11_6 #############################################
shell-init: error retrieving current directory: getcwd: cannot access parent directories: No such file or directory
22/51: lib64xext6 #############################################
23/51: lib64xrender1 #############################################
24/51: lib64xi6 #############################################
25/51: lib64xtst6 #############################################
26/51: lib64xcomposite1 #############################################
27/51: lib64xcb-render0 #############################################
28/51: lib64xcb-shm0 #############################################
29/51: lib64pixman1_0 #############################################
30/51: lib64cairo2 #############################################
31/51: lib64harfbuzz0 #############################################
32/51: lib64freetype6 #############################################
33/51: lib64fontconfig1 #############################################
34/51: fontconfig #############################################
shell-init: error retrieving current directory: getcwd: cannot access parent directories: No such file or directory
35/51: mkfontscale #############################################
36/51: x11-font-bitstream-type1
#############################################
shell-init: error retrieving current directory: getcwd: cannot access parent directories: No such file or directory
37/51: x11-font-xfree86-type1
#############################################
shell-init: error retrieving current directory: getcwd: cannot access parent directories: No such file or directory
38/51: x11-font-type1 #############################################
39/51: libalsa-data #############################################
shell-init: error retrieving current directory: getcwd: cannot access parent directories: No such file or directory
40/51: lib64alsa2 #############################################
41/51: lua-posix #############################################
42/51: timezone-java #############################################
43/51: lua #############################################
44/51: copy-jdk-configs #############################################
45/51: java-25-openjdk-headless
#############################################
shell-init: error retrieving current directory: getcwd: cannot access parent directories: No such file or directory
46/51: java-25-openjdk #############################################
shell-init: error retrieving current directory: getcwd: cannot access parent directories: No such file or directory
47/51: java-25-openjdk-devel #############################################
shell-init: error retrieving current directory: getcwd: cannot access parent directories: No such file or directory
48/51: javapackages-common #############################################
49/51: lujavrite #############################################
50/51: jurand #############################################
shell-init: error retrieving current directory: getcwd: cannot access parent directories: No such file or directory
shell-init: error retrieving current directory: getcwd: cannot access parent directories: No such file or directory
shell-init: error retrieving current directory: getcwd: cannot access parent directories: No such file or directory
shell-init: error retrieving current directory: getcwd: cannot access parent directories: No such file or directory
shell-init: error retrieving current directory: getcwd: cannot access parent directories: No such file or directory
shell-init: error retrieving current directory: getcwd: cannot access parent directories: No such file or directory
shell-init: error retrieving current directory: getcwd: cannot access parent directories: No such file or directory
shell-init: error retrieving current directory: getcwd: cannot access parent directories: No such file or directory
shell-init: error retrieving current directory: getcwd: cannot access parent directories: No such file or directory
retrieving rpm files from medium "core_release"...
http://repository.mageia.org/distrib/cauldron/x86_64/media/core/release/javapackages-bootstrap-1.28.0-3.mga11.noarch.rpm
0% of 0 completed, ETA = --:--:--, speed = 0
100% of 43.6M completed, ETA = --:--:--, speed = 95.4M
retrieved javapackages-bootstrap-1.28.0-3.mga11.noarch.rpm
...retrieving done
installing javapackages-bootstrap-1.28.0-3.mga11.noarch.rpm from /home/iurt/chroot_tmp/iurt/chroot_cauldron.x86_64.0.20260922133902/var/cache/urpmi/rpms
starting installing packages
created transaction for installing on /home/iurt/chroot_tmp/iurt/chroot_cauldron.x86_64.0.20260922133902 (remove=0, install=0, upgrade=1)
Preparing... #############################################
51/51: javapackages-bootstrap
#############################################
shell-init: error retrieving current directory: getcwd: cannot access parent directories: No such file or directory
D: [iurt_root_command] Success!
__
I: [iurt] [iurt] installation successful
I: [iurt] [iurt] handling dynamic buildrequires
D: [iurt] [iurt] DynamicBuildRequires not required for @2372383:guava-33.5.0-1.mga11.src.rpm
D: [iurt] [iurt] Using timeout of 60 seconds.
D: [iurt] [iurt] rpm --root /home/iurt/chroot_tmp/iurt/chroot_cauldron.x86_64.0.20260922133902 -qa | sort
D: [iurt] [iurt] Forking to monitor log size
D: [iurt] [iurt] Command exited with 0.
N: [iurt] [iurt] Building @2372383:guava-33.5.0-1.mga11.src.rpm
D: [iurt] [iurt] Using timeout of 36000 seconds.
D: [iurt] [iurt] Forking to monitor log size
D: [iurt] [iurt] /usr/bin/sudo /usr/sbin/iurt_root_command --chroot /home/iurt/chroot_tmp/iurt/chroot_cauldron.x86_64.0.20260922133902 /bin/su - iurt -c "TMP=/home/iurt/tmp/ rpmbuild --target noarch --rebuild /home/iurt/rpmbuild/SRPMS/@2372383:guava-33.5.0-1.mga11.src.rpm"
D: [iurt] [iurt] Command exited with 256.
D: [iurt] [iurt] calling callback for build_@2372383:guava-33.5.0-1.mga11.src.rpm
E: [iurt] [iurt] ERROR: call_ret=1 kill= err=256 ()
F: [iurt] [iurt] See https://pkgsubmit.mageia.org/queue/build//cauldron/x86_64//log/@2372383:guava-33.5.0-1.mga11.src.rpm/
Command failed: /usr/bin/sudo /usr/sbin/iurt_root_command --chroot /home/iurt/chroot_tmp/iurt/chroot_cauldron.x86_64.0.20260922133902 /bin/su - iurt -c "TMP=/home/iurt/tmp/ rpmbuild --target noarch --rebuild /home/iurt/rpmbuild/SRPMS/@2372383:guava-33.5.0-1.mga11.src.rpm"
I: [iurt] [iurt] --------------- Command failed, full output follows ---------------
I: [iurt] [iurt] D: [iurt_root_command] chroot
RTNETLINK answers: Invalid argument
RTNETLINK answers: Invalid argument
RTNETLINK answers: Invalid argument
RTNETLINK answers: Invalid argument
RTNETLINK answers: Invalid argument
RTNETLINK answers: Invalid argument
RTNETLINK answers: Invalid argument
RTNETLINK answers: Invalid argument
RTNETLINK answers: Invalid argument
RTNETLINK answers: Invalid argument
RTNETLINK answers: Invalid argument
RTNETLINK answers: Invalid argument
RTNETLINK answers: Invalid argument
RTNETLINK answers: Invalid argument
RTNETLINK answers: Invalid argument
RTNETLINK answers: Invalid argument
RTNETLINK answers: Invalid argument
RTNETLINK answers: Invalid argument
RTNETLINK answers: Invalid argument
RTNETLINK answers: Invalid argument
RTNETLINK answers: Invalid argument
RTNETLINK answers: Invalid argument
RTNETLINK answers: Invalid argument
RTNETLINK answers: Invalid argument
RTNETLINK answers: Invalid argument
RTNETLINK answers: Invalid argument
RTNETLINK answers: Invalid argument
RTNETLINK answers: Invalid argument
RTNETLINK answers: Invalid argument
RTNETLINK answers: Invalid argument
RTNETLINK answers: Invalid argument
RTNETLINK answers: Invalid argument
RTNETLINK answers: Invalid argument
RTNETLINK answers: Invalid argument
RTNETLINK answers: Invalid argument
RTNETLINK answers: Invalid argument
RTNETLINK answers: Invalid argument
RTNETLINK answers: Invalid argument
RTNETLINK answers: Invalid argument
RTNETLINK answers: Invalid argument
RTNETLINK answers: Invalid argument
RTNETLINK answers: Invalid argument
RTNETLINK answers: Invalid argument
RTNETLINK answers: Invalid argument
RTNETLINK answers: Invalid argument
RTNETLINK answers: Invalid argument
RTNETLINK answers: Invalid argument
RTNETLINK answers: Invalid argument
RTNETLINK answers: Invalid argument
RTNETLINK answers: Invalid argument
RTNETLINK answers: Invalid argument
RTNETLINK answers: Invalid argument
RTNETLINK answers: Invalid argument
RTNETLINK answers: Invalid argument
RTNETLINK answers: Invalid argument
RTNETLINK answers: Invalid argument
RTNETLINK answers: Invalid argument
RTNETLINK answers: Invalid argument
RTNETLINK answers: Invalid argument
RTNETLINK answers: Invalid argument
RTNETLINK answers: Invalid argument
RTNETLINK answers: Invalid argument
RTNETLINK answers: Invalid argument
RTNETLINK answers: Invalid argument
RTNETLINK answers: Invalid argument
RTNETLINK answers: Invalid argument
RTNETLINK answers: Invalid argument
RTNETLINK answers: Invalid argument
RTNETLINK answers: Invalid argument
RTNETLINK answers: Invalid argument
RTNETLINK answers: Invalid argument
RTNETLINK answers: Invalid argument
RTNETLINK answers: Invalid argument
RTNETLINK answers: Invalid argument
RTNETLINK answers: Invalid argument
RTNETLINK answers: Invalid argument
RTNETLINK answers: Invalid argument
RTNETLINK answers: Invalid argument
RTNETLINK answers: Invalid argument
RTNETLINK answers: Invalid argument
RTNETLINK answers: Invalid argument
RTNETLINK answers: Invalid argument
RTNETLINK answers: Invalid argument
RTNETLINK answers: Invalid argument
RTNETLINK answers: Invalid argument
RTNETLINK answers: Invalid argument
RTNETLINK answers: Invalid argument
RTNETLINK answers: Invalid argument
RTNETLINK answers: Invalid argument
RTNETLINK answers: Invalid argument
RTNETLINK answers: Invalid argument
RTNETLINK answers: Invalid argument
RTNETLINK answers: Invalid argument
RTNETLINK answers: Invalid argument
RTNETLINK answers: Invalid argument
RTNETLINK answers: Invalid argument
RTNETLINK answers: Invalid argument
RTNETLINK answers: Invalid argument
RTNETLINK answers: Invalid argument
RTNETLINK answers: Invalid argument
RTNETLINK answers: Invalid argument
RTNETLINK answers: Invalid argument
RTNETLINK answers: Invalid argument
RTNETLINK answers: Invalid argument
RTNETLINK answers: Invalid argument
RTNETLINK answers: Invalid argument
RTNETLINK answers: Invalid argument
RTNETLINK answers: Invalid argument
RTNETLINK answers: Invalid argument
RTNETLINK answers: Invalid argument
RTNETLINK answers: Invalid argument
RTNETLINK answers: Invalid argument
RTNETLINK answers: Invalid argument
RTNETLINK answers: Invalid argument
RTNETLINK answers: Invalid argument
RTNETLINK answers: Invalid argument
RTNETLINK answers: Invalid argument
RTNETLINK answers: Invalid argument
RTNETLINK answers: Invalid argument
RTNETLINK answers: Invalid argument
RTNETLINK answers: Invalid argument
RTNETLINK answers: Invalid argument
RTNETLINK answers: Invalid argument
RTNETLINK answers: Invalid argument
RTNETLINK answers: Invalid argument
RTNETLINK answers: Invalid argument
RTNETLINK answers: Invalid argument
RTNETLINK answers: Invalid argument
RTNETLINK answers: Invalid argument
RTNETLINK answers: Invalid argument
RTNETLINK answers: Invalid argument
RTNETLINK answers: Invalid argument
RTNETLINK answers: Invalid argument
RTNETLINK answers: Invalid argument
RTNETLINK answers: Invalid argument
RTNETLINK answers: Invalid argument
RTNETLINK answers: Invalid argument
RTNETLINK answers: Invalid argument
RTNETLINK answers: Invalid argument
RTNETLINK answers: Invalid argument
RTNETLINK answers: Invalid argument
RTNETLINK answers: Invalid argument
RTNETLINK answers: Invalid argument
RTNETLINK answers: Invalid argument
RTNETLINK answers: Invalid argument
RTNETLINK answers: Invalid argument
RTNETLINK answers: Invalid argument
RTNETLINK answers: Invalid argument
RTNETLINK answers: Invalid argument
RTNETLINK answers: Invalid argument
RTNETLINK answers: Invalid argument
RTNETLINK answers: Invalid argument
RTNETLINK answers: Invalid argument
RTNETLINK answers: Invalid argument
RTNETLINK answers: Invalid argument
RTNETLINK answers: Invalid argument
RTNETLINK answers: Invalid argument
RTNETLINK answers: Invalid argument
RTNETLINK answers: Invalid argument
RTNETLINK answers: Invalid argument
RTNETLINK answers: Invalid argument
RTNETLINK answers: Invalid argument
RTNETLINK answers: Invalid argument
RTNETLINK answers: Invalid argument
RTNETLINK answers: Invalid argument
RTNETLINK answers: Invalid argument
RTNETLINK answers: Invalid argument
RTNETLINK answers: Invalid argument
RTNETLINK answers: Invalid argument
RTNETLINK answers: Invalid argument
RTNETLINK answers: Invalid argument
RTNETLINK answers: Invalid argument
RTNETLINK answers: Invalid argument
RTNETLINK answers: Invalid argument
RTNETLINK answers: Invalid argument
RTNETLINK answers: Invalid argument
RTNETLINK answers: Invalid argument
RTNETLINK answers: Invalid argument
RTNETLINK answers: Invalid argument
RTNETLINK answers: Invalid argument
RTNETLINK answers: Invalid argument
RTNETLINK answers: Invalid argument
RTNETLINK answers: Invalid argument
RTNETLINK answers: Invalid argument
RTNETLINK answers: Invalid argument
RTNETLINK answers: Invalid argument
RTNETLINK answers: Invalid argument
RTNETLINK answers: Invalid argument
RTNETLINK answers: Invalid argument
RTNETLINK answers: Invalid argument
RTNETLINK answers: Invalid argument
RTNETLINK answers: Invalid argument
RTNETLINK answers: Invalid argument
RTNETLINK answers: Invalid argument
RTNETLINK answers: Invalid argument
RTNETLINK answers: Invalid argument
RTNETLINK answers: Invalid argument
RTNETLINK answers: Invalid argument
RTNETLINK answers: Invalid argument
RTNETLINK answers: Invalid argument
RTNETLINK answers: Invalid argument
RTNETLINK answers: Invalid argument
RTNETLINK answers: Invalid argument
RTNETLINK answers: Invalid argument
RTNETLINK answers: Invalid argument
RTNETLINK answers: Invalid argument
RTNETLINK answers: Invalid argument
RTNETLINK answers: Invalid argument
RTNETLINK answers: Invalid argument
RTNETLINK answers: Invalid argument
RTNETLINK answers: Invalid argument
RTNETLINK answers: Invalid argument
RTNETLINK answers: Invalid argument
RTNETLINK answers: Invalid argument
RTNETLINK answers: Invalid argument
RTNETLINK answers: Invalid argument
RTNETLINK answers: Invalid argument
RTNETLINK answers: Invalid argument
RTNETLINK answers: Invalid argument
RTNETLINK answers: Invalid argument
RTNETLINK answers: Invalid argument
RTNETLINK answers: Invalid argument
RTNETLINK answers: Invalid argument
RTNETLINK answers: Invalid argument
RTNETLINK answers: Invalid argument
RTNETLINK answers: Invalid argument
RTNETLINK answers: Invalid argument
RTNETLINK answers: Invalid argument
RTNETLINK answers: Invalid argument
RTNETLINK answers: Invalid argument
RTNETLINK answers: Invalid argument
RTNETLINK answers: Invalid argument
RTNETLINK answers: Invalid argument
RTNETLINK answers: Invalid argument
RTNETLINK answers: Invalid argument
RTNETLINK answers: Invalid argument
RTNETLINK answers: Invalid argument
RTNETLINK answers: Invalid argument
RTNETLINK answers: Invalid argument
RTNETLINK answers: Invalid argument
RTNETLINK answers: Invalid argument
RTNETLINK answers: Invalid argument
RTNETLINK answers: Invalid argument
RTNETLINK answers: Invalid argument
RTNETLINK answers: Invalid argument
RTNETLINK answers: Invalid argument
RTNETLINK answers: Invalid argument
RTNETLINK answers: Invalid argument
RTNETLINK answers: Invalid argument
RTNETLINK answers: Invalid argument
RTNETLINK answers: Invalid argument
RTNETLINK answers: Invalid argument
RTNETLINK answers: Invalid argument
RTNETLINK answers: Invalid argument
RTNETLINK answers: Invalid argument
RTNETLINK answers: Invalid argument
RTNETLINK answers: Invalid argument
RTNETLINK answers: Invalid argument
RTNETLINK answers: Invalid argument
RTNETLINK answers: Invalid argument
RTNETLINK answers: Invalid argument
RTNETLINK answers: Invalid argument
RTNETLINK answers: Invalid argument
RTNETLINK answers: Invalid argument
RTNETLINK answers: Invalid argument
RTNETLINK answers: Invalid argument
RTNETLINK answers: Invalid argument
RTNETLINK answers: Invalid argument
RTNETLINK answers: Invalid argument
RTNETLINK answers: Invalid argument
RTNETLINK answers: Invalid argument
RTNETLINK answers: Invalid argument
RTNETLINK answers: Invalid argument
RTNETLINK answers: Invalid argument
RTNETLINK answers: Invalid argument
RTNETLINK answers: Invalid argument
RTNETLINK answers: Invalid argument
RTNETLINK answers: Invalid argument
RTNETLINK answers: Invalid argument
RTNETLINK answers: Invalid argument
RTNETLINK answers: Invalid argument
RTNETLINK answers: Invalid argument
RTNETLINK answers: Invalid argument
RTNETLINK answers: Invalid argument
RTNETLINK answers: Invalid argument
RTNETLINK answers: Invalid argument
RTNETLINK answers: Invalid argument
RTNETLINK answers: Invalid argument
RTNETLINK answers: Invalid argument
RTNETLINK answers: Invalid argument
RTNETLINK answers: Invalid argument
RTNETLINK answers: Invalid argument
RTNETLINK answers: Invalid argument
RTNETLINK answers: Invalid argument
RTNETLINK answers: Invalid argument
RTNETLINK answers: Invalid argument
RTNETLINK answers: Invalid argument
RTNETLINK answers: Invalid argument
RTNETLINK answers: Invalid argument
RTNETLINK answers: Invalid argument
RTNETLINK answers: Invalid argument
RTNETLINK answers: Invalid argument
RTNETLINK answers: Invalid argument
RTNETLINK answers: Invalid argument
RTNETLINK answers: Invalid argument
RTNETLINK answers: Invalid argument
RTNETLINK answers: Invalid argument
RTNETLINK answers: Invalid argument
RTNETLINK answers: Invalid argument
RTNETLINK answers: Invalid argument
RTNETLINK answers: Invalid argument
RTNETLINK answers: Invalid argument
RTNETLINK answers: Invalid argument
RTNETLINK answers: Invalid argument
RTNETLINK answers: Invalid argument
RTNETLINK answers: Invalid argument
RTNETLINK answers: Invalid argument
RTNETLINK answers: Invalid argument
RTNETLINK answers: Invalid argument
RTNETLINK answers: Invalid argument
RTNETLINK answers: Invalid argument
RTNETLINK answers: Invalid argument
RTNETLINK answers: Invalid argument
RTNETLINK answers: Invalid argument
RTNETLINK answers: Invalid argument
RTNETLINK answers: Invalid argument
RTNETLINK answers: Invalid argument
RTNETLINK answers: Invalid argument
RTNETLINK answers: Invalid argument
RTNETLINK answers: Invalid argument
RTNETLINK answers: Invalid argument
RTNETLINK answers: Invalid argument
RTNETLINK answers: Invalid argument
RTNETLINK answers: Invalid argument
RTNETLINK answers: Invalid argument
RTNETLINK answers: Invalid argument
RTNETLINK answers: Invalid argument
RTNETLINK answers: Invalid argument
RTNETLINK answers: Invalid argument
RTNETLINK answers: Invalid argument
RTNETLINK answers: Invalid argument
RTNETLINK answers: Invalid argument
RTNETLINK answers: Invalid argument
RTNETLINK answers: Invalid argument
RTNETLINK answers: Invalid argument
RTNETLINK answers: Invalid argument
RTNETLINK answers: Invalid argument
RTNETLINK answers: Invalid argument
RTNETLINK answers: Invalid argument
RTNETLINK answers: Invalid argument
RTNETLINK answers: Invalid argument
RTNETLINK answers: Invalid argument
RTNETLINK answers: Invalid argument
RTNETLINK answers: Invalid argument
RTNETLINK answers: Invalid argument
RTNETLINK answers: Invalid argument
RTNETLINK answers: Invalid argument
RTNETLINK answers: Invalid argument
RTNETLINK answers: Invalid argument
RTNETLINK answers: Invalid argument
RTNETLINK answers: Invalid argument
RTNETLINK answers: Invalid argument
RTNETLINK answers: Invalid argument
RTNETLINK answers: Invalid argument
RTNETLINK answers: Invalid argument
RTNETLINK answers: Invalid argument
RTNETLINK answers: Invalid argument
RTNETLINK answers: Invalid argument
RTNETLINK answers: Invalid argument
RTNETLINK answers: Invalid argument
RTNETLINK answers: Invalid argument
RTNETLINK answers: Invalid argument
RTNETLINK answers: Invalid argument
RTNETLINK answers: Invalid argument
RTNETLINK answers: Invalid argument
RTNETLINK answers: Invalid argument
RTNETLINK answers: Invalid argument
RTNETLINK answers: Invalid argument
RTNETLINK answers: Invalid argument
RTNETLINK answers: Invalid argument
RTNETLINK answers: Invalid argument
RTNETLINK answers: Invalid argument
RTNETLINK answers: Invalid argument
RTNETLINK answers: Invalid argument
RTNETLINK answers: Invalid argument
RTNETLINK answers: Invalid argument
RTNETLINK answers: Invalid argument
RTNETLINK answers: Invalid argument
RTNETLINK answers: Invalid argument
RTNETLINK answers: Invalid argument
RTNETLINK answers: Invalid argument
RTNETLINK answers: Invalid argument
RTNETLINK answers: Invalid argument
RTNETLINK answers: Invalid argument
RTNETLINK answers: Invalid argument
RTNETLINK answers: Invalid argument
RTNETLINK answers: Invalid argument
RTNETLINK answers: Invalid argument
RTNETLINK answers: Invalid argument
RTNETLINK answers: Invalid argument
RTNETLINK answers: Invalid argument
RTNETLINK answers: Invalid argument
RTNETLINK answers: Invalid argument
RTNETLINK answers: Invalid argument
RTNETLINK answers: Invalid argument
RTNETLINK answers: Invalid argument
RTNETLINK answers: Invalid argument
RTNETLINK answers: Invalid argument
RTNETLINK answers: Invalid argument
RTNETLINK answers: Invalid argument
RTNETLINK answers: Invalid argument
RTNETLINK answers: Invalid argument
RTNETLINK answers: Invalid argument
RTNETLINK answers: Invalid argument
RTNETLINK answers: Invalid argument
RTNETLINK answers: Invalid argument
RTNETLINK answers: Invalid argument
RTNETLINK answers: Invalid argument
RTNETLINK answers: Invalid argument
RTNETLINK answers: Invalid argument
RTNETLINK answers: Invalid argument
RTNETLINK answers: Invalid argument
RTNETLINK answers: Invalid argument
RTNETLINK answers: Invalid argument
RTNETLINK answers: Invalid argument
RTNETLINK answers: Invalid argument
RTNETLINK answers: Invalid argument
RTNETLINK answers: Invalid argument
RTNETLINK answers: Invalid argument
RTNETLINK answers: Invalid argument
RTNETLINK answers: Invalid argument
RTNETLINK answers: Invalid argument
RTNETLINK answers: Invalid argument
RTNETLINK answers: Invalid argument
RTNETLINK answers: Invalid argument
RTNETLINK answers: Invalid argument
RTNETLINK answers: Invalid argument
RTNETLINK answers: Invalid argument
RTNETLINK answers: Invalid argument
RTNETLINK answers: Invalid argument
RTNETLINK answers: Invalid argument
RTNETLINK answers: Invalid argument
RTNETLINK answers: Invalid argument
RTNETLINK answers: Invalid argument
RTNETLINK answers: Invalid argument
RTNETLINK answers: Invalid argument
RTNETLINK answers: Invalid argument
RTNETLINK answers: Invalid argument
RTNETLINK answers: Invalid argument
RTNETLINK answers: Invalid argument
RTNETLINK answers: Invalid argument
RTNETLINK answers: Invalid argument
RTNETLINK answers: Invalid argument
RTNETLINK answers: Invalid argument
RTNETLINK answers: Invalid argument
RTNETLINK answers: Invalid argument
RTNETLINK answers: Invalid argument
RTNETLINK answers: Invalid argument
RTNETLINK answers: Invalid argument
RTNETLINK answers: Invalid argument
RTNETLINK answers: Invalid argument
RTNETLINK answers: Invalid argument
RTNETLINK answers: Invalid argument
RTNETLINK answers: Invalid argument
RTNETLINK answers: Invalid argument
RTNETLINK answers: Invalid argument
RTNETLINK answers: Invalid argument
RTNETLINK answers: Invalid argument
RTNETLINK answers: Invalid argument
RTNETLINK answers: Invalid argument
RTNETLINK answers: Invalid argument
RTNETLINK answers: Invalid argument
RTNETLINK answers: Invalid argument
RTNETLINK answers: Invalid argument
RTNETLINK answers: Invalid argument
RTNETLINK answers: Invalid argument
RTNETLINK answers: Invalid argument
RTNETLINK answers: Invalid argument
RTNETLINK answers: Invalid argument
RTNETLINK answers: Invalid argument
RTNETLINK answers: Invalid argument
RTNETLINK answers: Invalid argument
RTNETLINK answers: Invalid argument
RTNETLINK answers: Invalid argument
RTNETLINK answers: Invalid argument
RTNETLINK answers: Invalid argument
RTNETLINK answers: Invalid argument
RTNETLINK answers: Invalid argument
RTNETLINK answers: Invalid argument
RTNETLINK answers: Invalid argument
RTNETLINK answers: Invalid argument
RTNETLINK answers: Invalid argument
RTNETLINK answers: Invalid argument
RTNETLINK answers: Invalid argument
RTNETLINK answers: Invalid argument
RTNETLINK answers: Invalid argument
RTNETLINK answers: Invalid argument
RTNETLINK answers: Invalid argument
RTNETLINK answers: Invalid argument
RTNETLINK answers: Invalid argument
RTNETLINK answers: Invalid argument
RTNETLINK answers: Invalid argument
RTNETLINK answers: Invalid argument
RTNETLINK answers: Invalid argument
RTNETLINK answers: Invalid argument
RTNETLINK answers: Invalid argument
RTNETLINK answers: Invalid argument
RTNETLINK answers: Invalid argument
RTNETLINK answers: Invalid argument
RTNETLINK answers: Invalid argument
RTNETLINK answers: Invalid argument
RTNETLINK answers: Invalid argument
RTNETLINK answers: Invalid argument
RTNETLINK answers: Invalid argument
RTNETLINK answers: Invalid argument
RTNETLINK answers: Invalid argument
RTNETLINK answers: Invalid argument
RTNETLINK answers: Invalid argument
RTNETLINK answers: Invalid argument
RTNETLINK answers: Invalid argument
RTNETLINK answers: Invalid argument
RTNETLINK answers: Invalid argument
RTNETLINK answers: Invalid argument
RTNETLINK answers: Invalid argument
RTNETLINK answers: Invalid argument
RTNETLINK answers: Invalid argument
RTNETLINK answers: Invalid argument
RTNETLINK answers: Invalid argument
RTNETLINK answers: Invalid argument
RTNETLINK answers: Invalid argument
RTNETLINK answers: Invalid argument
RTNETLINK answers: Invalid argument
RTNETLINK answers: Invalid argument
RTNETLINK answers: Invalid argument
RTNETLINK answers: Invalid argument
RTNETLINK answers: Invalid argument
RTNETLINK answers: Invalid argument
RTNETLINK answers: Invalid argument
RTNETLINK answers: Invalid argument
RTNETLINK answers: Invalid argument
RTNETLINK answers: Invalid argument
RTNETLINK answers: Invalid argument
RTNETLINK answers: Invalid argument
RTNETLINK answers: Invalid argument
RTNETLINK answers: Invalid argument
RTNETLINK answers: Invalid argument
RTNETLINK answers: Invalid argument
RTNETLINK answers: Invalid argument
RTNETLINK answers: Invalid argument
RTNETLINK answers: Invalid argument
RTNETLINK answers: Invalid argument
RTNETLINK answers: Invalid argument
RTNETLINK answers: Invalid argument
RTNETLINK answers: Invalid argument
RTNETLINK answers: Invalid argument
RTNETLINK answers: Invalid argument
RTNETLINK answers: Invalid argument
RTNETLINK answers: Invalid argument
RTNETLINK answers: Invalid argument
RTNETLINK answers: Invalid argument
RTNETLINK answers: Invalid argument
RTNETLINK answers: Invalid argument
RTNETLINK answers: Invalid argument
RTNETLINK answers: Invalid argument
RTNETLINK answers: Invalid argument
RTNETLINK answers: Invalid argument
RTNETLINK answers: Invalid argument
RTNETLINK answers: Invalid argument
RTNETLINK answers: Invalid argument
RTNETLINK answers: Invalid argument
RTNETLINK answers: Invalid argument
RTNETLINK answers: Invalid argument
RTNETLINK answers: Invalid argument
RTNETLINK answers: Invalid argument
RTNETLINK answers: Invalid argument
RTNETLINK answers: Invalid argument
RTNETLINK answers: Invalid argument
RTNETLINK answers: Invalid argument
RTNETLINK answers: Invalid argument
RTNETLINK answers: Invalid argument
RTNETLINK answers: Invalid argument
RTNETLINK answers: Invalid argument
RTNETLINK answers: Invalid argument
RTNETLINK answers: Invalid argument
RTNETLINK answers: Invalid argument
RTNETLINK answers: Invalid argument
RTNETLINK answers: Invalid argument
RTNETLINK answers: Invalid argument
RTNETLINK answers: Invalid argument
RTNETLINK answers: Invalid argument
RTNETLINK answers: Invalid argument
RTNETLINK answers: Invalid argument
RTNETLINK answers: Invalid argument
RTNETLINK answers: Invalid argument
RTNETLINK answers: Invalid argument
RTNETLINK answers: Invalid argument
RTNETLINK answers: Invalid argument
RTNETLINK answers: Invalid argument
RTNETLINK answers: Invalid argument
RTNETLINK answers: Invalid argument
RTNETLINK answers: Invalid argument
RTNETLINK answers: Invalid argument
RTNETLINK answers: Invalid argument
RTNETLINK answers: Invalid argument
RTNETLINK answers: Invalid argument
RTNETLINK answers: Invalid argument
RTNETLINK answers: Invalid argument
RTNETLINK answers: Invalid argument
RTNETLINK answers: Invalid argument
RTNETLINK answers: Invalid argument
RTNETLINK answers: Invalid argument
RTNETLINK answers: Invalid argument
RTNETLINK answers: Invalid argument
RTNETLINK answers: Invalid argument
RTNETLINK answers: Invalid argument
RTNETLINK answers: Invalid argument
RTNETLINK answers: Invalid argument
RTNETLINK answers: Invalid argument
RTNETLINK answers: Invalid argument
RTNETLINK answers: Invalid argument
RTNETLINK answers: Invalid argument
RTNETLINK answers: Invalid argument
RTNETLINK answers: Invalid argument
RTNETLINK answers: Invalid argument
RTNETLINK answers: Invalid argument
RTNETLINK answers: Invalid argument
RTNETLINK answers: Invalid argument
RTNETLINK answers: Invalid argument
RTNETLINK answers: Invalid argument
RTNETLINK answers: Invalid argument
RTNETLINK answers: Invalid argument
RTNETLINK answers: Invalid argument
RTNETLINK answers: Invalid argument
RTNETLINK answers: Invalid argument
RTNETLINK answers: Invalid argument
RTNETLINK answers: Invalid argument
RTNETLINK answers: Invalid argument
RTNETLINK answers: Invalid argument
RTNETLINK answers: Invalid argument
RTNETLINK answers: Invalid argument
RTNETLINK answers: Invalid argument
RTNETLINK answers: Invalid argument
RTNETLINK answers: Invalid argument
RTNETLINK answers: Invalid argument
RTNETLINK answers: Invalid argument
RTNETLINK answers: Invalid argument
RTNETLINK answers: Invalid argument
RTNETLINK answers: Invalid argument
RTNETLINK answers: Invalid argument
RTNETLINK answers: Invalid argument
RTNETLINK answers: Invalid argument
RTNETLINK answers: Invalid argument
RTNETLINK answers: Invalid argument
RTNETLINK answers: Invalid argument
RTNETLINK answers: Invalid argument
RTNETLINK answers: Invalid argument
RTNETLINK answers: Invalid argument
RTNETLINK answers: Invalid argument
RTNETLINK answers: Invalid argument
RTNETLINK answers: Invalid argument
RTNETLINK answers: Invalid argument
RTNETLINK answers: Invalid argument
RTNETLINK answers: Invalid argument
RTNETLINK answers: Invalid argument
RTNETLINK answers: Invalid argument
RTNETLINK answers: Invalid argument
RTNETLINK answers: Invalid argument
RTNETLINK answers: Invalid argument
RTNETLINK answers: Invalid argument
RTNETLINK answers: Invalid argument
RTNETLINK answers: Invalid argument
RTNETLINK answers: Invalid argument
RTNETLINK answers: Invalid argument
RTNETLINK answers: Invalid argument
RTNETLINK answers: Invalid argument
RTNETLINK answers: Invalid argument
RTNETLINK answers: Invalid argument
RTNETLINK answers: Invalid argument
RTNETLINK answers: Invalid argument
RTNETLINK answers: Invalid argument
RTNETLINK answers: Invalid argument
RTNETLINK answers: Invalid argument
RTNETLINK answers: Invalid argument
RTNETLINK answers: Invalid argument
RTNETLINK answers: Invalid argument
RTNETLINK answers: Invalid argument
RTNETLINK answers: Invalid argument
RTNETLINK answers: Invalid argument
RTNETLINK answers: Invalid argument
RTNETLINK answers: Invalid argument
RTNETLINK answers: Invalid argument
RTNETLINK answers: Invalid argument
RTNETLINK answers: Invalid argument
RTNETLINK answers: Invalid argument
RTNETLINK answers: Invalid argument
RTNETLINK answers: Invalid argument
RTNETLINK answers: Invalid argument
RTNETLINK answers: Invalid argument
RTNETLINK answers: Invalid argument
RTNETLINK answers: Invalid argument
RTNETLINK answers: Invalid argument
RTNETLINK answers: Invalid argument
RTNETLINK answers: Invalid argument
RTNETLINK answers: Invalid argument
RTNETLINK answers: Invalid argument
RTNETLINK answers: Invalid argument
RTNETLINK answers: Invalid argument
RTNETLINK answers: Invalid argument
RTNETLINK answers: Invalid argument
RTNETLINK answers: Invalid argument
RTNETLINK answers: Invalid argument
RTNETLINK answers: Invalid argument
RTNETLINK answers: Invalid argument
RTNETLINK answers: Invalid argument
RTNETLINK answers: Invalid argument
RTNETLINK answers: Invalid argument
RTNETLINK answers: Invalid argument
RTNETLINK answers: Invalid argument
RTNETLINK answers: Invalid argument
RTNETLINK answers: Invalid argument
RTNETLINK answers: Invalid argument
RTNETLINK answers: Invalid argument
RTNETLINK answers: Invalid argument
RTNETLINK answers: Invalid argument
RTNETLINK answers: Invalid argument
RTNETLINK answers: Invalid argument
RTNETLINK answers: Invalid argument
RTNETLINK answers: Invalid argument
RTNETLINK answers: Invalid argument
RTNETLINK answers: Invalid argument
RTNETLINK answers: Invalid argument
RTNETLINK answers: Invalid argument
RTNETLINK answers: Invalid argument
RTNETLINK answers: Invalid argument
RTNETLINK answers: Invalid argument
RTNETLINK answers: Invalid argument
RTNETLINK answers: Invalid argument
RTNETLINK answers: Invalid argument
RTNETLINK answers: Invalid argument
RTNETLINK answers: Invalid argument
RTNETLINK answers: Invalid argument
RTNETLINK answers: Invalid argument
RTNETLINK answers: Invalid argument
RTNETLINK answers: Invalid argument
RTNETLINK answers: Invalid argument
RTNETLINK answers: Invalid argument
RTNETLINK answers: Invalid argument
RTNETLINK answers: Invalid argument
RTNETLINK answers: Invalid argument
RTNETLINK answers: Invalid argument
RTNETLINK answers: Invalid argument
RTNETLINK answers: Invalid argument
RTNETLINK answers: Invalid argument
RTNETLINK answers: Invalid argument
RTNETLINK answers: Invalid argument
RTNETLINK answers: Invalid argument
RTNETLINK answers: Invalid argument
RTNETLINK answers: Invalid argument
RTNETLINK answers: Invalid argument
RTNETLINK answers: Invalid argument
RTNETLINK answers: Invalid argument
RTNETLINK answers: Invalid argument
RTNETLINK answers: Invalid argument
RTNETLINK answers: Invalid argument
RTNETLINK answers: Invalid argument
RTNETLINK answers: Invalid argument
RTNETLINK answers: Invalid argument
RTNETLINK answers: Invalid argument
RTNETLINK answers: Invalid argument
RTNETLINK answers: Invalid argument
RTNETLINK answers: Invalid argument
RTNETLINK answers: Invalid argument
RTNETLINK answers: Invalid argument
RTNETLINK answers: Invalid argument
RTNETLINK answers: Invalid argument
RTNETLINK answers: Invalid argument
RTNETLINK answers: Invalid argument
RTNETLINK answers: Invalid argument
RTNETLINK answers: Invalid argument
RTNETLINK answers: Invalid argument
RTNETLINK answers: Invalid argument
RTNETLINK answers: Invalid argument
RTNETLINK answers: Invalid argument
RTNETLINK answers: Invalid argument
RTNETLINK answers: Invalid argument
RTNETLINK answers: Invalid argument
RTNETLINK answers: Invalid argument
RTNETLINK answers: Invalid argument
RTNETLINK answers: Invalid argument
RTNETLINK answers: Invalid argument
RTNETLINK answers: Invalid argument
RTNETLINK answers: Invalid argument
RTNETLINK answers: Invalid argument
RTNETLINK answers: Invalid argument
RTNETLINK answers: Invalid argument
RTNETLINK answers: Invalid argument
RTNETLINK answers: Invalid argument
RTNETLINK answers: Invalid argument
RTNETLINK answers: Invalid argument
RTNETLINK answers: Invalid argument
RTNETLINK answers: Invalid argument
RTNETLINK answers: Invalid argument
RTNETLINK answers: Invalid argument
RTNETLINK answers: Invalid argument
RTNETLINK answers: Invalid argument
RTNETLINK answers: Invalid argument
RTNETLINK answers: Invalid argument
RTNETLINK answers: Invalid argument
RTNETLINK answers: Invalid argument
RTNETLINK answers: Invalid argument
RTNETLINK answers: Invalid argument
RTNETLINK answers: Invalid argument
RTNETLINK answers: Invalid argument
RTNETLINK answers: Invalid argument
RTNETLINK answers: Invalid argument
RTNETLINK answers: Invalid argument
RTNETLINK answers: Invalid argument
RTNETLINK answers: Invalid argument
RTNETLINK answers: Invalid argument
RTNETLINK answers: Invalid argument
RTNETLINK answers: Invalid argument
RTNETLINK answers: Invalid argument
RTNETLINK answers: Invalid argument
RTNETLINK answers: Invalid argument
RTNETLINK answers: Invalid argument
RTNETLINK answers: Invalid argument
RTNETLINK answers: Invalid argument
RTNETLINK answers: Invalid argument
RTNETLINK answers: Invalid argument
RTNETLINK answers: Invalid argument
RTNETLINK answers: Invalid argument
RTNETLINK answers: Invalid argument
RTNETLINK answers: Invalid argument
RTNETLINK answers: Invalid argument
RTNETLINK answers: Invalid argument
RTNETLINK answers: Invalid argument
RTNETLINK answers: Invalid argument
RTNETLINK answers: Invalid argument
RTNETLINK answers: Invalid argument
RTNETLINK answers: Invalid argument
RTNETLINK answers: Invalid argument
RTNETLINK answers: Invalid argument
RTNETLINK answers: Invalid argument
RTNETLINK answers: Invalid argument
RTNETLINK answers: Invalid argument
RTNETLINK answers: Invalid argument
RTNETLINK answers: Invalid argument
RTNETLINK answers: Invalid argument
RTNETLINK answers: Invalid argument
RTNETLINK answers: Invalid argument
RTNETLINK answers: Invalid argument
RTNETLINK answers: Invalid argument
RTNETLINK answers: Invalid argument
RTNETLINK answers: Invalid argument
RTNETLINK answers: Invalid argument
RTNETLINK answers: Invalid argument
RTNETLINK answers: Invalid argument
RTNETLINK answers: Invalid argument
RTNETLINK answers: Invalid argument
RTNETLINK answers: Invalid argument
RTNETLINK answers: Invalid argument
RTNETLINK answers: Invalid argument
RTNETLINK answers: Invalid argument
RTNETLINK answers: Invalid argument
RTNETLINK answers: Invalid argument
RTNETLINK answers: Invalid argument
RTNETLINK answers: Invalid argument
RTNETLINK answers: Invalid argument
RTNETLINK answers: Invalid argument
RTNETLINK answers: Invalid argument
RTNETLINK answers: Invalid argument
RTNETLINK answers: Invalid argument
RTNETLINK answers: Invalid argument
RTNETLINK answers: Invalid argument
RTNETLINK answers: Invalid argument
RTNETLINK answers: Invalid argument
RTNETLINK answers: Invalid argument
RTNETLINK answers: Invalid argument
RTNETLINK answers: Invalid argument
RTNETLINK answers: Invalid argument
RTNETLINK answers: Invalid argument
RTNETLINK answers: Invalid argument
RTNETLINK answers: Invalid argument
RTNETLINK answers: Invalid argument
RTNETLINK answers: Invalid argument
RTNETLINK answers: Invalid argument
RTNETLINK answers: Invalid argument
RTNETLINK answers: Invalid argument
RTNETLINK answers: Invalid argument
RTNETLINK answers: Invalid argument
RTNETLINK answers: Invalid argument
RTNETLINK answers: Invalid argument
RTNETLINK answers: Invalid argument
RTNETLINK answers: Invalid argument
RTNETLINK answers: Invalid argument
RTNETLINK answers: Invalid argument
RTNETLINK answers: Invalid argument
RTNETLINK answers: Invalid argument
RTNETLINK answers: Invalid argument
RTNETLINK answers: Invalid argument
RTNETLINK answers: Invalid argument
RTNETLINK answers: Invalid argument
RTNETLINK answers: Invalid argument
RTNETLINK answers: Invalid argument
RTNETLINK answers: Invalid argument
RTNETLINK answers: Invalid argument
RTNETLINK answers: Invalid argument
RTNETLINK answers: Invalid argument
RTNETLINK answers: Invalid argument
RTNETLINK answers: Invalid argument
RTNETLINK answers: Invalid argument
RTNETLINK answers: Invalid argument
RTNETLINK answers: Invalid argument
RTNETLINK answers: Invalid argument
RTNETLINK answers: Invalid argument
RTNETLINK answers: Invalid argument
RTNETLINK answers: Invalid argument
RTNETLINK answers: Invalid argument
RTNETLINK answers: Invalid argument
RTNETLINK answers: Invalid argument
RTNETLINK answers: Invalid argument
RTNETLINK answers: Invalid argument
RTNETLINK answers: Invalid argument
RTNETLINK answers: Invalid argument
RTNETLINK answers: Invalid argument
RTNETLINK answers: Invalid argument
RTNETLINK answers: Invalid argument
RTNETLINK answers: Invalid argument
RTNETLINK answers: Invalid argument
RTNETLINK answers: Invalid argument
RTNETLINK answers: Invalid argument
RTNETLINK answers: Invalid argument
RTNETLINK answers: Invalid argument
RTNETLINK answers: Invalid argument
RTNETLINK answers: Invalid argument
RTNETLINK answers: Invalid argument
RTNETLINK answers: Invalid argument
RTNETLINK answers: Invalid argument
RTNETLINK answers: Invalid argument
RTNETLINK answers: Invalid argument
RTNETLINK answers: Invalid argument
RTNETLINK answers: Invalid argument
RTNETLINK answers: Invalid argument
RTNETLINK answers: Invalid argument
RTNETLINK answers: Invalid argument
RTNETLINK answers: Invalid argument
RTNETLINK answers: Invalid argument
RTNETLINK answers: Invalid argument
RTNETLINK answers: Invalid argument
RTNETLINK answers: Invalid argument
RTNETLINK answers: Invalid argument
RTNETLINK answers: Invalid argument
RTNETLINK answers: Invalid argument
RTNETLINK answers: Invalid argument
RTNETLINK answers: Invalid argument
RTNETLINK answers: Invalid argument
RTNETLINK answers: Invalid argument
RTNETLINK answers: Invalid argument
RTNETLINK answers: Invalid argument
RTNETLINK answers: Invalid argument
RTNETLINK answers: Invalid argument
RTNETLINK answers: Invalid argument
RTNETLINK answers: Invalid argument
RTNETLINK answers: Invalid argument
RTNETLINK answers: Invalid argument
RTNETLINK answers: Invalid argument
RTNETLINK answers: Invalid argument
RTNETLINK answers: Invalid argument
RTNETLINK answers: Invalid argument
RTNETLINK answers: Invalid argument
RTNETLINK answers: Invalid argument
RTNETLINK answers: Invalid argument
RTNETLINK answers: Invalid argument
RTNETLINK answers: Invalid argument
RTNETLINK answers: Invalid argument
RTNETLINK answers: Invalid argument
RTNETLINK answers: Invalid argument
RTNETLINK answers: Invalid argument
RTNETLINK answers: Invalid argument
RTNETLINK answers: Invalid argument
RTNETLINK answers: Invalid argument
RTNETLINK answers: Invalid argument
RTNETLINK answers: Invalid argument
RTNETLINK answers: Invalid argument
RTNETLINK answers: Invalid argument
RTNETLINK answers: Invalid argument
RTNETLINK answers: Invalid argument
RTNETLINK answers: Invalid argument
RTNETLINK answers: Invalid argument
RTNETLINK answers: Invalid argument
RTNETLINK answers: Invalid argument
RTNETLINK answers: Invalid argument
RTNETLINK answers: Invalid argument
RTNETLINK answers: Invalid argument
RTNETLINK answers: Invalid argument
RTNETLINK answers: Invalid argument
RTNETLINK answers: Invalid argument
RTNETLINK answers: Invalid argument
RTNETLINK answers: Invalid argument
RTNETLINK answers: Invalid argument
RTNETLINK answers: Invalid argument
RTNETLINK answers: Invalid argument
RTNETLINK answers: Invalid argument
RTNETLINK answers: Invalid argument
RTNETLINK answers: Invalid argument
RTNETLINK answers: Invalid argument
RTNETLINK answers: Invalid argument
RTNETLINK answers: Invalid argument
RTNETLINK answers: Invalid argument
RTNETLINK answers: Invalid argument
RTNETLINK answers: Invalid argument
RTNETLINK answers: Invalid argument
RTNETLINK answers: Invalid argument
RTNETLINK answers: Invalid argument
RTNETLINK answers: Invalid argument
RTNETLINK answers: Invalid argument
RTNETLINK answers: Invalid argument
RTNETLINK answers: Invalid argument
RTNETLINK answers: Invalid argument
RTNETLINK answers: Invalid argument
RTNETLINK answers: Invalid argument
RTNETLINK answers: Invalid argument
RTNETLINK answers: Invalid argument
RTNETLINK answers: Invalid argument
RTNETLINK answers: Invalid argument
RTNETLINK answers: Invalid argument
RTNETLINK answers: Invalid argument
RTNETLINK answers: Invalid argument
RTNETLINK answers: Invalid argument
RTNETLINK answers: Invalid argument
RTNETLINK answers: Invalid argument
RTNETLINK answers: Invalid argument
RTNETLINK answers: Invalid argument
RTNETLINK answers: Invalid argument
RTNETLINK answers: Invalid argument
RTNETLINK answers: Invalid argument
RTNETLINK answers: Invalid argument
RTNETLINK answers: Invalid argument
RTNETLINK answers: Invalid argument
RTNETLINK answers: Invalid argument
RTNETLINK answers: Invalid argument
RTNETLINK answers: Invalid argument
RTNETLINK answers: Invalid argument
RTNETLINK answers: Invalid argument
RTNETLINK answers: Invalid argument
RTNETLINK answers: Invalid argument
RTNETLINK answers: Invalid argument
RTNETLINK answers: Invalid argument
RTNETLINK answers: Invalid argument
RTNETLINK answers: Invalid argument
RTNETLINK answers: Invalid argument
RTNETLINK answers: Invalid argument
RTNETLINK answers: Invalid argument
RTNETLINK answers: Invalid argument
RTNETLINK answers: Invalid argument
RTNETLINK answers: Invalid argument
RTNETLINK answers: Invalid argument
RTNETLINK answers: Invalid argument
RTNETLINK answers: Invalid argument
RTNETLINK answers: Invalid argument
RTNETLINK answers: Invalid argument
RTNETLINK answers: Invalid argument
RTNETLINK answers: Invalid argument
RTNETLINK answers: Invalid argument
RTNETLINK answers: Invalid argument
RTNETLINK answers: Invalid argument
RTNETLINK answers: Invalid argument
RTNETLINK answers: Invalid argument
RTNETLINK answers: Invalid argument
RTNETLINK answers: Invalid argument
RTNETLINK answers: Invalid argument
RTNETLINK answers: Invalid argument
RTNETLINK answers: Invalid argument
RTNETLINK answers: Invalid argument
RTNETLINK answers: Invalid argument
RTNETLINK answers: Invalid argument
RTNETLINK answers: Invalid argument
RTNETLINK answers: Invalid argument
RTNETLINK answers: Invalid argument
RTNETLINK answers: Invalid argument
RTNETLINK answers: Invalid argument
RTNETLINK answers: Invalid argument
RTNETLINK answers: Invalid argument
RTNETLINK answers: Invalid argument
RTNETLINK answers: Invalid argument
RTNETLINK answers: Invalid argument
RTNETLINK answers: Invalid argument
RTNETLINK answers: Invalid argument
RTNETLINK answers: Invalid argument
RTNETLINK answers: Invalid argument
RTNETLINK answers: Invalid argument
RTNETLINK answers: Invalid argument
RTNETLINK answers: Invalid argument
RTNETLINK answers: Invalid argument
RTNETLINK answers: Invalid argument
RTNETLINK answers: Invalid argument
RTNETLINK answers: Invalid argument
RTNETLINK answers: Invalid argument
RTNETLINK answers: Invalid argument
RTNETLINK answers: Invalid argument
RTNETLINK answers: Invalid argument
RTNETLINK answers: Invalid argument
RTNETLINK answers: Invalid argument
RTNETLINK answers: Invalid argument
RTNETLINK answers: Invalid argument
RTNETLINK answers: Invalid argument
RTNETLINK answers: Invalid argument
RTNETLINK answers: Invalid argument
RTNETLINK answers: Invalid argument
RTNETLINK answers: Invalid argument
RTNETLINK answers: Invalid argument
RTNETLINK answers: Invalid argument
RTNETLINK answers: Invalid argument
RTNETLINK answers: Invalid argument
RTNETLINK answers: Invalid argument
RTNETLINK answers: Invalid argument
RTNETLINK answers: Invalid argument
RTNETLINK answers: Invalid argument
RTNETLINK answers: Invalid argument
RTNETLINK answers: Invalid argument
RTNETLINK answers: Invalid argument
RTNETLINK answers: Invalid argument
RTNETLINK answers: Invalid argument
RTNETLINK answers: Invalid argument
RTNETLINK answers: Invalid argument
RTNETLINK answers: Invalid argument
RTNETLINK answers: Invalid argument
RTNETLINK answers: Invalid argument
RTNETLINK answers: Invalid argument
RTNETLINK answers: Invalid argument
RTNETLINK answers: Invalid argument
RTNETLINK answers: Invalid argument
RTNETLINK answers: Invalid argument
RTNETLINK answers: Invalid argument
RTNETLINK answers: Invalid argument
RTNETLINK answers: Invalid argument
RTNETLINK answers: Invalid argument
RTNETLINK answers: Invalid argument
RTNETLINK answers: Invalid argument
RTNETLINK answers: Invalid argument
RTNETLINK answers: Invalid argument
RTNETLINK answers: Invalid argument
RTNETLINK answers: Invalid argument
RTNETLINK answers: Invalid argument
RTNETLINK answers: Invalid argument
RTNETLINK answers: Invalid argument
RTNETLINK answers: Invalid argument
RTNETLINK answers: Invalid argument
RTNETLINK answers: Invalid argument
RTNETLINK answers: Invalid argument
RTNETLINK answers: Invalid argument
RTNETLINK answers: Invalid argument
RTNETLINK answers: Invalid argument
RTNETLINK answers: Invalid argument
RTNETLINK answers: Invalid argument
RTNETLINK answers: Invalid argument
RTNETLINK answers: Invalid argument
RTNETLINK answers: Invalid argument
RTNETLINK answers: Invalid argument
RTNETLINK answers: Invalid argument
RTNETLINK answers: Invalid argument
RTNETLINK answers: Invalid argument
RTNETLINK answers: Invalid argument
RTNETLINK answers: Invalid argument
RTNETLINK answers: Invalid argument
RTNETLINK answers: Invalid argument
RTNETLINK answers: Invalid argument
RTNETLINK answers: Invalid argument
RTNETLINK answers: Invalid argument
RTNETLINK answers: Invalid argument
RTNETLINK answers: Invalid argument
RTNETLINK answers: Invalid argument
RTNETLINK answers: Invalid argument
RTNETLINK answers: Invalid argument
RTNETLINK answers: Invalid argument
RTNETLINK answers: Invalid argument
RTNETLINK answers: Invalid argument
RTNETLINK answers: Invalid argument
RTNETLINK answers: Invalid argument
RTNETLINK answers: Invalid argument
RTNETLINK answers: Invalid argument
RTNETLINK answers: Invalid argument
RTNETLINK answers: Invalid argument
RTNETLINK answers: Invalid argument
RTNETLINK answers: Invalid argument
RTNETLINK answers: Invalid argument
RTNETLINK answers: Invalid argument
RTNETLINK answers: Invalid argument
RTNETLINK answers: Invalid argument
RTNETLINK answers: Invalid argument
RTNETLINK answers: Invalid argument
RTNETLINK answers: Invalid argument
RTNETLINK answers: Invalid argument
RTNETLINK answers: Invalid argument
RTNETLINK answers: Invalid argument
RTNETLINK answers: Invalid argument
RTNETLINK answers: Invalid argument
RTNETLINK answers: Invalid argument
RTNETLINK answers: Invalid argument
RTNETLINK answers: Invalid argument
RTNETLINK answers: Invalid argument
RTNETLINK answers: Invalid argument
RTNETLINK answers: Invalid argument
RTNETLINK answers: Invalid argument
RTNETLINK answers: Invalid argument
RTNETLINK answers: Invalid argument
RTNETLINK answers: Invalid argument
RTNETLINK answers: Invalid argument
RTNETLINK answers: Invalid argument
RTNETLINK answers: Invalid argument
RTNETLINK answers: Invalid argument
RTNETLINK answers: Invalid argument
RTNETLINK answers: Invalid argument
RTNETLINK answers: Invalid argument
RTNETLINK answers: Invalid argument
RTNETLINK answers: Invalid argument
RTNETLINK answers: Invalid argument
RTNETLINK answers: Invalid argument
RTNETLINK answers: Invalid argument
RTNETLINK answers: Invalid argument
RTNETLINK answers: Invalid argument
RTNETLINK answers: Invalid argument
RTNETLINK answers: Invalid argument
RTNETLINK answers: Invalid argument
RTNETLINK answers: Invalid argument
RTNETLINK answers: Invalid argument
RTNETLINK answers: Invalid argument
RTNETLINK answers: Invalid argument
RTNETLINK answers: Invalid argument
RTNETLINK answers: Invalid argument
RTNETLINK answers: Invalid argument
RTNETLINK answers: Invalid argument
RTNETLINK answers: Invalid argument
RTNETLINK answers: Invalid argument
RTNETLINK answers: Invalid argument
RTNETLINK answers: Invalid argument
RTNETLINK answers: Invalid argument
RTNETLINK answers: Invalid argument
RTNETLINK answers: Invalid argument
RTNETLINK answers: Invalid argument
RTNETLINK answers: Invalid argument
RTNETLINK answers: Invalid argument
RTNETLINK answers: Invalid argument
RTNETLINK answers: Invalid argument
RTNETLINK answers: Invalid argument
RTNETLINK answers: Invalid argument
RTNETLINK answers: Invalid argument
RTNETLINK answers: Invalid argument
RTNETLINK answers: Invalid argument
RTNETLINK answers: Invalid argument
RTNETLINK answers: Invalid argument
RTNETLINK answers: Invalid argument
RTNETLINK answers: Invalid argument
RTNETLINK answers: Invalid argument
RTNETLINK answers: Invalid argument
RTNETLINK answers: Invalid argument
RTNETLINK answers: Invalid argument
RTNETLINK answers: Invalid argument
RTNETLINK answers: Invalid argument
RTNETLINK answers: Invalid argument
RTNETLINK answers: Invalid argument
RTNETLINK answers: Invalid argument
RTNETLINK answers: Invalid argument
RTNETLINK answers: Invalid argument
RTNETLINK answers: Invalid argument
RTNETLINK answers: Invalid argument
RTNETLINK answers: Invalid argument
RTNETLINK answers: Invalid argument
RTNETLINK answers: Invalid argument
RTNETLINK answers: Invalid argument
RTNETLINK answers: Invalid argument
RTNETLINK answers: Invalid argument
RTNETLINK answers: Invalid argument
RTNETLINK answers: Invalid argument
RTNETLINK answers: Invalid argument
RTNETLINK answers: Invalid argument
RTNETLINK answers: Invalid argument
RTNETLINK answers: Invalid argument
RTNETLINK answers: Invalid argument
RTNETLINK answers: Invalid argument
RTNETLINK answers: Invalid argument
RTNETLINK answers: Invalid argument
RTNETLINK answers: Invalid argument
RTNETLINK answers: Invalid argument
RTNETLINK answers: Invalid argument
RTNETLINK answers: Invalid argument
RTNETLINK answers: Invalid argument
RTNETLINK answers: Invalid argument
RTNETLINK answers: Invalid argument
RTNETLINK answers: Invalid argument
RTNETLINK answers: Invalid argument
RTNETLINK answers: Invalid argument
RTNETLINK answers: Invalid argument
RTNETLINK answers: Invalid argument
RTNETLINK answers: Invalid argument
RTNETLINK answers: Invalid argument
RTNETLINK answers: Invalid argument
RTNETLINK answers: Invalid argument
RTNETLINK answers: Invalid argument
RTNETLINK answers: Invalid argument
RTNETLINK answers: Invalid argument
RTNETLINK answers: Invalid argument
RTNETLINK answers: Invalid argument
RTNETLINK answers: Invalid argument
RTNETLINK answers: Invalid argument
RTNETLINK answers: Invalid argument
RTNETLINK answers: Invalid argument
RTNETLINK answers: Invalid argument
RTNETLINK answers: Invalid argument
RTNETLINK answers: Invalid argument
RTNETLINK answers: Invalid argument
RTNETLINK answers: Invalid argument
RTNETLINK answers: Invalid argument
RTNETLINK answers: Invalid argument
RTNETLINK answers: Invalid argument
RTNETLINK answers: Invalid argument
RTNETLINK answers: Invalid argument
RTNETLINK answers: Invalid argument
RTNETLINK answers: Invalid argument
RTNETLINK answers: Invalid argument
RTNETLINK answers: Invalid argument
RTNETLINK answers: Invalid argument
RTNETLINK answers: Invalid argument
RTNETLINK answers: Invalid argument
RTNETLINK answers: Invalid argument
RTNETLINK answers: Invalid argument
RTNETLINK answers: Invalid argument
RTNETLINK answers: Invalid argument
RTNETLINK answers: Invalid argument
RTNETLINK answers: Invalid argument
RTNETLINK answers: Invalid argument
RTNETLINK answers: Invalid argument
RTNETLINK answers: Invalid argument
RTNETLINK answers: Invalid argument
RTNETLINK answers: Invalid argument
RTNETLINK answers: Invalid argument
RTNETLINK answers: Invalid argument
RTNETLINK answers: Invalid argument
RTNETLINK answers: Invalid argument
RTNETLINK answers: Invalid argument
RTNETLINK answers: Invalid argument
RTNETLINK answers: Invalid argument
RTNETLINK answers: Invalid argument
RTNETLINK answers: Invalid argument
RTNETLINK answers: Invalid argument
RTNETLINK answers: Invalid argument
RTNETLINK answers: Invalid argument
RTNETLINK answers: Invalid argument
RTNETLINK answers: Invalid argument
RTNETLINK answers: Invalid argument
RTNETLINK answers: Invalid argument
RTNETLINK answers: Invalid argument
RTNETLINK answers: Invalid argument
RTNETLINK answers: Invalid argument
RTNETLINK answers: Invalid argument
RTNETLINK answers: Invalid argument
RTNETLINK answers: Invalid argument
RTNETLINK answers: Invalid argument
RTNETLINK answers: Invalid argument
RTNETLINK answers: Invalid argument
RTNETLINK answers: Invalid argument
RTNETLINK answers: Invalid argument
RTNETLINK answers: Invalid argument
RTNETLINK answers: Invalid argument
RTNETLINK answers: Invalid argument
RTNETLINK answers: Invalid argument
RTNETLINK answers: Invalid argument
RTNETLINK answers: Invalid argument
RTNETLINK answers: Invalid argument
RTNETLINK answers: Invalid argument
RTNETLINK answers: Invalid argument
RTNETLINK answers: Invalid argument
RTNETLINK answers: Invalid argument
RTNETLINK answers: Invalid argument
RTNETLINK answers: Invalid argument
RTNETLINK answers: Invalid argument
RTNETLINK answers: Invalid argument
RTNETLINK answers: Invalid argument
RTNETLINK answers: Invalid argument
RTNETLINK answers: Invalid argument
RTNETLINK answers: Invalid argument
RTNETLINK answers: Invalid argument
RTNETLINK answers: Invalid argument
RTNETLINK answers: Invalid argument
RTNETLINK answers: Invalid argument
RTNETLINK answers: Invalid argument
RTNETLINK answers: Invalid argument
RTNETLINK answers: Invalid argument
RTNETLINK answers: Invalid argument
RTNETLINK answers: Invalid argument
RTNETLINK answers: Invalid argument
RTNETLINK answers: Invalid argument
RTNETLINK answers: Invalid argument
RTNETLINK answers: Invalid argument
RTNETLINK answers: Invalid argument
RTNETLINK answers: Invalid argument
RTNETLINK answers: Invalid argument
RTNETLINK answers: Invalid argument
RTNETLINK answers: Invalid argument
RTNETLINK answers: Invalid argument
RTNETLINK answers: Invalid argument
RTNETLINK answers: Invalid argument
RTNETLINK answers: Invalid argument
RTNETLINK answers: Invalid argument
RTNETLINK answers: Invalid argument
RTNETLINK answers: Invalid argument
RTNETLINK answers: Invalid argument
RTNETLINK answers: Invalid argument
RTNETLINK answers: Invalid argument
RTNETLINK answers: Invalid argument
RTNETLINK answers: Invalid argument
RTNETLINK answers: Invalid argument
RTNETLINK answers: Invalid argument
RTNETLINK answers: Invalid argument
RTNETLINK answers: Invalid argument
RTNETLINK answers: Invalid argument
RTNETLINK answers: Invalid argument
RTNETLINK answers: Invalid argument
RTNETLINK answers: Invalid argument
RTNETLINK answers: Invalid argument
RTNETLINK answers: Invalid argument
RTNETLINK answers: Invalid argument
RTNETLINK answers: Invalid argument
RTNETLINK answers: Invalid argument
RTNETLINK answers: Invalid argument
RTNETLINK answers: Invalid argument
RTNETLINK answers: Invalid argument
RTNETLINK answers: Invalid argument
RTNETLINK answers: Invalid argument
RTNETLINK answers: Invalid argument
RTNETLINK answers: Invalid argument
RTNETLINK answers: Invalid argument
RTNETLINK answers: Invalid argument
RTNETLINK answers: Invalid argument
RTNETLINK answers: Invalid argument
RTNETLINK answers: Invalid argument
RTNETLINK answers: Invalid argument
RTNETLINK answers: Invalid argument
RTNETLINK answers: Invalid argument
RTNETLINK answers: Invalid argument
RTNETLINK answers: Invalid argument
RTNETLINK answers: Invalid argument
RTNETLINK answers: Invalid argument
RTNETLINK answers: Invalid argument
RTNETLINK answers: Invalid argument
RTNETLINK answers: Invalid argument
RTNETLINK answers: Invalid argument
RTNETLINK answers: Invalid argument
RTNETLINK answers: Invalid argument
RTNETLINK answers: Invalid argument
RTNETLINK answers: Invalid argument
RTNETLINK answers: Invalid argument
RTNETLINK answers: Invalid argument
RTNETLINK answers: Invalid argument
RTNETLINK answers: Invalid argument
RTNETLINK answers: Invalid argument
RTNETLINK answers: Invalid argument
RTNETLINK answers: Invalid argument
RTNETLINK answers: Invalid argument
RTNETLINK answers: Invalid argument
RTNETLINK answers: Invalid argument
RTNETLINK answers: Invalid argument
RTNETLINK answers: Invalid argument
RTNETLINK answers: Invalid argument
RTNETLINK answers: Invalid argument
RTNETLINK answers: Invalid argument
RTNETLINK answers: Invalid argument
RTNETLINK answers: Invalid argument
RTNETLINK answers: Invalid argument
RTNETLINK answers: Invalid argument
RTNETLINK answers: Invalid argument
RTNETLINK answers: Invalid argument
RTNETLINK answers: Invalid argument
RTNETLINK answers: Invalid argument
RTNETLINK answers: Invalid argument
RTNETLINK answers: Invalid argument
RTNETLINK answers: Invalid argument
RTNETLINK answers: Invalid argument
RTNETLINK answers: Invalid argument
RTNETLINK answers: Invalid argument
RTNETLINK answers: Invalid argument
RTNETLINK answers: Invalid argument
RTNETLINK answers: Invalid argument
RTNETLINK answers: Invalid argument
RTNETLINK answers: Invalid argument
RTNETLINK answers: Invalid argument
RTNETLINK answers: Invalid argument
RTNETLINK answers: Invalid argument
RTNETLINK answers: Invalid argument
RTNETLINK answers: Invalid argument
RTNETLINK answers: Invalid argument
RTNETLINK answers: Invalid argument
RTNETLINK answers: Invalid argument
RTNETLINK answers: Invalid argument
RTNETLINK answers: Invalid argument
RTNETLINK answers: Invalid argument
RTNETLINK answers: Invalid argument
RTNETLINK answers: Invalid argument
RTNETLINK answers: Invalid argument
RTNETLINK answers: Invalid argument
RTNETLINK answers: Invalid argument
RTNETLINK answers: Invalid argument
RTNETLINK answers: Invalid argument
RTNETLINK answers: Invalid argument
RTNETLINK answers: Invalid argument
RTNETLINK answers: Invalid argument
RTNETLINK answers: Invalid argument
RTNETLINK answers: Invalid argument
RTNETLINK answers: Invalid argument
RTNETLINK answers: Invalid argument
RTNETLINK answers: Invalid argument
RTNETLINK answers: Invalid argument
RTNETLINK answers: Invalid argument
RTNETLINK answers: Invalid argument
RTNETLINK answers: Invalid argument
RTNETLINK answers: Invalid argument
RTNETLINK answers: Invalid argument
RTNETLINK answers: Invalid argument
RTNETLINK answers: Invalid argument
RTNETLINK answers: Invalid argument
RTNETLINK answers: Invalid argument
RTNETLINK answers: Invalid argument
RTNETLINK answers: Invalid argument
RTNETLINK answers: Invalid argument
RTNETLINK answers: Invalid argument
RTNETLINK answers: Invalid argument
RTNETLINK answers: Invalid argument
RTNETLINK answers: Invalid argument
RTNETLINK answers: Invalid argument
RTNETLINK answers: Invalid argument
RTNETLINK answers: Invalid argument
RTNETLINK answers: Invalid argument
RTNETLINK answers: Invalid argument
RTNETLINK answers: Invalid argument
RTNETLINK answers: Invalid argument
RTNETLINK answers: Invalid argument
RTNETLINK answers: Invalid argument
RTNETLINK answers: Invalid argument
RTNETLINK answers: Invalid argument
RTNETLINK answers: Invalid argument
RTNETLINK answers: Invalid argument
RTNETLINK answers: Invalid argument
RTNETLINK answers: Invalid argument
RTNETLINK answers: Invalid argument
RTNETLINK answers: Invalid argument
RTNETLINK answers: Invalid argument
RTNETLINK answers: Invalid argument
RTNETLINK answers: Invalid argument
RTNETLINK answers: Invalid argument
RTNETLINK answers: Invalid argument
RTNETLINK answers: Invalid argument
RTNETLINK answers: Invalid argument
RTNETLINK answers: Invalid argument
RTNETLINK answers: Invalid argument
RTNETLINK answers: Invalid argument
RTNETLINK answers: Invalid argument
RTNETLINK answers: Invalid argument
RTNETLINK answers: Invalid argument
RTNETLINK answers: Invalid argument
RTNETLINK answers: Invalid argument
RTNETLINK answers: Invalid argument
RTNETLINK answers: Invalid argument
RTNETLINK answers: Invalid argument
RTNETLINK answers: Invalid argument
RTNETLINK answers: Invalid argument
RTNETLINK answers: Invalid argument
RTNETLINK answers: Invalid argument
RTNETLINK answers: Invalid argument
RTNETLINK answers: Invalid argument
RTNETLINK answers: Invalid argument
RTNETLINK answers: Invalid argument
RTNETLINK answers: Invalid argument
RTNETLINK answers: Invalid argument
RTNETLINK answers: Invalid argument
RTNETLINK answers: Invalid argument
RTNETLINK answers: Invalid argument
RTNETLINK answers: Invalid argument
RTNETLINK answers: Invalid argument
RTNETLINK answers: Invalid argument
RTNETLINK answers: Invalid argument
RTNETLINK answers: Invalid argument
RTNETLINK answers: Invalid argument
RTNETLINK answers: Invalid argument
RTNETLINK answers: Invalid argument
RTNETLINK answers: Invalid argument
RTNETLINK answers: Invalid argument
RTNETLINK answers: Invalid argument
RTNETLINK answers: Invalid argument
RTNETLINK answers: Invalid argument
RTNETLINK answers: Invalid argument
RTNETLINK answers: Invalid argument
RTNETLINK answers: Invalid argument
RTNETLINK answers: Invalid argument
RTNETLINK answers: Invalid argument
RTNETLINK answers: Invalid argument
RTNETLINK answers: Invalid argument
RTNETLINK answers: Invalid argument
RTNETLINK answers: Invalid argument
RTNETLINK answers: Invalid argument
RTNETLINK answers: Invalid argument
RTNETLINK answers: Invalid argument
RTNETLINK answers: Invalid argument
RTNETLINK answers: Invalid argument
RTNETLINK answers: Invalid argument
Building target platforms: noarch
Building for target noarch
Installing /home/iurt/rpmbuild/SRPMS/@2372383:guava-33.5.0-1.mga11.src.rpm
Executing(%mkbuilddir): /bin/sh -e /home/iurt/rpmbuild/tmp/rpm-tmp.Vrp3SI
Executing(%prep): /bin/sh -e /home/iurt/rpmbuild/tmp/rpm-tmp.ejsRFe
+ umask 022
+ cd /home/iurt/rpmbuild/BUILD/guava-33.5.0-build
+ '[' 1 -eq 1 ']'
+ '[' 1 -eq 1 ']'
+ '[' 1 -eq 1 ']'
+ cd /home/iurt/rpmbuild/BUILD/guava-33.5.0-build
+ rm -rf guava-33.5.0
+ /usr/lib/rpm/rpmuncompress -x /home/iurt/rpmbuild/SOURCES/guava-33.5.0.tar.gz
+ STATUS=0
+ '[' 0 -ne 0 ']'
+ cd guava-33.5.0
+ /usr/bin/chmod -Rf a+rX,u+w,g-w,o-w .
+ /usr/lib/rpm/rpmuncompress /home/iurt/rpmbuild/SOURCES/0001-Remove-NullMarked-filtering-and-annotation-collectio.patch
+ /usr/bin/patch -p1 -s --fuzz=0 --no-backup-if-mismatch -f
+ /usr/lib/rpm/rpmuncompress /home/iurt/rpmbuild/SOURCES/0002-Fix-invalid-Maven-attribute-values-in-compilerArgs.patch
+ /usr/bin/patch -p1 -s --fuzz=0 --no-backup-if-mismatch -f
+ find . -name '*.jar' -delete
+ /usr/bin/python3 /usr/share/java-utils/pom_editor.py pom_disable_module guava-gwt
+ /usr/bin/python3 /usr/share/java-utils/pom_editor.py pom_disable_module guava-tests
+ /usr/bin/python3 /usr/share/java-utils/pom_editor.py pom_xpath_inject pom:modules 'futures/failureaccess'
+ /usr/bin/python3 /usr/share/java-utils/pom_editor.py pom_xpath_inject pom:parent '../..' futures/failureaccess
+ /usr/bin/python3 /usr/share/java-utils/pom_editor.py pom_xpath_set pom:parent/pom:version 33.5.0-jre futures/failureaccess
+ /usr/bin/python3 /usr/share/java-utils/pom_editor.py pom_remove_plugin -r :animal-sniffer-maven-plugin
+ /usr/bin/python3 /usr/share/java-utils/pom_editor.py pom_remove_plugin -r :maven-enforcer-plugin
+ /usr/bin/python3 /usr/share/java-utils/pom_editor.py pom_remove_plugin -r :maven-source-plugin
+ /usr/bin/python3 /usr/share/java-utils/pom_editor.py pom_remove_plugin -r :toolchains-maven-plugin
+ /usr/bin/python3 /usr/share/java-utils/pom_editor.py pom_remove_plugin -r :maven-toolchains-plugin
+ /usr/bin/python3 /usr/share/java-utils/pom_editor.py pom_remove_plugin -r :central-publishing-maven-plugin
+ /usr/bin/python3 /usr/share/java-utils/pom_editor.py pom_xpath_remove pom:jdkToolchain
+ /usr/bin/python3 /usr/share/java-utils/pom_editor.py pom_remove_dep :caliper guava-tests
+ /usr/bin/python3 /usr/share/java-utils/mvn_package.py :guava-parent guava
+ /usr/bin/python3 /usr/share/java-utils/pom_editor.py pom_remove_plugin -r :maven-javadoc-plugin
+ /usr/bin/python3 /usr/share/java-utils/pom_editor.py pom_remove_plugin -r :build-helper-maven-plugin
+ /usr/bin/python3 /usr/share/java-utils/pom_editor.py pom_xpath_inject /pom:project/pom:build/pom:plugins/pom:plugin/pom:configuration/pom:instructions '<_nouses>true' guava/pom.xml
+ /usr/bin/python3 /usr/share/java-utils/pom_editor.py pom_xpath_remove pom:annotationProcessorPaths
+ sed -i /Xplugin:ErrorProne/d pom.xml
+ /usr/bin/python3 /usr/share/java-utils/pom_editor.py pom_remove_dep -r :error_prone_annotations
+ /usr/bin/python3 /usr/share/java-utils/pom_editor.py pom_remove_dep -r :j2objc-annotations
+ /usr/bin/python3 /usr/share/java-utils/pom_editor.py pom_remove_dep -r :listenablefuture
+ /usr/bin/python3 /usr/share/java-utils/pom_editor.py pom_remove_dep -r :jspecify
+ jurand -i -s -a guava guava-testlib -p 'com[.]google[.]common[.]annotations[.]' -p 'com[.]google[.]errorprone[.]annotations[.]' -p 'com[.]google[.]j2objc[.]annotations[.]' -p 'org[.]jspecify[.]annotations[.]' -m 'com[.]google[.].*[.]annotations' -m 'org[.]jspecify'
Removing symbols from file guava/src/com/google/thirdparty/publicsuffix/TrieParser.java
Removing symbols from file guava/src/com/google/common/io/MultiReader.java
Removing symbols from file guava/src/com/google/thirdparty/publicsuffix/PublicSuffixType.java
Removing symbols from file guava/src/com/google/common/io/ByteSink.java
Removing symbols from file guava/src/com/google/common/io/ByteProcessor.java
Removing symbols from file guava/src/com/google/common/io/FileWriteMode.java
Removing symbols from file guava/src/com/google/common/io/CountingInputStream.java
Removing symbols from file guava/src/com/google/common/io/MultiInputStream.java
Removing symbols from file guava/src/com/google/common/io/Closeables.java
Removing symbols from file guava/src/com/google/common/io/LineReader.java
Removing symbols from file guava/src/com/google/common/io/RecursiveDeleteOption.java
Removing symbols from file guava/src/com/google/common/io/LineProcessor.java
Removing symbols from file guava/src/com/google/common/io/InsecureRecursiveDeleteException.java
Removing symbols from file guava/src/com/google/common/io/ReaderInputStream.java
Removing symbols from file guava/src/com/google/common/io/FileBackedOutputStream.java
Removing symbols from file guava/src/com/google/common/io/ParametricNullness.java
Removing symbols from file guava/src/com/google/common/io/LittleEndianDataInputStream.java
Removing symbols from file guava/src/com/google/common/io/CharStreams.java
Removing symbols from file guava/src/com/google/common/io/CharSource.java
Removing symbols from file guava/src/com/google/thirdparty/publicsuffix/PublicSuffixPatterns.java
Removing symbols from file guava/src/com/google/common/io/ByteSource.java
Removing symbols from file guava/src/com/google/common/io/CountingOutputStream.java
Removing symbols from file guava/src/com/google/common/io/MoreFiles.java
Removing symbols from file guava/src/com/google/common/io/BaseEncoding.java
Removing symbols from file guava/src/com/google/common/io/AppendableWriter.java
Removing symbols from file guava/src/com/google/common/io/Flushables.java
Removing symbols from file guava/src/com/google/common/io/CharSequenceReader.java
Removing symbols from file guava/src/com/google/common/io/ByteArrayDataInput.java
Removing symbols from file guava/src/com/google/common/io/Java8Compatibility.java
Removing symbols from file guava/src/com/google/common/io/Closer.java
Removing symbols from file guava/src/com/google/common/io/LittleEndianDataOutputStream.java
Removing symbols from file guava/src/com/google/common/io/LineBuffer.java
Removing symbols from file guava/src/com/google/common/io/TempFileCreator.java
Removing symbols from file guava/src/com/google/common/io/PatternFilenameFilter.java
Removing symbols from file guava/src/com/google/common/io/Files.java
Removing symbols from file guava/src/com/google/common/io/CharSink.java
Removing symbols from file guava/src/com/google/common/io/ByteArrayDataOutput.java
Removing symbols from file guava/src/com/google/common/io/Resources.java
Removing symbols from file guava/src/com/google/common/io/package-info.java
Removing symbols from file guava/src/com/google/common/collect/Hashing.java
Removing symbols from file guava/src/com/google/common/collect/FilteredKeyListMultimap.java
Removing symbols from file guava/src/com/google/common/io/ByteStreams.java
Removing symbols from file guava/src/com/google/common/collect/SingletonImmutableList.java
Removing symbols from file guava/src/com/google/common/collect/CompoundOrdering.java
Removing symbols from file guava/src/com/google/common/collect/ForwardingSortedSet.java
Removing symbols from file guava/src/com/google/common/collect/FilteredKeySetMultimap.java
Removing symbols from file guava/src/com/google/common/collect/SortedSetMultimap.java
Removing symbols from file guava/src/com/google/common/collect/AbstractListMultimap.java
Removing symbols from file guava/src/com/google/common/collect/HashMultiset.java
Removing symbols from file guava/src/com/google/common/collect/ImmutableMapValues.java
Removing symbols from file guava/src/com/google/common/collect/AllEqualOrdering.java
Removing symbols from file guava/src/com/google/common/collect/ComparisonChain.java
Removing symbols from file guava/src/com/google/common/collect/RangeSet.java
Removing symbols from file guava/src/com/google/common/collect/ImmutableMapEntrySet.java
Removing symbols from file guava/src/com/google/common/collect/AbstractMapBasedMultimap.java
Removing symbols from file guava/src/com/google/common/collect/AbstractMultiset.java
Removing symbols from file guava/src/com/google/common/collect/TransformedIterator.java
Removing symbols from file guava/src/com/google/common/collect/RegularImmutableSet.java
Removing symbols from file guava/src/com/google/common/collect/BiMap.java
Removing symbols from file guava/src/com/google/common/collect/RowSortedTable.java
Removing symbols from file guava/src/com/google/common/collect/ImmutableCollection.java
Removing symbols from file guava/src/com/google/common/collect/StandardRowSortedTable.java
Removing symbols from file guava/src/com/google/common/collect/Streams.java
Removing symbols from file guava/src/com/google/common/collect/EmptyContiguousSet.java
Removing symbols from file guava/src/com/google/common/collect/ForwardingObject.java
Removing symbols from file guava/src/com/google/common/collect/AbstractSetMultimap.java
Removing symbols from file guava/src/com/google/common/collect/Interners.java
Removing symbols from file guava/src/com/google/common/collect/Collections2.java
Removing symbols from file guava/src/com/google/common/collect/AbstractSortedSetMultimap.java
Removing symbols from file guava/src/com/google/common/collect/ForwardingIterator.java
Removing symbols from file guava/src/com/google/common/collect/MinMaxPriorityQueue.java
Removing symbols from file guava/src/com/google/common/collect/ForwardingDeque.java
Removing symbols from file guava/src/com/google/common/collect/CartesianList.java
Removing symbols from file guava/src/com/google/common/collect/StandardTable.java
Removing symbols from file guava/src/com/google/common/collect/ForwardingMapEntry.java
Removing symbols from file guava/src/com/google/common/collect/HashBasedTable.java
Removing symbols from file guava/src/com/google/common/collect/LinkedHashMultimap.java
Removing symbols from file guava/src/com/google/common/collect/ForwardingConcurrentMap.java
Removing symbols from file guava/src/com/google/common/collect/ForwardingCollection.java
Removing symbols from file guava/src/com/google/common/collect/ImmutableMap.java
Removing symbols from file guava/src/com/google/common/collect/LexicographicalOrdering.java
Removing symbols from file guava/src/com/google/common/collect/NullnessCasts.java
Removing symbols from file guava/src/com/google/common/collect/ImmutableMapEntry.java
Removing symbols from file guava/src/com/google/common/collect/FilteredKeyMultimap.java
Removing symbols from file guava/src/com/google/common/collect/JdkBackedImmutableBiMap.java
Removing symbols from file guava/src/com/google/common/collect/ForwardingList.java
Removing symbols from file guava/src/com/google/common/collect/EmptyImmutableSetMultimap.java
Removing symbols from file guava/src/com/google/common/collect/ForwardingSortedMap.java
Removing symbols from file guava/src/com/google/common/collect/RangeMap.java
Removing symbols from file guava/src/com/google/common/collect/SortedMapDifference.java
Removing symbols from file guava/src/com/google/common/collect/Sets.java
Removing symbols from file guava/src/com/google/common/collect/RegularImmutableTable.java
Removing symbols from file guava/src/com/google/common/collect/CollectCollectors.java
Removing symbols from file guava/src/com/google/common/collect/EnumBiMap.java
Removing symbols from file guava/src/com/google/common/collect/FilteredEntryMultimap.java
Removing symbols from file guava/src/com/google/common/collect/RegularContiguousSet.java
Removing symbols from file guava/src/com/google/common/collect/MapMaker.java
Removing symbols from file guava/src/com/google/common/collect/ForwardingSortedSetMultimap.java
Removing symbols from file guava/src/com/google/common/collect/ReverseOrdering.java
Removing symbols from file guava/src/com/google/common/collect/IndexedImmutableSet.java
Removing symbols from file guava/src/com/google/common/collect/CollectSpliterators.java
Removing symbols from file guava/src/com/google/common/collect/RegularImmutableAsList.java
Removing symbols from file guava/src/com/google/common/collect/FilteredMultimapValues.java
Removing symbols from file guava/src/com/google/common/collect/Iterators.java
Removing symbols from file guava/src/com/google/common/collect/Iterables.java
Removing symbols from file guava/src/com/google/common/collect/ForwardingListMultimap.java
Removing symbols from file guava/src/com/google/common/collect/EmptyImmutableListMultimap.java
Removing symbols from file guava/src/com/google/common/collect/UnmodifiableListIterator.java
Removing symbols from file guava/src/com/google/common/collect/Multiset.java
Removing symbols from file guava/src/com/google/common/collect/ForwardingListIterator.java
Removing symbols from file guava/src/com/google/common/collect/CompactHashMap.java
Removing symbols from file guava/src/com/google/common/collect/BaseImmutableMultimap.java
Removing symbols from file guava/src/com/google/common/collect/CompactLinkedHashSet.java
Removing symbols from file guava/src/com/google/common/collect/ComputationException.java
Removing symbols from file guava/src/com/google/common/collect/ForwardingNavigableSet.java
Removing symbols from file guava/src/com/google/common/collect/ImmutableMultimap.java
Removing symbols from file guava/src/com/google/common/collect/ByFunctionOrdering.java
Removing symbols from file guava/src/com/google/common/collect/ReverseNaturalOrdering.java
Removing symbols from file guava/src/com/google/common/collect/NullsFirstOrdering.java
Removing symbols from file guava/src/com/google/common/collect/FilteredEntrySetMultimap.java
Removing symbols from file guava/src/com/google/common/collect/EnumMultiset.java
Removing symbols from file guava/src/com/google/common/collect/LinkedListMultimap.java
Removing symbols from file guava/src/com/google/common/collect/SingletonImmutableTable.java
Removing symbols from file guava/src/com/google/common/collect/ImmutableAsList.java
Removing symbols from file guava/src/com/google/common/collect/EnumHashBiMap.java
Removing symbols from file guava/src/com/google/common/collect/AbstractRangeSet.java
Removing symbols from file guava/src/com/google/common/collect/ForwardingBlockingDeque.java
Removing symbols from file guava/src/com/google/common/collect/SortedMultisetBridge.java
Removing symbols from file guava/src/com/google/common/collect/Synchronized.java
Removing symbols from file guava/src/com/google/common/collect/Multimaps.java
Removing symbols from file guava/src/com/google/common/collect/EvictingQueue.java
Removing symbols from file guava/src/com/google/common/collect/UnmodifiableSortedMultiset.java
Removing symbols from file guava/src/com/google/common/collect/AbstractSortedKeySortedSetMultimap.java
Removing symbols from file guava/src/com/google/common/collect/AbstractMultimap.java
Removing symbols from file guava/src/com/google/common/collect/TableCollectors.java
Removing symbols from file guava/src/com/google/common/collect/ConsumingQueueIterator.java
Removing symbols from file guava/src/com/google/common/collect/DiscreteDomain.java
Removing symbols from file guava/src/com/google/common/collect/DenseImmutableTable.java
Removing symbols from file guava/src/com/google/common/collect/AbstractIndexedListIterator.java
Removing symbols from file guava/src/com/google/common/collect/ForwardingSetMultimap.java
Removing symbols from file guava/src/com/google/common/collect/SneakyThrows.java
Removing symbols from file guava/src/com/google/common/collect/SingletonImmutableSet.java
Removing symbols from file guava/src/com/google/common/collect/BoundType.java
Removing symbols from file guava/src/com/google/common/collect/ImmutableTable.java
Removing symbols from file guava/src/com/google/common/collect/Tables.java
Removing symbols from file guava/src/com/google/common/collect/DescendingImmutableSortedSet.java
Removing symbols from file guava/src/com/google/common/collect/GeneralRange.java
Removing symbols from file guava/src/com/google/common/collect/TreeMultiset.java
Removing symbols from file guava/src/com/google/common/collect/ForwardingMap.java
Removing symbols from file guava/src/com/google/common/collect/ImmutableSortedMap.java
Removing symbols from file guava/src/com/google/common/collect/ImmutableEnumSet.java
Removing symbols from file guava/src/com/google/common/collect/ImmutableList.java
Removing symbols from file guava/src/com/google/common/collect/HashMultimap.java
Removing symbols from file guava/src/com/google/common/collect/SortedIterable.java
Removing symbols from file guava/src/com/google/common/collect/SingletonImmutableBiMap.java
Removing symbols from file guava/src/com/google/common/collect/SortedLists.java
Removing symbols from file guava/src/com/google/common/collect/UsingToStringOrdering.java
Removing symbols from file guava/src/com/google/common/collect/TreeTraverser.java
Removing symbols from file guava/src/com/google/common/collect/AbstractMapBasedMultiset.java
Removing symbols from file guava/src/com/google/common/collect/MapMakerInternalMap.java
Removing symbols from file guava/src/com/google/common/collect/ImmutableRangeMap.java
Removing symbols from file guava/src/com/google/common/collect/Ordering.java
Removing symbols from file guava/src/com/google/common/collect/ParametricNullness.java
Removing symbols from file guava/src/com/google/common/collect/ForwardingQueue.java
Removing symbols from file guava/src/com/google/common/collect/SortedMultiset.java
Removing symbols from file guava/src/com/google/common/collect/LinkedHashMultiset.java
Removing symbols from file guava/src/com/google/common/collect/AbstractSequentialIterator.java
Removing symbols from file guava/src/com/google/common/collect/CompactHashing.java
Removing symbols from file guava/src/com/google/common/collect/SortedIterables.java
Removing symbols from file guava/src/com/google/common/collect/Count.java
Removing symbols from file guava/src/com/google/common/collect/NaturalOrdering.java
Removing symbols from file guava/src/com/google/common/collect/FilteredMultimap.java
Removing symbols from file guava/src/com/google/common/collect/TreeRangeSet.java
Removing symbols from file guava/src/com/google/common/collect/CompactLinkedHashMap.java
Removing symbols from file guava/src/com/google/common/collect/FilteredSetMultimap.java
Removing symbols from file guava/src/com/google/common/collect/ClassToInstanceMap.java
Removing symbols from file guava/src/com/google/common/collect/RegularImmutableSortedSet.java
Removing symbols from file guava/src/com/google/common/collect/JdkBackedImmutableSet.java
Removing symbols from file guava/src/com/google/common/collect/ForwardingSet.java
Removing symbols from file guava/src/com/google/common/collect/PeekingIterator.java
Removing symbols from file guava/src/com/google/common/collect/RegularImmutableMap.java
Removing symbols from file guava/src/com/google/common/collect/SortedMultisets.java
Removing symbols from file guava/src/com/google/common/collect/AbstractMapEntry.java
Removing symbols from file guava/src/com/google/common/collect/SparseImmutableTable.java
Removing symbols from file guava/src/com/google/common/collect/FluentIterable.java
Removing symbols from file guava/src/com/google/common/collect/ImmutableEnumMap.java
Removing symbols from file guava/src/com/google/common/collect/ForwardingImmutableList.java
Removing symbols from file guava/src/com/google/common/collect/CompactHashSet.java
Removing symbols from file guava/src/com/google/common/collect/DescendingMultiset.java
Removing symbols from file guava/src/com/google/common/collect/ImmutableSetMultimap.java
Removing symbols from file guava/src/com/google/common/collect/AbstractSortedMultiset.java
Removing symbols from file guava/src/com/google/common/collect/ImmutableSet.java
Removing symbols from file guava/src/com/google/common/collect/MoreCollectors.java
Removing symbols from file guava/src/com/google/common/collect/ForwardingImmutableMap.java
Removing symbols from file guava/src/com/google/common/collect/JdkBackedImmutableMap.java
Removing symbols from file guava/src/com/google/common/collect/TopKSelector.java
Removing symbols from file guava/src/com/google/common/collect/ArrayListMultimap.java
Removing symbols from file guava/src/com/google/common/collect/ImmutableSortedMultiset.java
Removing symbols from file guava/src/com/google/common/collect/RegularImmutableSortedMultiset.java
Removing symbols from file guava/src/com/google/common/collect/MutableClassToInstanceMap.java
Removing symbols from file guava/src/com/google/common/collect/ObjectArrays.java
Removing symbols from file guava/src/com/google/common/collect/ConcurrentHashMultiset.java
Removing symbols from file guava/src/com/google/common/collect/Comparators.java
Removing symbols from file guava/src/com/google/common/collect/ImmutableSortedSet.java
Removing symbols from file guava/src/com/google/common/collect/ImmutableMapKeySet.java
Removing symbols from file guava/src/com/google/common/collect/AbstractNavigableMap.java
Removing symbols from file guava/src/com/google/common/collect/JdkBackedImmutableMultiset.java
Removing symbols from file guava/src/com/google/common/collect/ExplicitOrdering.java
Removing symbols from file guava/src/com/google/common/collect/ImmutableMultiset.java
Removing symbols from file guava/src/com/google/common/collect/Queues.java
Removing symbols from file guava/src/com/google/common/collect/CollectPreconditions.java
Removing symbols from file guava/src/com/google/common/collect/Table.java
Removing symbols from file guava/src/com/google/common/collect/RegularImmutableList.java
Removing symbols from file guava/src/com/google/common/collect/HashBiMap.java
Removing symbols from file guava/src/com/google/common/collect/TreeMultimap.java
Removing symbols from file guava/src/com/google/common/collect/Platform.java
Removing symbols from file guava/src/com/google/common/collect/ListMultimap.java
Removing symbols from file guava/src/com/google/common/collect/ComparatorOrdering.java
Removing symbols from file guava/src/com/google/common/collect/Serialization.java
Removing symbols from file guava/src/com/google/common/collect/RegularImmutableMultiset.java
Removing symbols from file guava/src/com/google/common/collect/ImmutableClassToInstanceMap.java
Removing symbols from file guava/src/com/google/common/collect/Multimap.java
Removing symbols from file guava/src/com/google/common/collect/ForwardingTable.java
Removing symbols from file guava/src/com/google/common/collect/SetMultimap.java
Removing symbols from file guava/src/com/google/common/collect/ImmutableRangeSet.java
Removing symbols from file guava/src/com/google/common/collect/RegularImmutableBiMap.java
Removing symbols from file guava/src/com/google/common/collect/MapDifference.java
Removing symbols from file guava/src/com/google/common/collect/Multisets.java
Removing symbols from file guava/src/com/google/common/collect/ArrayTable.java
Removing symbols from file guava/src/com/google/common/collect/Range.java
Removing symbols from file guava/src/com/google/common/collect/UnmodifiableIterator.java
Removing symbols from file guava/src/com/google/common/collect/ForwardingNavigableMap.java
Removing symbols from file guava/src/com/google/common/collect/ImmutableListMultimap.java
Removing symbols from file guava/src/com/google/common/collect/MultimapBuilder.java
Removing symbols from file guava/src/com/google/common/collect/TransformedListIterator.java
Removing symbols from file guava/src/com/google/common/collect/TreeBasedTable.java
Removing symbols from file guava/src/com/google/common/collect/AbstractIterator.java
Removing symbols from file guava/src/com/google/common/collect/ContiguousSet.java
Removing symbols from file guava/src/com/google/common/collect/Cut.java
Removing symbols from file guava/src/com/google/common/collect/ForwardingSortedMultiset.java
Removing symbols from file guava/src/com/google/common/collect/ForwardingMultimap.java
Removing symbols from file guava/src/com/google/common/collect/TreeRangeMap.java
Removing symbols from file guava/src/com/google/common/collect/ImmutableBiMap.java
Removing symbols from file guava/src/com/google/common/collect/AbstractBiMap.java
Removing symbols from file guava/src/com/google/common/collect/NullsLastOrdering.java
Removing symbols from file guava/src/com/google/common/collect/ForwardingMultiset.java
Removing symbols from file guava/src/com/google/common/collect/ImmutableSortedAsList.java
Removing symbols from file guava/src/com/google/common/collect/ForwardingImmutableSet.java
Removing symbols from file guava/src/com/google/common/collect/DescendingImmutableSortedMultiset.java
Removing symbols from file guava/src/com/google/common/collect/Interner.java
Removing symbols from file guava/src/com/google/common/collect/package-info.java
Removing symbols from file guava/src/com/google/common/collect/Maps.java
Removing symbols from file guava/src/com/google/common/cache/ForwardingLoadingCache.java
Removing symbols from file guava/src/com/google/common/collect/AbstractTable.java
Removing symbols from file guava/src/com/google/common/collect/Lists.java
Removing symbols from file guava/src/com/google/common/cache/Weigher.java
Removing symbols from file guava/src/com/google/common/cache/LongAddables.java
Removing symbols from file guava/src/com/google/common/cache/RemovalListeners.java
Removing symbols from file guava/src/com/google/common/cache/Cache.java
Removing symbols from file guava/src/com/google/common/cache/CacheLoader.java
Removing symbols from file guava/src/com/google/common/cache/RemovalNotification.java
Removing symbols from file guava/src/com/google/common/cache/ForwardingCache.java
Removing symbols from file guava/src/com/google/common/cache/CacheBuilderSpec.java
Removing symbols from file guava/src/com/google/common/cache/ReferenceEntry.java
Removing symbols from file guava/src/com/google/common/cache/LongAddable.java
Removing symbols from file guava/src/com/google/common/cache/ParametricNullness.java
Removing symbols from file guava/src/com/google/common/cache/AbstractLoadingCache.java
Removing symbols from file guava/src/com/google/common/cache/RemovalListener.java
Removing symbols from file guava/src/com/google/common/cache/AbstractCache.java
Removing symbols from file guava/src/com/google/common/cache/RemovalCause.java
Removing symbols from file guava/src/com/google/common/cache/package-info.java
Removing symbols from file guava/src/com/google/common/cache/CacheBuilder.java
Removing symbols from file guava/src/com/google/common/cache/LoadingCache.java
Removing symbols from file guava/src/com/google/common/graph/NetworkBuilder.java
Removing symbols from file guava/src/com/google/common/cache/CacheStats.java
Removing symbols from file guava/src/com/google/common/graph/MapIteratorCache.java
Removing symbols from file guava/src/com/google/common/graph/GraphsBridgeMethods.java
Removing symbols from file guava/src/com/google/common/graph/NetworkConnections.java
Removing symbols from file guava/src/com/google/common/graph/Traverser.java
Removing symbols from file guava/src/com/google/common/graph/UndirectedGraphConnections.java
Removing symbols from file guava/src/com/google/common/graph/ValueGraph.java
Removing symbols from file guava/src/com/google/common/graph/ImmutableGraph.java
Removing symbols from file guava/src/com/google/common/graph/DirectedMultiNetworkConnections.java
Removing symbols from file guava/src/com/google/common/graph/Network.java
Removing symbols from file guava/src/com/google/common/graph/GraphConnections.java
Removing symbols from file guava/src/com/google/common/graph/ForwardingNetwork.java
Removing symbols from file guava/src/com/google/common/graph/ForwardingValueGraph.java
Removing symbols from file guava/src/com/google/common/graph/SuccessorsFunction.java
Removing symbols from file guava/src/com/google/common/graph/ImmutableNetwork.java
Removing symbols from file guava/src/com/google/common/graph/ElementOrder.java
Removing symbols from file guava/src/com/google/common/graph/MutableNetwork.java
Removing symbols from file guava/src/com/google/common/graph/PredecessorsFunction.java
Removing symbols from file guava/src/com/google/common/graph/AbstractGraph.java
Removing symbols from file guava/src/com/google/common/graph/DirectedGraphConnections.java
Removing symbols from file guava/src/com/google/common/graph/Graph.java
Removing symbols from file guava/src/com/google/common/graph/GraphBuilder.java
Removing symbols from file guava/src/com/google/common/graph/EdgesConnecting.java
Removing symbols from file guava/src/com/google/common/graph/EndpointPairIterator.java
Removing symbols from file guava/src/com/google/common/graph/ValueGraphBuilder.java
Removing symbols from file guava/src/com/google/common/graph/MultiEdgesConnecting.java
Removing symbols from file guava/src/com/google/common/graph/ParametricNullness.java
Removing symbols from file guava/src/com/google/common/graph/MapRetrievalCache.java
Removing symbols from file guava/src/com/google/common/graph/AbstractValueGraph.java
Removing symbols from file guava/src/com/google/common/graph/IncidentEdgeSet.java
Removing symbols from file guava/src/com/google/common/graph/StandardValueGraph.java
Removing symbols from file guava/src/com/google/common/graph/AbstractDirectedNetworkConnections.java
Removing symbols from file guava/src/com/google/common/graph/AbstractNetwork.java
Removing symbols from file guava/src/com/google/common/graph/UndirectedMultiNetworkConnections.java
Removing symbols from file guava/src/com/google/common/graph/AbstractBaseGraph.java
Removing symbols from file guava/src/com/google/common/graph/StandardMutableValueGraph.java
Removing symbols from file guava/src/com/google/common/graph/StandardMutableNetwork.java
Removing symbols from file guava/src/com/google/common/graph/ImmutableValueGraph.java
Removing symbols from file guava/src/com/google/common/graph/MutableValueGraph.java
Removing symbols from file guava/src/com/google/common/graph/MutableGraph.java
Removing symbols from file guava/src/com/google/common/graph/AbstractUndirectedNetworkConnections.java
Removing symbols from file guava/src/com/google/common/graph/EndpointPair.java
Removing symbols from file guava/src/com/google/common/graph/package-info.java
Removing symbols from file guava/src/com/google/common/util/concurrent/UncheckedExecutionException.java
Removing symbols from file guava/src/com/google/common/util/concurrent/Partially.java
Removing symbols from file guava/src/com/google/common/util/concurrent/ExecutionError.java
Removing symbols from file guava/src/com/google/common/graph/Graphs.java
Removing symbols from file guava/src/com/google/common/util/concurrent/UncaughtExceptionHandlers.java
Removing symbols from file guava/src/com/google/common/util/concurrent/GwtFuturesCatchingSpecialization.java
Removing symbols from file guava/src/com/google/common/util/concurrent/ImmediateFuture.java
Removing symbols from file guava/src/com/google/common/util/concurrent/Internal.java
Removing symbols from file guava/src/com/google/common/util/concurrent/DirectExecutorService.java
Removing symbols from file guava/src/com/google/common/util/concurrent/AsyncFunction.java
Removing symbols from file guava/src/com/google/common/util/concurrent/AbstractScheduledService.java
Removing symbols from file guava/src/com/google/common/util/concurrent/ListeningExecutorService.java
Removing symbols from file guava/src/com/google/common/util/concurrent/AtomicLongMap.java
Removing symbols from file guava/src/com/google/common/util/concurrent/ForwardingBlockingQueue.java
Removing symbols from file guava/src/com/google/common/util/concurrent/NullnessCasts.java
Removing symbols from file guava/src/com/google/common/util/concurrent/AbstractTransformFuture.java
Removing symbols from file guava/src/com/google/common/cache/LocalCache.java
Removing symbols from file guava/src/com/google/common/util/concurrent/ListeningScheduledExecutorService.java
Removing symbols from file guava/src/com/google/common/util/concurrent/Callables.java
Removing symbols from file guava/src/com/google/common/util/concurrent/FutureCallback.java
Removing symbols from file guava/src/com/google/common/util/concurrent/GwtFluentFutureCatchingSpecialization.java
Removing symbols from file guava/src/com/google/common/util/concurrent/Monitor.java
Removing symbols from file guava/src/com/google/common/util/concurrent/SimpleTimeLimiter.java
Removing symbols from file guava/src/com/google/common/util/concurrent/FakeTimeLimiter.java
Removing symbols from file guava/src/com/google/common/util/concurrent/ListenableScheduledFuture.java
Removing symbols from file guava/src/com/google/common/util/concurrent/ServiceManagerBridge.java
Removing symbols from file guava/src/com/google/common/util/concurrent/TrustedListenableFutureTask.java
Removing symbols from file guava/src/com/google/common/util/concurrent/ForwardingLock.java
Removing symbols from file guava/src/com/google/common/util/concurrent/CycleDetectingLockFactory.java
Removing symbols from file guava/src/com/google/common/util/concurrent/AtomicDouble.java
Removing symbols from file guava/src/com/google/common/util/concurrent/ExecutionList.java
Removing symbols from file guava/src/com/google/common/util/concurrent/SmoothRateLimiter.java
Removing symbols from file guava/src/com/google/common/util/concurrent/ForwardingExecutorService.java
Removing symbols from file guava/src/com/google/common/util/concurrent/Striped.java
Removing symbols from file guava/src/com/google/common/util/concurrent/ForwardingBlockingDeque.java
Removing symbols from file guava/src/com/google/common/util/concurrent/AbstractIdleService.java
Removing symbols from file guava/src/com/google/common/util/concurrent/SettableFuture.java
Removing symbols from file guava/src/com/google/common/util/concurrent/CollectionFuture.java
Removing symbols from file guava/src/com/google/common/util/concurrent/TimeoutFuture.java
Removing symbols from file guava/src/com/google/common/util/concurrent/AggregateFutureState.java
Removing symbols from file guava/src/com/google/common/util/concurrent/WrappingScheduledExecutorService.java
Removing symbols from file guava/src/com/google/common/util/concurrent/SequentialExecutor.java
Removing symbols from file guava/src/com/google/common/util/concurrent/OverflowAvoidingLockSupport.java
Removing symbols from file guava/src/com/google/common/util/concurrent/AbstractService.java
Removing symbols from file guava/src/com/google/common/util/concurrent/CombinedFuture.java
Removing symbols from file guava/src/com/google/common/util/concurrent/SneakyThrows.java
Removing symbols from file guava/src/com/google/common/util/concurrent/LazyLogger.java
Removing symbols from file guava/src/com/google/common/util/concurrent/WrappingExecutorService.java
Removing symbols from file guava/src/com/google/common/util/concurrent/ParametricNullness.java
Removing symbols from file guava/src/com/google/common/util/concurrent/ThreadFactoryBuilder.java
Removing symbols from file guava/src/com/google/common/util/concurrent/UncheckedTimeoutException.java
Removing symbols from file guava/src/com/google/common/util/concurrent/FuturesGetChecked.java
Removing symbols from file guava/src/com/google/common/util/concurrent/DirectExecutor.java
Removing symbols from file guava/src/com/google/common/util/concurrent/ListenableFutureTask.java
Removing symbols from file guava/src/com/google/common/util/concurrent/ExecutionSequencer.java
Removing symbols from file guava/src/com/google/common/util/concurrent/Service.java
Removing symbols from file guava/src/com/google/common/util/concurrent/AbstractCatchingFuture.java
Removing symbols from file guava/src/com/google/common/util/concurrent/AbstractExecutionThreadService.java
Removing symbols from file guava/src/com/google/common/util/concurrent/ForwardingFluentFuture.java
Removing symbols from file guava/src/com/google/common/util/concurrent/FluentFuture.java
Removing symbols from file guava/src/com/google/common/util/concurrent/ForwardingListeningExecutorService.java
Removing symbols from file guava/src/com/google/common/util/concurrent/InterruptibleTask.java
Removing symbols from file guava/src/com/google/common/util/concurrent/AbstractListeningExecutorService.java
Removing symbols from file guava/src/com/google/common/util/concurrent/ForwardingCondition.java
Removing symbols from file guava/src/com/google/common/util/concurrent/ClosingFuture.java
Removing symbols from file guava/src/com/google/common/util/concurrent/JdkFutureAdapters.java
Removing symbols from file guava/src/com/google/common/util/concurrent/Uninterruptibles.java
Removing symbols from file guava/src/com/google/common/util/concurrent/Platform.java
Removing symbols from file guava/src/com/google/common/util/concurrent/AbstractFuture.java
Removing symbols from file guava/src/com/google/common/util/concurrent/TimeLimiter.java
Removing symbols from file guava/src/com/google/common/util/concurrent/RateLimiter.java
Removing symbols from file guava/src/com/google/common/util/concurrent/Runnables.java
Removing symbols from file guava/src/com/google/common/util/concurrent/ListenerCallQueue.java
Removing symbols from file guava/src/com/google/common/util/concurrent/ForwardingListenableFuture.java
Removing symbols from file guava/src/com/google/common/util/concurrent/Futures.java
Removing symbols from file guava/src/com/google/common/util/concurrent/Atomics.java
Removing symbols from file guava/src/com/google/common/util/concurrent/ListenableFuture.java
Removing symbols from file guava/src/com/google/common/util/concurrent/AggregateFuture.java
Removing symbols from file guava/src/com/google/common/util/concurrent/ForwardingFuture.java
Removing symbols from file guava/src/com/google/common/util/concurrent/AsyncCallable.java
Removing symbols from file guava/src/com/google/common/util/concurrent/AtomicDoubleArray.java
Removing symbols from file guava/src/com/google/common/util/concurrent/package-info.java
Removing symbols from file guava/src/com/google/common/xml/ParametricNullness.java
Removing symbols from file guava/src/com/google/common/xml/package-info.java
Removing symbols from file guava/src/com/google/common/util/concurrent/ServiceManager.java
Removing symbols from file guava/src/com/google/common/util/concurrent/MoreExecutors.java
Removing symbols from file guava/src/com/google/common/xml/XmlEscapers.java
Removing symbols from file guava/src/com/google/common/reflect/TypeParameter.java
Removing symbols from file guava/src/com/google/common/reflect/TypeToInstanceMap.java
Removing symbols from file guava/src/com/google/common/reflect/AbstractInvocationHandler.java
Removing symbols from file guava/src/com/google/common/util/concurrent/AbstractFutureState.java
Removing symbols from file guava/src/com/google/common/reflect/Invokable.java
Removing symbols from file guava/src/com/google/common/reflect/MutableTypeToInstanceMap.java
Removing symbols from file guava/src/com/google/common/reflect/ParametricNullness.java
Removing symbols from file guava/src/com/google/common/reflect/TypeVisitor.java
Removing symbols from file guava/src/com/google/common/reflect/package-info.java
Removing symbols from file guava/src/com/google/common/reflect/Parameter.java
Removing symbols from file guava/src/com/google/common/reflect/ImmutableTypeToInstanceMap.java
Removing symbols from file guava/src/com/google/common/reflect/ClassPath.java
Removing symbols from file guava/src/com/google/common/reflect/Types.java
Removing symbols from file guava/src/com/google/common/escape/ArrayBasedCharEscaper.java
Removing symbols from file guava/src/com/google/common/escape/CharEscaper.java
Removing symbols from file guava/src/com/google/common/escape/ArrayBasedEscaperMap.java
Removing symbols from file guava/src/com/google/common/reflect/TypeResolver.java
Removing symbols from file guava/src/com/google/common/escape/Escapers.java
Removing symbols from file guava/src/com/google/common/escape/Escaper.java
Removing symbols from file guava/src/com/google/common/escape/ParametricNullness.java
Removing symbols from file guava/src/com/google/common/reflect/TypeToken.java
Removing symbols from file guava/src/com/google/common/escape/CharEscaperBuilder.java
Removing symbols from file guava/src/com/google/common/escape/ArrayBasedUnicodeEscaper.java
Removing symbols from file guava/src/com/google/common/escape/Platform.java
Removing symbols from file guava/src/com/google/common/escape/UnicodeEscaper.java
Removing symbols from file guava/src/com/google/common/escape/package-info.java
Removing symbols from file guava/src/com/google/common/eventbus/Subscriber.java
Removing symbols from file guava/src/com/google/common/eventbus/ParametricNullness.java
Removing symbols from file guava/src/com/google/common/eventbus/Subscribe.java
Removing symbols from file guava/src/com/google/common/eventbus/package-info.java
Removing symbols from file guava/src/com/google/common/eventbus/SubscriberRegistry.java
Removing symbols from file guava/src/com/google/common/primitives/Booleans.java
Removing symbols from file guava/src/com/google/common/primitives/Ints.java
Removing symbols from file guava/src/com/google/common/primitives/IntsMethodsForWeb.java
Removing symbols from file guava/src/com/google/common/primitives/DoublesMethodsForWeb.java
Removing symbols from file guava/src/com/google/common/primitives/FloatsMethodsForWeb.java
Removing symbols from file guava/src/com/google/common/primitives/ImmutableDoubleArray.java
Removing symbols from file guava/src/com/google/common/primitives/Primitives.java
Removing symbols from file guava/src/com/google/common/primitives/Doubles.java
Removing symbols from file guava/src/com/google/common/primitives/ParseRequest.java
Removing symbols from file guava/src/com/google/common/primitives/ParametricNullness.java
Removing symbols from file guava/src/com/google/common/primitives/Bytes.java
Removing symbols from file guava/src/com/google/common/primitives/SignedBytes.java
Removing symbols from file guava/src/com/google/common/primitives/Longs.java
Removing symbols from file guava/src/com/google/common/primitives/UnsignedInts.java
Removing symbols from file guava/src/com/google/common/primitives/ImmutableLongArray.java
Removing symbols from file guava/src/com/google/common/primitives/UnsignedLong.java
Removing symbols from file guava/src/com/google/common/primitives/ShortsMethodsForWeb.java
Removing symbols from file guava/src/com/google/common/primitives/Chars.java
Removing symbols from file guava/src/com/google/common/primitives/package-info.java
Removing symbols from file guava/src/com/google/common/primitives/Floats.java
Removing symbols from file guava/src/com/google/common/primitives/UnsignedInteger.java
Removing symbols from file guava/src/com/google/common/primitives/UnsignedLongs.java
Removing symbols from file guava/src/com/google/common/primitives/Shorts.java
Removing symbols from file guava/src/com/google/common/primitives/ImmutableIntArray.java
Removing symbols from file guava/src/com/google/common/base/Internal.java
Removing symbols from file guava/src/com/google/common/base/Supplier.java
Removing symbols from file guava/src/com/google/common/base/FinalizableReferenceQueue.java
Removing symbols from file guava/src/com/google/common/base/Utf8.java
Removing symbols from file guava/src/com/google/common/base/PatternCompiler.java
Removing symbols from file guava/src/com/google/common/primitives/UnsignedBytes.java
Removing symbols from file guava/src/com/google/common/base/NullnessCasts.java
Removing symbols from file guava/src/com/google/common/base/Predicate.java
Removing symbols from file guava/src/com/google/common/base/Stopwatch.java
Removing symbols from file guava/src/com/google/common/base/Functions.java
Removing symbols from file guava/src/com/google/common/base/Objects.java
Removing symbols from file guava/src/com/google/common/base/Converter.java
Removing symbols from file guava/src/com/google/common/base/FinalizablePhantomReference.java
Removing symbols from file guava/src/com/google/common/base/Function.java
Removing symbols from file guava/src/com/google/common/base/PairwiseEquivalence.java
Removing symbols from file guava/src/com/google/common/base/ExtraObjectsMethodsForWeb.java
Removing symbols from file guava/src/com/google/common/base/Ascii.java
Removing symbols from file guava/src/com/google/common/base/CharMatcher.java
Removing symbols from file guava/src/com/google/common/base/FinalizableWeakReference.java
Removing symbols from file guava/src/com/google/common/base/CommonMatcher.java
Removing symbols from file guava/src/com/google/common/base/Joiner.java
Removing symbols from file guava/src/com/google/common/base/Strings.java
Removing symbols from file guava/src/com/google/common/base/Verify.java
Removing symbols from file guava/src/com/google/common/base/Defaults.java
Removing symbols from file guava/src/com/google/common/base/Enums.java
Removing symbols from file guava/src/com/google/common/base/Throwables.java
Removing symbols from file guava/src/com/google/common/base/Charsets.java
Removing symbols from file guava/src/com/google/common/base/SmallCharMatcher.java
Removing symbols from file guava/src/com/google/common/base/JdkPattern.java
Removing symbols from file guava/src/com/google/common/base/SneakyThrows.java
Removing symbols from file guava/src/com/google/common/base/Ticker.java
Removing symbols from file guava/src/com/google/common/base/Equivalence.java
Removing symbols from file guava/src/com/google/common/base/ParametricNullness.java
Removing symbols from file guava/src/com/google/common/base/MoreObjects.java
Removing symbols from file guava/src/com/google/common/base/FinalizableReference.java
Removing symbols from file guava/src/com/google/common/base/Absent.java
Removing symbols from file guava/src/com/google/common/base/Present.java
Removing symbols from file guava/src/com/google/common/base/Predicates.java
Removing symbols from file guava/src/com/google/common/base/CaseFormat.java
Removing symbols from file guava/src/com/google/common/base/StandardSystemProperty.java
Removing symbols from file guava/src/com/google/common/base/Preconditions.java
Removing symbols from file guava/src/com/google/common/base/Platform.java
Removing symbols from file guava/src/com/google/common/base/Java8Compatibility.java
Removing symbols from file guava/src/com/google/common/base/Splitter.java
Removing symbols from file guava/src/com/google/common/base/CommonPattern.java
Removing symbols from file guava/src/com/google/common/base/internal/Finalizer.java
Removing symbols from file guava/src/com/google/common/base/AbstractIterator.java
Removing symbols from file guava/src/com/google/common/base/Suppliers.java
Removing symbols from file guava/src/com/google/common/base/FunctionalEquivalence.java
Removing symbols from file guava/src/com/google/common/base/VerifyException.java
Removing symbols from file guava/src/com/google/common/base/FinalizableSoftReference.java
Removing symbols from file guava/src/com/google/common/base/Optional.java
Removing symbols from file guava/src/com/google/common/base/package-info.java
Removing symbols from file guava/src/com/google/common/net/HostSpecifier.java
Removing symbols from file guava/src/com/google/common/net/ParametricNullness.java
Removing symbols from file guava/src/com/google/common/net/InternetDomainName.java
Removing symbols from file guava/src/com/google/common/net/HttpHeaders.java
Removing symbols from file guava/src/com/google/common/net/HostAndPort.java
Removing symbols from file guava/src/com/google/common/net/PercentEscaper.java
Removing symbols from file guava/src/com/google/common/net/UrlEscapers.java
Removing symbols from file guava/src/com/google/common/net/package-info.java
Removing symbols from file guava/src/com/google/common/html/HtmlEscapers.java
Removing symbols from file guava/src/com/google/common/html/package-info.java
Removing symbols from file guava/src/com/google/common/html/ParametricNullness.java
Removing symbols from file guava/src/com/google/common/net/InetAddresses.java
Removing symbols from file guava/src/com/google/common/hash/Murmur3_128HashFunction.java
Removing symbols from file guava/src/com/google/common/hash/HashFunction.java
Removing symbols from file guava/src/com/google/common/hash/ImmutableSupplier.java
Removing symbols from file guava/src/com/google/common/hash/AbstractStreamingHasher.java
Removing symbols from file guava/src/com/google/common/hash/Funnels.java
Removing symbols from file guava/src/com/google/common/hash/HashCode.java
Removing symbols from file guava/src/com/google/common/hash/AbstractNonStreamingHashFunction.java
Removing symbols from file guava/src/com/google/common/hash/Hashing.java
Removing symbols from file guava/src/com/google/common/hash/BloomFilter.java
Removing symbols from file guava/src/com/google/common/net/MediaType.java
Removing symbols from file guava/src/com/google/common/hash/AbstractHashFunction.java
Removing symbols from file guava/src/com/google/common/hash/AbstractByteHasher.java
Removing symbols from file guava/src/com/google/common/hash/Murmur3_32HashFunction.java
Removing symbols from file guava/src/com/google/common/hash/AbstractCompositeHashFunction.java
Removing symbols from file guava/src/com/google/common/hash/MessageDigestHashFunction.java
Removing symbols from file guava/src/com/google/common/hash/PrimitiveSink.java
Removing symbols from file guava/src/com/google/common/hash/Funnel.java
Removing symbols from file guava/src/com/google/common/hash/SneakyThrows.java
Removing symbols from file guava/src/com/google/common/hash/LittleEndianByteArray.java
Removing symbols from file guava/src/com/google/common/hash/ParametricNullness.java
Removing symbols from file guava/src/com/google/common/hash/ChecksumHashFunction.java
Removing symbols from file guava/src/com/google/common/hash/Java8Compatibility.java
Removing symbols from file guava/src/com/google/common/hash/Hasher.java
Removing symbols from file guava/src/com/google/common/hash/BloomFilterStrategies.java
Removing symbols from file guava/src/com/google/common/hash/SipHashFunction.java
Removing symbols from file guava/src/com/google/common/hash/Fingerprint2011.java
Removing symbols from file guava/src/com/google/common/hash/Crc32cHashFunction.java
Removing symbols from file guava/src/com/google/common/hash/HashingInputStream.java
Removing symbols from file guava/src/com/google/common/hash/AbstractHasher.java
Removing symbols from file guava/src/com/google/common/hash/MacHashFunction.java
Removing symbols from file guava/src/com/google/common/hash/package-info.java
Removing symbols from file guava/src/com/google/common/hash/FarmHashFingerprint64.java
Removing symbols from file guava/src/com/google/common/hash/HashingOutputStream.java
Removing symbols from file guava/src/com/google/common/math/BigDecimalMath.java
Removing symbols from file guava/src/com/google/common/math/MathPreconditions.java
Removing symbols from file guava/src/com/google/common/math/ToDoubleRounder.java
Removing symbols from file guava/src/com/google/common/math/LinearTransformation.java
Removing symbols from file guava/src/com/google/common/math/PairedStats.java
Removing symbols from file guava/src/com/google/common/math/ParametricNullness.java
Removing symbols from file guava/src/com/google/common/math/DoubleUtils.java
Removing symbols from file guava/src/com/google/common/math/IntMath.java
Removing symbols from file guava/src/com/google/common/math/LongMath.java
Removing symbols from file guava/src/com/google/common/math/package-info.java
Removing symbols from file guava/src/com/google/common/math/StatsAccumulator.java
Removing symbols from file guava/src/com/google/common/math/BigIntegerMath.java
Removing symbols from file guava/src/com/google/common/math/DoubleMath.java
Removing symbols from file guava-testlib/src/com/google/common/collect/testing/OneSizeTestContainerGenerator.java
Removing symbols from file guava/src/com/google/common/math/PairedStatsAccumulator.java
Removing symbols from file guava/src/com/google/common/math/Stats.java
Removing symbols from file guava-testlib/src/com/google/common/collect/testing/OneSizeGenerator.java
Removing symbols from file guava/src/com/google/common/math/Quantiles.java
Removing symbols from file guava-testlib/src/com/google/common/collect/testing/AbstractCollectionTester.java
Removing symbols from file guava-testlib/src/com/google/common/collect/testing/BaseComparable.java
Removing symbols from file guava-testlib/src/com/google/common/collect/testing/IteratorTester.java
Removing symbols from file guava-testlib/src/com/google/common/collect/testing/NavigableMapTestSuiteBuilder.java
Removing symbols from file guava-testlib/src/com/google/common/collect/testing/SortedMapInterfaceTest.java
Removing symbols from file guava-testlib/src/com/google/common/collect/testing/FeatureSpecificTestSuiteBuilder.java
Removing symbols from file guava-testlib/src/com/google/common/collect/testing/AnEnum.java
Removing symbols from file guava-testlib/src/com/google/common/collect/testing/NavigableSetTestSuiteBuilder.java
Removing symbols from file guava-testlib/src/com/google/common/collect/testing/MapTestSuiteBuilder.java
Removing symbols from file guava-testlib/src/com/google/common/collect/testing/TestStringListGenerator.java
Removing symbols from file guava-testlib/src/com/google/common/collect/testing/TestsForMapsInJavaUtil.java
Removing symbols from file guava-testlib/src/com/google/common/collect/testing/TestsForQueuesInJavaUtil.java
Removing symbols from file guava-testlib/src/com/google/common/collect/testing/testers/ListIndexOfTester.java
Removing symbols from file guava-testlib/src/com/google/common/collect/testing/testers/MapSizeTester.java
Removing symbols from file guava-testlib/src/com/google/common/collect/testing/testers/SortedSetNavigationTester.java
Removing symbols from file guava-testlib/src/com/google/common/collect/testing/TestsForSetsInJavaUtil.java
Removing symbols from file guava-testlib/src/com/google/common/collect/testing/DerivedCollectionGenerators.java
Removing symbols from file guava-testlib/src/com/google/common/collect/testing/testers/MapRemoveEntryTester.java
Removing symbols from file guava-testlib/src/com/google/common/collect/testing/testers/ListLastIndexOfTester.java
Removing symbols from file guava-testlib/src/com/google/common/collect/testing/testers/ConcurrentMapPutIfAbsentTester.java
Removing symbols from file guava-testlib/src/com/google/common/collect/testing/testers/QueueElementTester.java
Removing symbols from file guava-testlib/src/com/google/common/collect/testing/testers/CollectionRemoveTester.java
Removing symbols from file guava-testlib/src/com/google/common/collect/testing/testers/ListAddAtIndexTester.java
Removing symbols from file guava-testlib/src/com/google/common/collect/testing/testers/ListCreationTester.java
Removing symbols from file guava-testlib/src/com/google/common/collect/testing/testers/CollectionIteratorTester.java
Removing symbols from file guava-testlib/src/com/google/common/collect/testing/testers/MapCreationTester.java
Removing symbols from file guava-testlib/src/com/google/common/collect/testing/testers/CollectionClearTester.java
Removing symbols from file guava-testlib/src/com/google/common/collect/testing/testers/CollectionSpliteratorTester.java
Removing symbols from file guava-testlib/src/com/google/common/collect/testing/testers/ListHashCodeTester.java
Removing symbols from file guava-testlib/src/com/google/common/collect/testing/testers/AbstractQueueTester.java
Removing symbols from file guava-testlib/src/com/google/common/collect/testing/testers/MapReplaceAllTester.java
Removing symbols from file guava-testlib/src/com/google/common/collect/testing/testers/CollectionSerializationEqualTester.java
Removing symbols from file guava-testlib/src/com/google/common/collect/testing/testers/AbstractListIndexOfTester.java
Removing symbols from file guava-testlib/src/com/google/common/collect/testing/testers/MapReplaceTester.java
Removing symbols from file guava-testlib/src/com/google/common/collect/testing/testers/MapMergeTester.java
Removing symbols from file guava-testlib/src/com/google/common/collect/testing/testers/SetAddTester.java
Removing symbols from file guava-testlib/src/com/google/common/collect/testing/testers/SetRemoveTester.java
Removing symbols from file guava-testlib/src/com/google/common/collect/testing/testers/MapComputeTester.java
Removing symbols from file guava-testlib/src/com/google/common/collect/testing/testers/CollectionToStringTester.java
Removing symbols from file guava-testlib/src/com/google/common/collect/testing/testers/CollectionRetainAllTester.java
Removing symbols from file guava-testlib/src/com/google/common/collect/testing/testers/TestExceptions.java
Removing symbols from file guava-testlib/src/com/google/common/collect/testing/testers/QueuePeekTester.java
Removing symbols from file guava-testlib/src/com/google/common/collect/testing/testers/MapGetTester.java
Removing symbols from file guava-testlib/src/com/google/common/collect/testing/testers/CollectionContainsTester.java
Removing symbols from file guava-testlib/src/com/google/common/collect/testing/testers/MapGetOrDefaultTester.java
Removing symbols from file guava-testlib/src/com/google/common/collect/testing/testers/NavigableMapNavigationTester.java
Removing symbols from file guava-testlib/src/com/google/common/collect/testing/testers/CollectionAddTester.java
Removing symbols from file guava-testlib/src/com/google/common/collect/testing/testers/CollectionContainsAllTester.java
Removing symbols from file guava-testlib/src/com/google/common/collect/testing/testers/ListRetainAllTester.java
Removing symbols from file guava-testlib/src/com/google/common/collect/testing/testers/NavigableSetNavigationTester.java
Removing symbols from file guava-testlib/src/com/google/common/collect/testing/testers/ListEqualsTester.java
Removing symbols from file guava-testlib/src/com/google/common/collect/testing/testers/MapForEachTester.java
Removing symbols from file guava-testlib/src/com/google/common/collect/testing/testers/ListSetTester.java
Removing symbols from file guava-testlib/src/com/google/common/collect/testing/testers/CollectionRemoveAllTester.java
Removing symbols from file guava-testlib/src/com/google/common/collect/testing/testers/IgnoreJRERequirement.java
Removing symbols from file guava-testlib/src/com/google/common/collect/testing/testers/MapSerializationTester.java
Removing symbols from file guava-testlib/src/com/google/common/collect/testing/testers/MapContainsKeyTester.java
Removing symbols from file guava-testlib/src/com/google/common/collect/testing/testers/ListAddAllAtIndexTester.java
Removing symbols from file guava-testlib/src/com/google/common/collect/testing/testers/QueueRemoveTester.java
Removing symbols from file guava-testlib/src/com/google/common/collect/testing/testers/AbstractListTester.java
Removing symbols from file guava-testlib/src/com/google/common/collect/testing/testers/MapEntrySetTester.java
Removing symbols from file guava-testlib/src/com/google/common/collect/testing/testers/QueuePollTester.java
Removing symbols from file guava-testlib/src/com/google/common/collect/testing/testers/ListReplaceAllTester.java
Removing symbols from file guava-testlib/src/com/google/common/collect/testing/testers/ConcurrentMapReplaceTester.java
Removing symbols from file guava-testlib/src/com/google/common/collect/testing/testers/CollectionSerializationTester.java
Removing symbols from file guava-testlib/src/com/google/common/collect/testing/testers/CollectionIsEmptyTester.java
Removing symbols from file guava-testlib/src/com/google/common/collect/testing/testers/ListToArrayTester.java
Removing symbols from file guava-testlib/src/com/google/common/collect/testing/testers/ReflectionFreeAssertThrows.java
Removing symbols from file guava-testlib/src/com/google/common/collect/testing/testers/CollectionEqualsTester.java
Removing symbols from file guava-testlib/src/com/google/common/collect/testing/testers/MapEqualsTester.java
Removing symbols from file guava-testlib/src/com/google/common/collect/testing/testers/QueueOfferTester.java
Removing symbols from file guava-testlib/src/com/google/common/collect/testing/testers/AbstractSetTester.java
Removing symbols from file guava-testlib/src/com/google/common/collect/testing/testers/MapIsEmptyTester.java
Removing symbols from file guava-testlib/src/com/google/common/collect/testing/testers/CollectionRemoveIfTester.java
Removing symbols from file guava-testlib/src/com/google/common/collect/testing/testers/CollectionStreamTester.java
Removing symbols from file guava-testlib/src/com/google/common/collect/testing/testers/MapHashCodeTester.java
Removing symbols from file guava-testlib/src/com/google/common/collect/testing/testers/SetEqualsTester.java
Removing symbols from file guava-testlib/src/com/google/common/collect/testing/testers/ListRemoveTester.java
Removing symbols from file guava-testlib/src/com/google/common/collect/testing/testers/MapContainsValueTester.java
Removing symbols from file guava-testlib/src/com/google/common/collect/testing/testers/ListListIteratorTester.java
Removing symbols from file guava-testlib/src/com/google/common/collect/testing/testers/Platform.java
Removing symbols from file guava-testlib/src/com/google/common/collect/testing/testers/ListAddAllTester.java
Removing symbols from file guava-testlib/src/com/google/common/collect/testing/testers/MapPutTester.java
Removing symbols from file guava-testlib/src/com/google/common/collect/testing/testers/ConcurrentMapRemoveTester.java
Removing symbols from file guava-testlib/src/com/google/common/collect/testing/testers/SetHashCodeTester.java
Removing symbols from file guava-testlib/src/com/google/common/collect/testing/testers/MapReplaceEntryTester.java
Removing symbols from file guava-testlib/src/com/google/common/collect/testing/testers/ListSubListTester.java
Removing symbols from file guava-testlib/src/com/google/common/collect/testing/testers/MapComputeIfAbsentTester.java
Removing symbols from file guava-testlib/src/com/google/common/collect/testing/testers/ListGetTester.java
Removing symbols from file guava-testlib/src/com/google/common/collect/testing/testers/MapClearTester.java
Removing symbols from file guava-testlib/src/com/google/common/collect/testing/testers/MapPutAllTester.java
Removing symbols from file guava-testlib/src/com/google/common/collect/testing/testers/MapPutIfAbsentTester.java
Removing symbols from file guava-testlib/src/com/google/common/collect/testing/testers/SetAddAllTester.java
Removing symbols from file guava-testlib/src/com/google/common/collect/testing/testers/ListAddTester.java
Removing symbols from file guava-testlib/src/com/google/common/collect/testing/testers/CollectionToArrayTester.java
Removing symbols from file guava-testlib/src/com/google/common/collect/testing/testers/MapComputeIfPresentTester.java
Removing symbols from file guava-testlib/src/com/google/common/collect/testing/testers/CollectionForEachTester.java
Removing symbols from file guava-testlib/src/com/google/common/collect/testing/testers/SetCreationTester.java
Removing symbols from file guava-testlib/src/com/google/common/collect/testing/testers/MapToStringTester.java
Removing symbols from file guava-testlib/src/com/google/common/collect/testing/testers/CollectionCreationTester.java
Removing symbols from file guava-testlib/src/com/google/common/collect/testing/testers/CollectionAddAllTester.java
Removing symbols from file guava-testlib/src/com/google/common/collect/testing/testers/ListRemoveAllTester.java
Removing symbols from file guava-testlib/src/com/google/common/collect/testing/testers/MapRemoveTester.java
Removing symbols from file guava-testlib/src/com/google/common/collect/testing/testers/package-info.java
Removing symbols from file guava-testlib/src/com/google/common/collect/testing/testers/CollectionSizeTester.java
Removing symbols from file guava-testlib/src/com/google/common/collect/testing/testers/SortedMapNavigationTester.java
Removing symbols from file guava-testlib/src/com/google/common/collect/testing/testers/ConcurrentMapReplaceEntryTester.java
Removing symbols from file guava-testlib/src/com/google/common/collect/testing/testers/ListRemoveAtIndexTester.java
Removing symbols from file guava-testlib/src/com/google/common/collect/testing/CollectionTestSuiteBuilder.java
Removing symbols from file guava-testlib/src/com/google/common/collect/testing/AbstractContainerTester.java
Removing symbols from file guava-testlib/src/com/google/common/collect/testing/TestIntegerSetGenerator.java
Removing symbols from file guava-testlib/src/com/google/common/collect/testing/IteratorFeature.java
Removing symbols from file guava-testlib/src/com/google/common/collect/testing/ConcurrentMapTestSuiteBuilder.java
Removing symbols from file guava-testlib/src/com/google/common/collect/testing/suites/package-info.java
Removing symbols from file guava-testlib/src/com/google/common/collect/testing/TestSubjectGenerator.java
Removing symbols from file guava-testlib/src/com/google/common/collect/testing/TestEnumMapGenerator.java
Removing symbols from file guava-testlib/src/com/google/common/collect/testing/AbstractCollectionTestSuiteBuilder.java
Removing symbols from file guava-testlib/src/com/google/common/collect/testing/TestEnumSetGenerator.java
Removing symbols from file guava-testlib/src/com/google/common/collect/testing/TestStringMapGenerator.java
Removing symbols from file guava-testlib/src/com/google/common/collect/testing/TestListGenerator.java
Removing symbols from file guava-testlib/src/com/google/common/collect/testing/Helpers.java
Removing symbols from file guava-testlib/src/com/google/common/collect/testing/AbstractIteratorTester.java
Removing symbols from file guava-testlib/src/com/google/common/collect/testing/UnhashableObject.java
Removing symbols from file guava-testlib/src/com/google/common/collect/testing/TestSortedMapGenerator.java
Removing symbols from file guava-testlib/src/com/google/common/collect/testing/SafeTreeSet.java
Removing symbols from file guava-testlib/src/com/google/common/collect/testing/MinimalSet.java
Removing symbols from file guava-testlib/src/com/google/common/collect/testing/MinimalIterable.java
Removing symbols from file guava-testlib/src/com/google/common/collect/testing/MinimalCollection.java
Removing symbols from file guava-testlib/src/com/google/common/collect/testing/TestQueueGenerator.java
Removing symbols from file guava-testlib/src/com/google/common/collect/testing/TestStringQueueGenerator.java
Removing symbols from file guava-testlib/src/com/google/common/collect/testing/ListTestSuiteBuilder.java
Removing symbols from file guava-testlib/src/com/google/common/collect/testing/AbstractTester.java
Removing symbols from file guava-testlib/src/com/google/common/collect/testing/ReserializingTestCollectionGenerator.java
Removing symbols from file guava-testlib/src/com/google/common/collect/testing/TestIntegerSortedSetGenerator.java
Removing symbols from file guava-testlib/src/com/google/common/collect/testing/MapInterfaceTest.java
Removing symbols from file guava-testlib/src/com/google/common/collect/testing/QueueTestSuiteBuilder.java
Removing symbols from file guava-testlib/src/com/google/common/collect/testing/DerivedComparable.java
Removing symbols from file guava-testlib/src/com/google/common/collect/testing/IgnoreJRERequirement.java
Removing symbols from file guava-testlib/src/com/google/common/collect/testing/TestCollidingSetGenerator.java
Removing symbols from file guava-testlib/src/com/google/common/collect/testing/TestMapEntrySetGenerator.java
Removing symbols from file guava-testlib/src/com/google/common/collect/testing/TestMapGenerator.java
Removing symbols from file guava-testlib/src/com/google/common/collect/testing/DerivedGenerator.java
Removing symbols from file guava-testlib/src/com/google/common/collect/testing/ListIteratorTester.java
Removing symbols from file guava-testlib/src/com/google/common/collect/testing/ReflectionFreeAssertThrows.java
Removing symbols from file guava-testlib/src/com/google/common/collect/testing/SpliteratorTester.java
Removing symbols from file guava-testlib/src/com/google/common/collect/testing/TestCollectionGenerator.java
Removing symbols from file guava-testlib/src/com/google/common/collect/testing/SetTestSuiteBuilder.java
Removing symbols from file guava-testlib/src/com/google/common/collect/testing/TestStringSortedSetGenerator.java
Removing symbols from file guava-testlib/src/com/google/common/collect/testing/google/ListMultimapReplaceValuesTester.java
Removing symbols from file guava-testlib/src/com/google/common/collect/testing/google/MultimapFeature.java
Removing symbols from file guava-testlib/src/com/google/common/collect/testing/google/BiMapTestSuiteBuilder.java
Removing symbols from file guava-testlib/src/com/google/common/collect/testing/google/MultisetContainsTester.java
Removing symbols from file guava-testlib/src/com/google/common/collect/testing/google/TestStringSetMultimapGenerator.java
Removing symbols from file guava-testlib/src/com/google/common/collect/testing/TestsForListsInJavaUtil.java
Removing symbols from file guava-testlib/src/com/google/common/collect/testing/google/TestStringListMultimapGenerator.java
Removing symbols from file guava-testlib/src/com/google/common/collect/testing/google/MultimapToStringTester.java
Removing symbols from file guava-testlib/src/com/google/common/collect/testing/google/TestStringMultisetGenerator.java
Removing symbols from file guava-testlib/src/com/google/common/collect/testing/google/BiMapGenerators.java
Removing symbols from file guava-testlib/src/com/google/common/collect/testing/google/MultimapAsMapTester.java
Removing symbols from file guava-testlib/src/com/google/common/collect/testing/google/MultisetEntrySetTester.java
Removing symbols from file guava-testlib/src/com/google/common/collect/testing/google/SortedSetMultimapTestSuiteBuilder.java
Removing symbols from file guava-testlib/src/com/google/common/collect/testing/google/TestListMultimapGenerator.java
Removing symbols from file guava-testlib/src/com/google/common/collect/testing/google/AbstractMultisetTester.java
Removing symbols from file guava-testlib/src/com/google/common/collect/testing/google/AbstractMultimapTester.java
Removing symbols from file guava-testlib/src/com/google/common/collect/testing/google/ListMultimapEqualsTester.java
Removing symbols from file guava-testlib/src/com/google/common/collect/testing/google/TestStringBiMapGenerator.java
Removing symbols from file guava-testlib/src/com/google/common/collect/testing/google/MultimapGetTester.java
Removing symbols from file guava-testlib/src/com/google/common/collect/testing/google/MultimapForEachTester.java
Removing symbols from file guava-testlib/src/com/google/common/collect/testing/google/MultimapAsMapGetTester.java
Removing symbols from file guava-testlib/src/com/google/common/collect/testing/google/MultisetSetCountUnconditionallyTester.java
Removing symbols from file guava-testlib/src/com/google/common/collect/testing/google/ListMultimapPutTester.java
Removing symbols from file guava-testlib/src/com/google/common/collect/testing/google/MapGenerators.java
Removing symbols from file guava-testlib/src/com/google/common/collect/testing/google/GoogleHelpers.java
Removing symbols from file guava-testlib/src/com/google/common/collect/testing/google/ListMultimapRemoveTester.java
Removing symbols from file guava-testlib/src/com/google/common/collect/testing/google/SetMultimapEqualsTester.java
Removing symbols from file guava-testlib/src/com/google/common/collect/testing/google/MultimapPutIterableTester.java
Removing symbols from file guava-testlib/src/com/google/common/collect/testing/google/MultisetSetCountConditionallyTester.java
Removing symbols from file guava-testlib/src/com/google/common/collect/testing/google/MultimapReplaceValuesTester.java
Removing symbols from file guava-testlib/src/com/google/common/collect/testing/google/MultimapRemoveEntryTester.java
Removing symbols from file guava-testlib/src/com/google/common/collect/testing/google/SetMultimapPutTester.java
Removing symbols from file guava-testlib/src/com/google/common/collect/testing/google/ListMultimapPutAllTester.java
Removing symbols from file guava-testlib/src/com/google/common/collect/testing/google/BiMapEntrySetTester.java
Removing symbols from file guava-testlib/src/com/google/common/collect/testing/google/SortedMultisetTestSuiteBuilder.java
Removing symbols from file guava-testlib/src/com/google/common/collect/testing/google/MultisetEqualsTester.java
Removing symbols from file guava-testlib/src/com/google/common/collect/testing/google/ListMultimapAsMapTester.java
Removing symbols from file guava-testlib/src/com/google/common/collect/testing/google/SetMultimapReplaceValuesTester.java
Removing symbols from file guava-testlib/src/com/google/common/collect/testing/google/BiMapRemoveTester.java
Removing symbols from file guava-testlib/src/com/google/common/collect/testing/google/MultimapPutAllMultimapTester.java
Removing symbols from file guava-testlib/src/com/google/common/collect/testing/google/MultimapValuesTester.java
Removing symbols from file guava-testlib/src/com/google/common/collect/testing/google/SetMultimapAsMapTester.java
Removing symbols from file guava-testlib/src/com/google/common/collect/testing/google/MultimapContainsValueTester.java
Removing symbols from file guava-testlib/src/com/google/common/collect/testing/google/SortedSetMultimapGetTester.java
Removing symbols from file guava-testlib/src/com/google/common/collect/testing/google/AbstractListMultimapTester.java
Removing symbols from file guava-testlib/src/com/google/common/collect/testing/google/MultimapKeysTester.java
Removing symbols from file guava-testlib/src/com/google/common/collect/testing/google/SetMultimapPutAllTester.java
Removing symbols from file guava-testlib/src/com/google/common/collect/testing/google/SortedMapGenerators.java
Removing symbols from file guava-testlib/src/com/google/common/collect/testing/google/MultisetForEachEntryTester.java
Removing symbols from file guava-testlib/src/com/google/common/collect/testing/google/MultimapContainsKeyTester.java
Removing symbols from file guava-testlib/src/com/google/common/collect/testing/google/TestEnumMultisetGenerator.java
Removing symbols from file guava-testlib/src/com/google/common/collect/testing/google/TestSetMultimapGenerator.java
Removing symbols from file guava-testlib/src/com/google/common/collect/testing/google/DerivedGoogleCollectionGenerators.java
Removing symbols from file guava-testlib/src/com/google/common/collect/testing/google/MultisetRemoveTester.java
Removing symbols from file guava-testlib/src/com/google/common/collect/testing/google/MultimapSizeTester.java
Removing symbols from file guava-testlib/src/com/google/common/collect/testing/google/ListMultimapTestSuiteBuilder.java
Removing symbols from file guava-testlib/src/com/google/common/collect/testing/google/MultimapClearTester.java
Removing symbols from file guava-testlib/src/com/google/common/collect/testing/google/MultisetAddTester.java
Removing symbols from file guava-testlib/src/com/google/common/collect/testing/google/ReflectionFreeAssertThrows.java
Removing symbols from file guava-testlib/src/com/google/common/collect/testing/google/MultisetTestSuiteBuilder.java
Removing symbols from file guava-testlib/src/com/google/common/collect/testing/google/MultisetReadsTester.java
Removing symbols from file guava-testlib/src/com/google/common/collect/testing/google/MultisetElementSetTester.java
Removing symbols from file guava-testlib/src/com/google/common/collect/testing/google/TestMultisetGenerator.java
Removing symbols from file guava-testlib/src/com/google/common/collect/testing/google/MultisetSerializationTester.java
Removing symbols from file guava-testlib/src/com/google/common/collect/testing/google/SortedSetMultimapAsMapTester.java
Removing symbols from file guava-testlib/src/com/google/common/collect/testing/google/BiMapClearTester.java
Removing symbols from file guava-testlib/src/com/google/common/collect/testing/google/SetGenerators.java
Removing symbols from file guava-testlib/src/com/google/common/collect/testing/google/AbstractMultisetSetCountTester.java
Removing symbols from file guava-testlib/src/com/google/common/collect/testing/google/UnmodifiableCollectionTests.java
Removing symbols from file guava-testlib/src/com/google/common/collect/testing/google/MultisetNavigationTester.java
Removing symbols from file guava-testlib/src/com/google/common/collect/testing/google/BiMapPutTester.java
Removing symbols from file guava-testlib/src/com/google/common/collect/testing/google/MultisetFeature.java
Removing symbols from file guava-testlib/src/com/google/common/collect/testing/google/SetMultimapTestSuiteBuilder.java
Removing symbols from file guava-testlib/src/com/google/common/collect/testing/google/BiMapInverseTester.java
Removing symbols from file guava-testlib/src/com/google/common/collect/testing/google/TestMultimapGenerator.java
Removing symbols from file guava-testlib/src/com/google/common/collect/testing/google/MultisetCountTester.java
Removing symbols from file guava-testlib/src/com/google/common/collect/testing/google/MultimapEntriesTester.java
Removing symbols from file guava-testlib/src/com/google/common/collect/testing/google/MultimapEqualsTester.java
Removing symbols from file guava-testlib/src/com/google/common/collect/testing/google/ListGenerators.java
Removing symbols from file guava-testlib/src/com/google/common/collect/testing/google/MultimapTestSuiteBuilder.java
Removing symbols from file guava-testlib/src/com/google/common/collect/testing/google/AbstractBiMapTester.java
Removing symbols from file guava-testlib/src/com/google/common/collect/testing/google/MultimapContainsEntryTester.java
Removing symbols from file guava-testlib/src/com/google/common/collect/testing/google/MultimapKeySetTester.java
Removing symbols from file guava-testlib/src/com/google/common/collect/testing/google/MultisetIteratorTester.java
Removing symbols from file guava-testlib/src/com/google/common/collect/testing/google/TestBiMapGenerator.java
Removing symbols from file guava-testlib/src/com/google/common/collect/testing/google/package-info.java
Removing symbols from file guava-testlib/src/com/google/common/collect/testing/ReserializingTestSetGenerator.java
Removing symbols from file guava-testlib/src/com/google/common/collect/testing/google/MultimapRemoveAllTester.java
Removing symbols from file guava-testlib/src/com/google/common/collect/testing/TestUnhashableCollectionGenerator.java
Removing symbols from file guava-testlib/src/com/google/common/collect/testing/google/MultimapPutTester.java
Removing symbols from file guava-testlib/src/com/google/common/collect/testing/TestStringSetGenerator.java
Removing symbols from file guava-testlib/src/com/google/common/collect/testing/ConcurrentNavigableMapTestSuiteBuilder.java
Removing symbols from file guava-testlib/src/com/google/common/collect/testing/features/ConflictingRequirementsException.java
Removing symbols from file guava-testlib/src/com/google/common/collect/testing/features/ListFeature.java
Removing symbols from file guava-testlib/src/com/google/common/collect/testing/features/CollectionFeature.java
Removing symbols from file guava-testlib/src/com/google/common/collect/testing/features/Feature.java
Removing symbols from file guava-testlib/src/com/google/common/collect/testing/features/MapFeature.java
Removing symbols from file guava-testlib/src/com/google/common/collect/testing/features/TesterAnnotation.java
Removing symbols from file guava-testlib/src/com/google/common/collect/testing/features/FeatureUtil.java
Removing symbols from file guava-testlib/src/com/google/common/collect/testing/features/TesterRequirements.java
Removing symbols from file guava-testlib/src/com/google/common/collect/testing/features/package-info.java
Removing symbols from file guava-testlib/src/com/google/common/collect/testing/features/CollectionSize.java
Removing symbols from file guava-testlib/src/com/google/common/collect/testing/features/SetFeature.java
Removing symbols from file guava-testlib/src/com/google/common/collect/testing/TestStringSortedMapGenerator.java
Removing symbols from file guava-testlib/src/com/google/common/collect/testing/DerivedTestIteratorGenerator.java
Removing symbols from file guava-testlib/src/com/google/common/collect/testing/SampleElements.java
Removing symbols from file guava-testlib/src/com/google/common/collect/testing/TestStringCollectionGenerator.java
Removing symbols from file guava-testlib/src/com/google/common/collect/testing/WrongType.java
Removing symbols from file guava-testlib/src/com/google/common/collect/testing/Platform.java
Removing symbols from file guava-testlib/src/com/google/common/collect/testing/PerCollectionSizeTestSuiteBuilder.java
Removing symbols from file guava-testlib/src/com/google/common/collect/testing/TestSetGenerator.java
Removing symbols from file guava-testlib/src/com/google/common/collect/testing/TestContainerGenerator.java
Removing symbols from file guava-testlib/src/com/google/common/collect/testing/AbstractMapTester.java
Removing symbols from file guava-testlib/src/com/google/common/collect/testing/TestSortedSetGenerator.java
Removing symbols from file guava-testlib/src/com/google/common/collect/testing/SafeTreeMap.java
Removing symbols from file guava-testlib/src/com/google/common/collect/testing/TestIteratorGenerator.java
Removing symbols from file guava-testlib/src/com/google/common/collect/testing/TestCharacterListGenerator.java
Removing symbols from file guava-testlib/src/com/google/common/collect/testing/SortedSetTestSuiteBuilder.java
Removing symbols from file guava-testlib/src/com/google/common/collect/testing/package-info.java
Removing symbols from file guava-testlib/src/com/google/common/collect/testing/SortedMapTestSuiteBuilder.java
Removing symbols from file guava-testlib/src/com/google/common/util/concurrent/testing/AbstractListenableFutureTest.java
Removing symbols from file guava-testlib/src/com/google/common/util/concurrent/testing/MockFutureListener.java
Removing symbols from file guava-testlib/src/com/google/common/util/concurrent/testing/SameThreadScheduledExecutorService.java
Removing symbols from file guava-testlib/src/com/google/common/util/concurrent/testing/TestingExecutors.java
Removing symbols from file guava-testlib/src/com/google/common/escape/testing/package-info.java
Removing symbols from file guava-testlib/src/com/google/common/escape/testing/EscaperAsserts.java
Removing symbols from file guava-testlib/src/com/google/common/testing/SloppyTearDown.java
Removing symbols from file guava-testlib/src/com/google/common/testing/SerializableTester.java
Removing symbols from file guava-testlib/src/com/google/common/testing/RelationshipTester.java
Removing symbols from file guava-testlib/src/com/google/common/testing/TearDown.java
Removing symbols from file guava-testlib/src/com/google/common/testing/ClusterException.java
Removing symbols from file guava-testlib/src/com/google/common/testing/TearDownStack.java
Removing symbols from file guava-testlib/src/com/google/common/testing/TearDownAccepter.java
Removing symbols from file guava-testlib/src/com/google/common/testing/ForwardingWrapperTester.java
Removing symbols from file guava-testlib/src/com/google/common/testing/EquivalenceTester.java
Removing symbols from file guava-testlib/src/com/google/common/testing/TestLogHandler.java
Removing symbols from file guava-testlib/src/com/google/common/testing/GcFinalization.java
Removing symbols from file guava-testlib/src/com/google/common/testing/EqualsTester.java
Removing symbols from file guava-testlib/src/com/google/common/testing/AbstractPackageSanityTests.java
Removing symbols from file guava-testlib/src/com/google/common/testing/ClassSanityTester.java
Removing symbols from file guava-testlib/src/com/google/common/testing/Platform.java
Removing symbols from file guava-testlib/src/com/google/common/testing/ArbitraryInstances.java
Removing symbols from file guava-testlib/src/com/google/common/testing/DummyProxy.java
Removing symbols from file guava-testlib/src/com/google/common/testing/package-info.java
Removing symbols from file guava-testlib/src/com/google/common/testing/NullPointerTester.java
Removing symbols from file guava-testlib/src/com/google/common/testing/FakeTicker.java
Removing symbols from file guava-testlib/src/com/google/common/testing/CollectorTester.java
Removing symbols from file guava-testlib/test/com/google/common/collect/testing/ReserializedSafeTreeMapMapInterfaceTest.java
Removing symbols from file guava-testlib/test/com/google/common/collect/testing/SafeTreeSetTest.java
Removing symbols from file guava-testlib/test/com/google/common/collect/testing/HelpersTest.java
Removing symbols from file guava-testlib/test/com/google/common/collect/testing/IteratorTesterTest.java
Removing symbols from file guava-testlib/test/com/google/common/collect/testing/AndroidIncompatible.java
Removing symbols from file guava-testlib/test/com/google/common/collect/testing/SafeTreeMapTest.java
Removing symbols from file guava-testlib/test/com/google/common/collect/testing/MyTester.java
Removing symbols from file guava-testlib/test/com/google/common/collect/testing/features/AndroidIncompatible.java
Removing symbols from file guava-testlib/src/com/google/common/testing/FreshValueGenerator.java
Removing symbols from file guava-testlib/test/com/google/common/collect/testing/MinimalIterableTest.java
Removing symbols from file guava-testlib/test/com/google/common/testing/PackageSanityTests.java
Removing symbols from file guava-testlib/test/com/google/common/testing/AbstractPackageSanityTestsTest.java
Removing symbols from file guava-testlib/test/com/google/common/testing/RelationshipTesterTest.java
Removing symbols from file guava-testlib/test/com/google/common/collect/testing/features/FeatureUtilTest.java
Removing symbols from file guava-testlib/test/com/google/common/testing/EquivalenceTesterTest.java
Removing symbols from file guava-testlib/test/com/google/common/collect/testing/MapTestSuiteBuilderTests.java
Removing symbols from file guava-testlib/test/com/google/common/testing/FakeTickerTest.java
Removing symbols from file guava-testlib/test/com/google/common/testing/TearDownStackTest.java
Removing symbols from file guava-testlib/test/com/google/common/testing/EqualsTesterTest.java
Removing symbols from file guava-testlib/test/com/google/common/testing/SerializableTesterTest.java
Removing symbols from file guava-testlib/test/com/google/common/testing/AndroidIncompatible.java
Removing symbols from file guava-testlib/test/com/google/common/testing/TestLogHandlerTest.java
Removing symbols from file guava-testlib/test/com/google/common/testing/ReflectionFreeAssertThrows.java
Removing symbols from file guava-testlib/test/com/google/common/testing/GcFinalizationTest.java
Removing symbols from file guava-testlib/test/com/google/common/testing/anotherpackage/ForwardingWrapperTesterTest.java
Removing symbols from file guava-testlib/test/com/google/common/testing/NullPointerTesterTest.java
Removing symbols from file guava-testlib/test/com/google/common/testing/ArbitraryInstancesTest.java
Removing symbols from file guava-testlib/test/com/google/common/testing/FreshValueGeneratorTest.java
Removing symbols from file guava-testlib/test/com/google/common/testing/ClassSanityTesterTest.java
+ /usr/bin/python3 /usr/share/java-utils/mvn_package.py com.google.guava:failureaccess guava
+ /usr/bin/python3 /usr/share/java-utils/mvn_package.py com.google.guava:guava-bom __noinstall
+ RPM_EC=0
++ jobs -p
+ exit 0
Executing(%build): /bin/sh -e /home/iurt/rpmbuild/tmp/rpm-tmp.UpmHx8
+ umask 022
+ cd /home/iurt/rpmbuild/BUILD/guava-33.5.0-build
+ CFLAGS='-O2 -g -pipe -Wformat -Werror=format-security -Wp,-U_FORTIFY_SOURCE,-D_FORTIFY_SOURCE=3 -specs=/usr/lib/rpm/redhat/redhat-hardened-cc1 -fstack-protector-strong -m64 -fasynchronous-unwind-tables -fstack-clash-protection -fcf-protection=full'
+ export CFLAGS
+ CXXFLAGS='-O2 -g -pipe -Wformat -Werror=format-security -Wp,-U_FORTIFY_SOURCE,-D_FORTIFY_SOURCE=3 -specs=/usr/lib/rpm/redhat/redhat-hardened-cc1 -fstack-protector-strong -m64 -fasynchronous-unwind-tables -fstack-clash-protection -fcf-protection=full'
+ export CXXFLAGS
+ FFLAGS='-O2 -g -pipe -Wformat -Werror=format-security -Wp,-U_FORTIFY_SOURCE,-D_FORTIFY_SOURCE=3 -specs=/usr/lib/rpm/redhat/redhat-hardened-cc1 -fstack-protector-strong -m64 -fasynchronous-unwind-tables -fstack-clash-protection -fcf-protection=full '
+ export FFLAGS
+ FCFLAGS='-O2 -g -pipe -Wformat -Werror=format-security -Wp,-U_FORTIFY_SOURCE,-D_FORTIFY_SOURCE=3 -specs=/usr/lib/rpm/redhat/redhat-hardened-cc1 -fstack-protector-strong -m64 -fasynchronous-unwind-tables -fstack-clash-protection -fcf-protection=full '
+ export FCFLAGS
+ VALAFLAGS=-g
+ export VALAFLAGS
+ RUSTFLAGS='-Copt-level=3 -Cdebuginfo=2 -Ccodegen-units=1 -Cstrip=none --cap-lints=warn'
+ export RUSTFLAGS
+ LDFLAGS='-Wl,--as-needed -Wl,--no-undefined -Wl,-z,relro -Wl,-z,now -Wl,-O1 -Wl,--build-id=sha1 -Wl,--enable-new-dtags -specs=/usr/lib/rpm/redhat/redhat-hardened-ld'
+ export LDFLAGS
+ LT_SYS_LIBRARY_PATH=/usr/lib:
+ export LT_SYS_LIBRARY_PATH
+ CC=gcc
+ export CC
+ CXX=g++
+ export CXX
+ cd guava-33.5.0
+ '[' 1 -eq 1 ']'
+ '[' 1 -eq 1 ']'
+ PATH=/usr/libexec/javapackages-bootstrap:/usr/lib/jvm/java-25-openjdk/bin:/usr/local/bin:/usr/bin:/usr/local/sbin:/usr/sbin:/home/iurt/.local/bin:/home/iurt/bin
+ /usr/bin/python3 /usr/share/java-utils/mvn_build.py --xmvn-javadoc -j -s -f
Executing: xmvn --batch-mode --offline -Dmaven.test.skip=true package org.fedoraproject.xmvn:xmvn-mojo:install org.fedoraproject.xmvn:xmvn-mojo:builddep
['xmvn', '--batch-mode', '--offline', '-Dmaven.test.skip=true', 'package', 'org.fedoraproject.xmvn:xmvn-mojo:install', 'org.fedoraproject.xmvn:xmvn-mojo:builddep']
WARNING: A terminally deprecated method in sun.misc.Unsafe has been called
WARNING: sun.misc.Unsafe::objectFieldOffset has been called by com.google.common.util.concurrent.AbstractFuture$UnsafeAtomicHelper (file:/usr/share/javapackages-bootstrap/lib/guava.jar)
WARNING: Please consider reporting this to the maintainers of class com.google.common.util.concurrent.AbstractFuture$UnsafeAtomicHelper
WARNING: sun.misc.Unsafe::objectFieldOffset will be removed in a future release
[INFO] Scanning for projects...
[INFO] ------------------------------------------------------------------------
[INFO] Reactor Build Order:
[INFO]
[INFO] Guava Maven Parent [pom]
[INFO] Guava InternalFutureFailureAccess and InternalFutures [jar]
[INFO] Guava: Google Core Libraries for Java [bundle]
[INFO] Guava BOM [pom]
[INFO] Guava Testing Library [jar]
[INFO]
[INFO] -------------------< com.google.guava:guava-parent >--------------------
[INFO] Building Guava Maven Parent 33.5.0-jre [1/5]
[INFO] from pom.xml
[INFO] --------------------------------[ pom ]---------------------------------
[INFO] Copying com.google.guava:guava-parent:pom:33.5.0-jre to project local repository
[INFO] Copying com.google.guava:guava-parent:pom:consumer:33.5.0-jre to project local repository
[INFO]
[INFO] -------------------< com.google.guava:failureaccess >-------------------
[INFO] Building Guava InternalFutureFailureAccess and InternalFutures 1.0.3 [2/5]
[INFO] from futures/failureaccess/pom.xml
[INFO] --------------------------------[ jar ]---------------------------------
[INFO]
[INFO] --- org.apache.maven.plugins:maven-resources-plugin:3.3.1.MBI:resources (default-resources) @ failureaccess ---
[INFO] Copying 0 resource from .. to target/classes
[INFO]
[INFO] --- org.apache.maven.plugins:maven-compiler-plugin:3.12.1.MBI:compile (default-compile) @ failureaccess ---
[INFO] Recompiling the module because of changed source code.
[INFO] Compiling 2 source files with javac [forked debug parameters release 8] to target/classes
[WARNING] Unable to autodetect 'javac' path, using 'javac' from the environment.
[WARNING] [options] source value 8 is obsolete and will be removed in a future release
[WARNING] [options] target value 8 is obsolete and will be removed in a future release
[WARNING] [options] To suppress warnings about obsolete options, use -Xlint:-options.
[INFO]
[INFO] --- org.apache.maven.plugins:maven-compiler-plugin:3.12.1.MBI:compile (compile-java9) @ failureaccess ---
[INFO] Recompiling the module because of changed dependency.
[INFO] Compiling 3 source files with javac [forked debug parameters release 9] to target/classes/META-INF/versions/9
[WARNING] Unable to autodetect 'javac' path, using 'javac' from the environment.
[INFO] JDK-8318913 workaround: patched module-info.class requires version from [9] to [9] on 1 JDK modules [java.base]
[WARNING] [options] module name in --add-reads option not found: com.google.common
[INFO]
[INFO] --- org.apache.felix:maven-bundle-plugin:5.1.9.MBI:manifest (bundle-manifest) @ failureaccess ---
[INFO] No MANIFEST.MF file found, generating manifest.
[INFO] Writing manifest: /home/iurt/rpmbuild/BUILD/guava-33.5.0-build/guava-33.5.0/futures/failureaccess/target/classes/META-INF/MANIFEST.MF
[INFO]
[INFO] --- org.apache.maven.plugins:maven-resources-plugin:3.3.1.MBI:testResources (default-testResources) @ failureaccess ---
[INFO] Not copying test resources
[INFO]
[INFO] --- org.apache.maven.plugins:maven-compiler-plugin:3.12.1.MBI:testCompile (default-testCompile) @ failureaccess ---
[INFO] Not compiling test sources
[INFO]
[INFO] --- org.apache.maven.plugins:maven-surefire-plugin:3.2.2.MBI:test (default-test) @ failureaccess ---
[INFO] Tests are skipped.
[INFO]
[INFO] --- org.apache.maven.plugins:maven-jar-plugin:3.3.0.MBI:jar (default-jar) @ failureaccess ---
[INFO] Building jar: /home/iurt/rpmbuild/BUILD/guava-33.5.0-build/guava-33.5.0/futures/failureaccess/target/failureaccess-1.0.3.jar
[INFO] Copying com.google.guava:failureaccess:pom:1.0.3 to project local repository
[INFO] Copying com.google.guava:failureaccess:jar:1.0.3 to project local repository
[INFO] Copying com.google.guava:failureaccess:pom:consumer:1.0.3 to project local repository
[INFO]
[INFO] -----------------------< com.google.guava:guava >-----------------------
[INFO] Building Guava: Google Core Libraries for Java 33.5.0-jre [3/5]
[INFO] from guava/pom.xml
[INFO] -------------------------------[ bundle ]-------------------------------
[INFO]
[INFO] --- org.apache.maven.plugins:maven-resources-plugin:3.3.1.MBI:resources (default-resources) @ guava ---
[INFO] Copying 7 resources from .. to target/classes
[INFO]
[INFO] --- org.apache.maven.plugins:maven-compiler-plugin:3.12.1.MBI:compile (default-compile) @ guava ---
[INFO] Recompiling the module because of changed dependency.
[INFO] Compiling 606 source files with javac [forked debug parameters target 1.8] to target/classes
[WARNING] Unable to autodetect 'javac' path, using 'javac' from the environment.
[INFO]
[INFO] --- org.apache.maven.plugins:maven-compiler-plugin:3.12.1.MBI:compile (compile-java9) @ guava ---
[INFO] Recompiling the module because of changed dependency.
[INFO] Compiling 1 source file with javac [forked debug parameters release 9 module-path] to target/classes/META-INF/versions/9
[WARNING] Unable to autodetect 'javac' path, using 'javac' from the environment.
[INFO] -------------------------------------------------------------
[ERROR] COMPILATION ERROR :
[INFO] -------------------------------------------------------------
[ERROR] /home/iurt/rpmbuild/BUILD/guava-33.5.0-build/guava-33.5.0/guava/src/module-info.java:[22,39] error: module not found: com.google.errorprone.annotations
[ERROR] /home/iurt/rpmbuild/BUILD/guava-33.5.0-build/guava-33.5.0/guava/src/module-info.java:[23,35] error: module not found: com.google.j2objc.annotations
[ERROR] /home/iurt/rpmbuild/BUILD/guava-33.5.0-build/guava-33.5.0/guava/src/module-info.java:[24,21] error: module not found: org.jspecify
[INFO] 3 errors
[INFO] -------------------------------------------------------------
[INFO]
[INFO] ------------------------------------------------------------------------
[INFO] Skipping Guava Maven Parent
[INFO] Guava Maven Parent was not built because a module it depends on failed to build.
[INFO] ------------------------------------------------------------------------
[INFO] ------------------------------------------------------------------------
[INFO] Reactor Summary:
[INFO]
[INFO] Guava Maven Parent 33.5.0-jre ...................... SUCCESS [ 0.021 s]
[INFO] Guava InternalFutureFailureAccess and InternalFutures 1.0.3 SUCCESS [ 3.626 s]
[INFO] Guava: Google Core Libraries for Java 33.5.0-jre ... FAILURE [ 15.262 s]
[INFO] Guava BOM 33.5.0-jre ............................... SKIPPED
[INFO] Guava Testing Library 33.5.0-jre ................... SKIPPED
[INFO] ------------------------------------------------------------------------
[INFO] BUILD FAILURE
[INFO] ------------------------------------------------------------------------
[INFO] Total time: 20.293 s
[INFO] Finished at: 2026-09-22T13:39:51Z
[INFO] ------------------------------------------------------------------------
[ERROR] Failed to execute goal org.apache.maven.plugins:maven-compiler-plugin:3.12.1.MBI:compile (compile-java9) on project guava: Compilation failure: Compilation failure:
[ERROR] /home/iurt/rpmbuild/BUILD/guava-33.5.0-build/guava-33.5.0/guava/src/module-info.java:[22,39] error: module not found: com.google.errorprone.annotations
[ERROR] /home/iurt/rpmbuild/BUILD/guava-33.5.0-build/guava-33.5.0/guava/src/module-info.java:[23,35] error: module not found: com.google.j2objc.annotations
[ERROR] /home/iurt/rpmbuild/BUILD/guava-33.5.0-build/guava-33.5.0/guava/src/module-info.java:[24,21] error: module not found: org.jspecify
[ERROR] -> [Help 1]
[ERROR]
[ERROR] To see the full stack trace of the errors, re-run Maven with the '-e' switch
[ERROR] Re-run Maven using the '-X' switch to enable verbose output
[ERROR]
[ERROR] For more information about the errors and possible solutions, please read the following articles:
[ERROR] [Help 1] http://cwiki.apache.org/confluence/display/MAVEN/CompilationFailureException
[ERROR]
[ERROR] After correcting the problems, you can resume the build with the command
[ERROR] mvn [args] -r
error: Bad exit status from /home/iurt/rpmbuild/tmp/rpm-tmp.UpmHx8 (%build)
RPM build errors:
Bad exit status from /home/iurt/rpmbuild/tmp/rpm-tmp.UpmHx8 (%build)
I: [iurt_root_command] ERROR: chroot
I: [iurt] [iurt] --------------- end of command output ---------------
D: [iurt] [iurt] clean chroot
D: [iurt_root_command] Running iurt_root_command --netns_delete /home/iurt/chroot_tmp/iurt/chroot_cauldron.x86_64.0.20260922133902
D: [iurt_root_command] Delete network namespace for given chroot, killing all processes
D: [iurt_root_command] Success!
D: [iurt_root_command] Running iurt_root_command --umount /home/iurt/chroot_tmp/iurt/chroot_cauldron.x86_64.0.20260922133902/proc
D: [iurt_root_command] Unmounting
D: [iurt_root_command] Success!
D: [iurt_root_command] Running iurt_root_command --umount /home/iurt/chroot_tmp/iurt/chroot_cauldron.x86_64.0.20260922133902/dev/pts
D: [iurt_root_command] Unmounting
D: [iurt_root_command] Success!
D: [iurt_root_command] Running iurt_root_command --umount /home/iurt/chroot_tmp/iurt/chroot_cauldron.x86_64.0.20260922133902/dev/shm
D: [iurt_root_command] Unmounting
D: [iurt_root_command] Success!
[iurt] [iurt] cleaning /home/iurt/chroot_tmp/iurt/chroot_cauldron.x86_64.0.20260922133902
[iurt] [iurt] removing /home/iurt/chroot_tmp/iurt/chroot_cauldron.x86_64.0.20260922133902
D: [iurt_root_command] Running iurt_root_command --rm -r /home/iurt/chroot_tmp/iurt/chroot_cauldron.x86_64.0.20260922133902
D: [iurt_root_command] Removing files