D: [iurt_root_command] chroot
Building target platforms: noarch
Building for target noarch
warning: /home/pterjan/rpmbuild/SPECS/slof.spec line 56: autopatch: no matching patches in range
Installing /home/pterjan/rpmbuild/SRPMS/slof-0.1.git20210217-6.mga10.src.rpm
Executing(%mkbuilddir): /bin/sh -e /home/pterjan/rpmbuild/tmp/rpm-tmp.410b0m
Executing(%prep): /bin/sh -e /home/pterjan/rpmbuild/tmp/rpm-tmp.ob3D5F
+ umask 022
+ cd /home/pterjan/rpmbuild/BUILD/slof-0.1.git20210217-build
+ '[' 1 -eq 1 ']'
+ '[' 1 -eq 1 ']'
+ '[' 1 -eq 1 ']'
+ cd /home/pterjan/rpmbuild/BUILD/slof-0.1.git20210217-build
+ rm -rf SLOF-qemu-slof-20210217
+ /usr/lib/rpm/rpmuncompress -x /home/pterjan/rpmbuild/SOURCES/qemu-slof-20210217.tar.gz
+ STATUS=0
+ '[' 0 -ne 0 ']'
+ cd SLOF-qemu-slof-20210217
+ /usr/bin/chmod -Rf a+rX,u+w,g-w,o-w .
+ RPM_EC=0
++ jobs -p
+ exit 0
Executing(%build): /bin/sh -e /home/pterjan/rpmbuild/tmp/rpm-tmp.wv2xRs
+ umask 022
+ cd /home/pterjan/rpmbuild/BUILD/slof-0.1.git20210217-build
+ CFLAGS='-O2 -g -pipe -Wformat -Werror=format-security -Wp,-U_FORTIFY_SOURCE,-D_FORTIFY_SOURCE=3 -specs=/usr/lib/rpm/redhat/redhat-hardened-cc1 -fstack-protector-strong -m64 -fasynchronous-unwind-tables -fstack-clash-protection -fcf-protection=full'
+ export CFLAGS
+ CXXFLAGS='-O2 -g -pipe -Wformat -Werror=format-security -Wp,-U_FORTIFY_SOURCE,-D_FORTIFY_SOURCE=3 -specs=/usr/lib/rpm/redhat/redhat-hardened-cc1 -fstack-protector-strong -m64 -fasynchronous-unwind-tables -fstack-clash-protection -fcf-protection=full'
+ export CXXFLAGS
+ FFLAGS='-O2 -g -pipe -Wformat -Werror=format-security -Wp,-U_FORTIFY_SOURCE,-D_FORTIFY_SOURCE=3 -specs=/usr/lib/rpm/redhat/redhat-hardened-cc1 -fstack-protector-strong -m64 -fasynchronous-unwind-tables -fstack-clash-protection -fcf-protection=full '
+ export FFLAGS
+ FCFLAGS='-O2 -g -pipe -Wformat -Werror=format-security -Wp,-U_FORTIFY_SOURCE,-D_FORTIFY_SOURCE=3 -specs=/usr/lib/rpm/redhat/redhat-hardened-cc1 -fstack-protector-strong -m64 -fasynchronous-unwind-tables -fstack-clash-protection -fcf-protection=full '
+ export FCFLAGS
+ VALAFLAGS=-g
+ export VALAFLAGS
+ RUSTFLAGS='-Copt-level=3 -Cdebuginfo=2 -Ccodegen-units=1 -Cstrip=none --cap-lints=warn'
+ export RUSTFLAGS
+ LDFLAGS='-Wl,--as-needed -Wl,--no-undefined -Wl,-z,relro -Wl,-z,now -Wl,-O1 -Wl,--build-id=sha1 -Wl,--enable-new-dtags -specs=/usr/lib/rpm/redhat/redhat-hardened-ld'
+ export LDFLAGS
+ LT_SYS_LIBRARY_PATH=/usr/lib:
+ export LT_SYS_LIBRARY_PATH
+ CC=gcc
+ export CC
+ CXX=g++
+ export CXX
+ cd SLOF-qemu-slof-20210217
+ '[' 1 -eq 1 ']'
+ '[' 1 -eq 1 ']'
+ export CROSS=powerpc64-linux-gnu-
+ CROSS=powerpc64-linux-gnu-
+ /usr/bin/make -O -j16 V=1 VERBOSE=1 qemu V=2
******** Building qemu system ********
/usr/bin/make -C ../tools
/usr/bin/make -C ../romfs/tools BOARD=qemu PLATFORM= FLAG="-DRTAS_NVRAM -DBROKEN_SC1 -DDHCPARCH=0x0C " TARG=ppc64
make[2]: Entering directory '/home/pterjan/rpmbuild/BUILD/slof-0.1.git20210217-build/SLOF-qemu-slof-20210217/tools'
gcc -W -g -Wall -W -O2 -I. -I../include -I../romfs/tools -c gen_reloc_table.c
make[2]: Leaving directory '/home/pterjan/rpmbuild/BUILD/slof-0.1.git20210217-build/SLOF-qemu-slof-20210217/tools'
make[2]: Entering directory '/home/pterjan/rpmbuild/BUILD/slof-0.1.git20210217-build/SLOF-qemu-slof-20210217/tools'
gcc -W -g -Wall -W -O2 -I. -I../include -I../romfs/tools -c ../romfs/tools/crclib.c -o crclib.o
make[2]: Leaving directory '/home/pterjan/rpmbuild/BUILD/slof-0.1.git20210217-build/SLOF-qemu-slof-20210217/tools'
make[2]: Entering directory '/home/pterjan/rpmbuild/BUILD/slof-0.1.git20210217-build/SLOF-qemu-slof-20210217/tools'
gcc -g -Wall -W -O2 -I. -I../include -I../romfs/tools -o gen_reloc_table gen_reloc_table.o
make[2]: Leaving directory '/home/pterjan/rpmbuild/BUILD/slof-0.1.git20210217-build/SLOF-qemu-slof-20210217/tools'
make[2]: Entering directory '/home/pterjan/rpmbuild/BUILD/slof-0.1.git20210217-build/SLOF-qemu-slof-20210217/tools'
gcc -W -g -Wall -W -O2 -I. -I../include -I../romfs/tools -c sloffs.c
make[2]: Leaving directory '/home/pterjan/rpmbuild/BUILD/slof-0.1.git20210217-build/SLOF-qemu-slof-20210217/tools'
make[2]: Entering directory '/home/pterjan/rpmbuild/BUILD/slof-0.1.git20210217-build/SLOF-qemu-slof-20210217/tools'
gcc -g -Wall -W -O2 -I. -I../include -I../romfs/tools -o sloffs sloffs.o crclib.o
make[2]: Leaving directory '/home/pterjan/rpmbuild/BUILD/slof-0.1.git20210217-build/SLOF-qemu-slof-20210217/tools'
make[2]: Entering directory '/home/pterjan/rpmbuild/BUILD/slof-0.1.git20210217-build/SLOF-qemu-slof-20210217/romfs/tools'
gcc -MM -I/home/pterjan/rpmbuild/BUILD/slof-0.1.git20210217-build/SLOF-qemu-slof-20210217/include -I/home/pterjan/rpmbuild/BUILD/slof-0.1.git20210217-build/SLOF-qemu-slof-20210217/board-qemu/include -I. -g -Wall -W -O2 -I. -I../include build_ffs.c cfg_parse.c create_flash.c create_crc.c crclib.c > Makefile.dep
make[2]: Leaving directory '/home/pterjan/rpmbuild/BUILD/slof-0.1.git20210217-build/SLOF-qemu-slof-20210217/romfs/tools'
make[1]: Entering directory '/home/pterjan/rpmbuild/BUILD/slof-0.1.git20210217-build/SLOF-qemu-slof-20210217/board-qemu'
 ====== Building common libraries ======
make[1]: Leaving directory '/home/pterjan/rpmbuild/BUILD/slof-0.1.git20210217-build/SLOF-qemu-slof-20210217/board-qemu'
/usr/bin/make -C /home/pterjan/rpmbuild/BUILD/slof-0.1.git20210217-build/SLOF-qemu-slof-20210217/lib libc libbootmsg libbases libnvram libelf libhvcall libvirtio libusb libveth libe1k libnet libbootmenu libtpm
/usr/bin/make -C libc FLAG="-DRTAS_NVRAM -DBROKEN_SC1 -DDHCPARCH=0x0C " 
/usr/bin/make -C libbootmsg FLAG="-DRTAS_NVRAM -DBROKEN_SC1 -DDHCPARCH=0x0C " 
/usr/bin/make -C libbases FLAG="-DRTAS_NVRAM -DBROKEN_SC1 -DDHCPARCH=0x0C " 
/usr/bin/make -C libnvram FLAG="-DRTAS_NVRAM -DBROKEN_SC1 -DDHCPARCH=0x0C " 
/usr/bin/make -C libelf FLAG="-DRTAS_NVRAM -DBROKEN_SC1 -DDHCPARCH=0x0C " 
/usr/bin/make -C libhvcall FLAG="-DRTAS_NVRAM -DBROKEN_SC1 -DDHCPARCH=0x0C " 
/usr/bin/make -C libvirtio FLAG="-DRTAS_NVRAM -DBROKEN_SC1 -DDHCPARCH=0x0C " 
/usr/bin/make -C libusb FLAG="-DRTAS_NVRAM -DBROKEN_SC1 -DDHCPARCH=0x0C " 
/usr/bin/make -C libveth FLAG="-DRTAS_NVRAM -DBROKEN_SC1 -DDHCPARCH=0x0C " 
/usr/bin/make -C libe1k FLAG="-DRTAS_NVRAM -DBROKEN_SC1 -DDHCPARCH=0x0C " 
/usr/bin/make -C libnet FLAG="-DRTAS_NVRAM -DBROKEN_SC1 -DDHCPARCH=0x0C " 
make[3]: Nothing to be done for 'all'.
/usr/bin/make -C libbootmenu FLAG="-DRTAS_NVRAM -DBROKEN_SC1 -DDHCPARCH=0x0C " 
make[3]: Entering directory '/home/pterjan/rpmbuild/BUILD/slof-0.1.git20210217-build/SLOF-qemu-slof-20210217/lib/libbootmsg'
powerpc64-linux-gnu-gcc -m64  -MM -I../libc/include -DCPU_PPCP7 -I/home/pterjan/rpmbuild/BUILD/slof-0.1.git20210217-build/SLOF-qemu-slof-20210217/board-qemu/include -I. -I../../include -O2 -g -pipe -Wformat -Werror=format-security -Wp,-U_FORTIFY_SOURCE,-D_FORTIFY_SOURCE=3 -specs=/usr/lib/rpm/redhat/redhat-hardened-cc1 -fstack-protector-strong -m64 -fasynchronous-unwind-tables -fstack-clash-protection -fcf-protection=full  bootmsg_lvl.S > Makefile.dep
cc1: error: '-fcf-protection=full' is not supported for this target
make[3]: Leaving directory '/home/pterjan/rpmbuild/BUILD/slof-0.1.git20210217-build/SLOF-qemu-slof-20210217/lib/libbootmsg'
make[3]: Entering directory '/home/pterjan/rpmbuild/BUILD/slof-0.1.git20210217-build/SLOF-qemu-slof-20210217/lib/libe1k'
powerpc64-linux-gnu-gcc -m64  -M -I../libc/include -DCPU_PPCP7 -I/home/pterjan/rpmbuild/BUILD/slof-0.1.git20210217-build/SLOF-qemu-slof-20210217/board-qemu/include -I/home/pterjan/rpmbuild/BUILD/slof-0.1.git20210217-build/SLOF-qemu-slof-20210217/include -I/home/pterjan/rpmbuild/BUILD/slof-0.1.git20210217-build/SLOF-qemu-slof-20210217/include/ppcp7 -O2 -g -pipe -Wformat -Werror=format-security -Wp,-U_FORTIFY_SOURCE,-D_FORTIFY_SOURCE=3 -specs=/usr/lib/rpm/redhat/redhat-hardened-cc1 -fstack-protector-strong -m64 -fasynchronous-unwind-tables -fstack-clash-protection -fcf-protection=full e1k.c  > Makefile.dep
cc1: error: '-fcf-protection=full' is not supported for this target
make[3]: Leaving directory '/home/pterjan/rpmbuild/BUILD/slof-0.1.git20210217-build/SLOF-qemu-slof-20210217/lib/libe1k'
make[3]: Entering directory '/home/pterjan/rpmbuild/BUILD/slof-0.1.git20210217-build/SLOF-qemu-slof-20210217/lib/libveth'
powerpc64-linux-gnu-gcc -m64  -M -I../libc/include -DCPU_PPCP7 -I/home/pterjan/rpmbuild/BUILD/slof-0.1.git20210217-build/SLOF-qemu-slof-20210217/board-qemu/include -I/home/pterjan/rpmbuild/BUILD/slof-0.1.git20210217-build/SLOF-qemu-slof-20210217/include -I/home/pterjan/rpmbuild/BUILD/slof-0.1.git20210217-build/SLOF-qemu-slof-20210217/include/ppcp7 -I../libhvcall -O2 -g -pipe -Wformat -Werror=format-security -Wp,-U_FORTIFY_SOURCE,-D_FORTIFY_SOURCE=3 -specs=/usr/lib/rpm/redhat/redhat-hardened-cc1 -fstack-protector-strong -m64 -fasynchronous-unwind-tables -fstack-clash-protection -fcf-protection=full veth.c  > Makefile.dep
cc1: error: '-fcf-protection=full' is not supported for this target
make[3]: Leaving directory '/home/pterjan/rpmbuild/BUILD/slof-0.1.git20210217-build/SLOF-qemu-slof-20210217/lib/libveth'
make[3]: *** No rule to make target 'Makefile.dep', needed by 'all'.  Stop.
make[3]: *** Waiting for unfinished jobs....
make[3]: Entering directory '/home/pterjan/rpmbuild/BUILD/slof-0.1.git20210217-build/SLOF-qemu-slof-20210217/lib/libnvram'
powerpc64-linux-gnu-gcc -m64  -MM -I../libc/include -DCPU_PPCP7 -DRTAS_NVRAM -DBROKEN_SC1 -DDHCPARCH=0x0C  -I/home/pterjan/rpmbuild/BUILD/slof-0.1.git20210217-build/SLOF-qemu-slof-20210217/board-qemu/include -I/home/pterjan/rpmbuild/BUILD/slof-0.1.git20210217-build/SLOF-qemu-slof-20210217/include/ppcp7 -I. -I../../include -O2 -g -pipe -Wformat -Werror=format-security -Wp,-U_FORTIFY_SOURCE,-D_FORTIFY_SOURCE=3 -specs=/usr/lib/rpm/redhat/redhat-hardened-cc1 -fstack-protector-strong -m64 -fasynchronous-unwind-tables -fstack-clash-protection -fcf-protection=full nvram.c envvar.c > Makefile.dep
cc1: error: '-fcf-protection=full' is not supported for this target
cc1: error: '-fcf-protection=full' is not supported for this target
make[3]: Leaving directory '/home/pterjan/rpmbuild/BUILD/slof-0.1.git20210217-build/SLOF-qemu-slof-20210217/lib/libnvram'
make[3]: Entering directory '/home/pterjan/rpmbuild/BUILD/slof-0.1.git20210217-build/SLOF-qemu-slof-20210217/lib/libbootmenu'
powerpc64-linux-gnu-gcc -m64  -M  -O2 -g -pipe -Wformat -Werror=format-security -Wp,-U_FORTIFY_SOURCE,-D_FORTIFY_SOURCE=3 -specs=/usr/lib/rpm/redhat/redhat-hardened-cc1 -fstack-protector-strong -m64 -fasynchronous-unwind-tables -fstack-clash-protection -fcf-protection=full -I. -I.. -I../libc/include -I/home/pterjan/rpmbuild/BUILD/slof-0.1.git20210217-build/SLOF-qemu-slof-20210217/slof -I/home/pterjan/rpmbuild/BUILD/slof-0.1.git20210217-build/SLOF-qemu-slof-20210217/include bootmenu.c > Makefile.dep
cc1: error: '-fcf-protection=full' is not supported for this target
make[3]: Leaving directory '/home/pterjan/rpmbuild/BUILD/slof-0.1.git20210217-build/SLOF-qemu-slof-20210217/lib/libbootmenu'
make[3]: Entering directory '/home/pterjan/rpmbuild/BUILD/slof-0.1.git20210217-build/SLOF-qemu-slof-20210217/lib/libhvcall'
powerpc64-linux-gnu-gcc -m64  -M -I../libc/include -DCPU_PPCP7 -I/home/pterjan/rpmbuild/BUILD/slof-0.1.git20210217-build/SLOF-qemu-slof-20210217/board-qemu/include -I/home/pterjan/rpmbuild/BUILD/slof-0.1.git20210217-build/SLOF-qemu-slof-20210217/include -I/home/pterjan/rpmbuild/BUILD/slof-0.1.git20210217-build/SLOF-qemu-slof-20210217/include/ppcp7 -O2 -g -pipe -Wformat -Werror=format-security -Wp,-U_FORTIFY_SOURCE,-D_FORTIFY_SOURCE=3 -specs=/usr/lib/rpm/redhat/redhat-hardened-cc1 -fstack-protector-strong -m64 -fasynchronous-unwind-tables -fstack-clash-protection -fcf-protection=full brokensc1.c rfill.c hvcall.S > Makefile.dep
cc1: error: '-fcf-protection=full' is not supported for this target
cc1: error: '-fcf-protection=full' is not supported for this target
cc1: error: '-fcf-protection=full' is not supported for this target
make[3]: Leaving directory '/home/pterjan/rpmbuild/BUILD/slof-0.1.git20210217-build/SLOF-qemu-slof-20210217/lib/libhvcall'
make[3]: Entering directory '/home/pterjan/rpmbuild/BUILD/slof-0.1.git20210217-build/SLOF-qemu-slof-20210217/lib/libelf'
powerpc64-linux-gnu-gcc -m64  -MM -I../libc/include -DCPU_PPCP7 -I/home/pterjan/rpmbuild/BUILD/slof-0.1.git20210217-build/SLOF-qemu-slof-20210217/include -I/home/pterjan/rpmbuild/BUILD/slof-0.1.git20210217-build/SLOF-qemu-slof-20210217/include/ppcp7 -O2 -g -pipe -Wformat -Werror=format-security -Wp,-U_FORTIFY_SOURCE,-D_FORTIFY_SOURCE=3 -specs=/usr/lib/rpm/redhat/redhat-hardened-cc1 -fstack-protector-strong -m64 -fasynchronous-unwind-tables -fstack-clash-protection -fcf-protection=full elf.c elf32.c elf64.c elf_claim.c > Makefile.dep
cc1: error: '-fcf-protection=full' is not supported for this target
cc1: error: '-fcf-protection=full' is not supported for this target
cc1: error: '-fcf-protection=full' is not supported for this target
cc1: error: '-fcf-protection=full' is not supported for this target
make[3]: Leaving directory '/home/pterjan/rpmbuild/BUILD/slof-0.1.git20210217-build/SLOF-qemu-slof-20210217/lib/libelf'
make[3]: Entering directory '/home/pterjan/rpmbuild/BUILD/slof-0.1.git20210217-build/SLOF-qemu-slof-20210217/lib/libveth'
powerpc64-linux-gnu-gcc -m64  -I../libc/include -DCPU_PPCP7 -I/home/pterjan/rpmbuild/BUILD/slof-0.1.git20210217-build/SLOF-qemu-slof-20210217/board-qemu/include -I/home/pterjan/rpmbuild/BUILD/slof-0.1.git20210217-build/SLOF-qemu-slof-20210217/include -I/home/pterjan/rpmbuild/BUILD/slof-0.1.git20210217-build/SLOF-qemu-slof-20210217/include/ppcp7 -I../libhvcall -O2 -g -pipe -Wformat -Werror=format-security -Wp,-U_FORTIFY_SOURCE,-D_FORTIFY_SOURCE=3 -specs=/usr/lib/rpm/redhat/redhat-hardened-cc1 -fstack-protector-strong -m64 -fasynchronous-unwind-tables -fstack-clash-protection -fcf-protection=full -o veth.o -c /home/pterjan/rpmbuild/BUILD/slof-0.1.git20210217-build/SLOF-qemu-slof-20210217/lib/libveth/veth.c
cc1: error: '-fcf-protection=full' is not supported for this target
make[3]: *** [/home/pterjan/rpmbuild/BUILD/slof-0.1.git20210217-build/SLOF-qemu-slof-20210217/make.rules:55: veth.o] Error 1
make[3]: Leaving directory '/home/pterjan/rpmbuild/BUILD/slof-0.1.git20210217-build/SLOF-qemu-slof-20210217/lib/libveth'
make[3]: Entering directory '/home/pterjan/rpmbuild/BUILD/slof-0.1.git20210217-build/SLOF-qemu-slof-20210217/lib/libe1k'
powerpc64-linux-gnu-gcc -m64  -I../libc/include -DCPU_PPCP7 -I/home/pterjan/rpmbuild/BUILD/slof-0.1.git20210217-build/SLOF-qemu-slof-20210217/board-qemu/include -I/home/pterjan/rpmbuild/BUILD/slof-0.1.git20210217-build/SLOF-qemu-slof-20210217/include -I/home/pterjan/rpmbuild/BUILD/slof-0.1.git20210217-build/SLOF-qemu-slof-20210217/include/ppcp7 -O2 -g -pipe -Wformat -Werror=format-security -Wp,-U_FORTIFY_SOURCE,-D_FORTIFY_SOURCE=3 -specs=/usr/lib/rpm/redhat/redhat-hardened-cc1 -fstack-protector-strong -m64 -fasynchronous-unwind-tables -fstack-clash-protection -fcf-protection=full -o e1k.o -c /home/pterjan/rpmbuild/BUILD/slof-0.1.git20210217-build/SLOF-qemu-slof-20210217/lib/libe1k/e1k.c
cc1: error: '-fcf-protection=full' is not supported for this target
make[3]: *** [/home/pterjan/rpmbuild/BUILD/slof-0.1.git20210217-build/SLOF-qemu-slof-20210217/make.rules:55: e1k.o] Error 1
make[3]: Leaving directory '/home/pterjan/rpmbuild/BUILD/slof-0.1.git20210217-build/SLOF-qemu-slof-20210217/lib/libe1k'
make[2]: *** [Makefile:24: libveth] Error 2
make[2]: *** Waiting for unfinished jobs....
make[2]: *** [Makefile:24: libe1k] Error 2
make[3]: Entering directory '/home/pterjan/rpmbuild/BUILD/slof-0.1.git20210217-build/SLOF-qemu-slof-20210217/lib/libnvram'
powerpc64-linux-gnu-gcc -m64  -I../libc/include -DCPU_PPCP7 -DRTAS_NVRAM -DBROKEN_SC1 -DDHCPARCH=0x0C  -I/home/pterjan/rpmbuild/BUILD/slof-0.1.git20210217-build/SLOF-qemu-slof-20210217/board-qemu/include -I/home/pterjan/rpmbuild/BUILD/slof-0.1.git20210217-build/SLOF-qemu-slof-20210217/include/ppcp7 -I. -I../../include -O2 -g -pipe -Wformat -Werror=format-security -Wp,-U_FORTIFY_SOURCE,-D_FORTIFY_SOURCE=3 -specs=/usr/lib/rpm/redhat/redhat-hardened-cc1 -fstack-protector-strong -m64 -fasynchronous-unwind-tables -fstack-clash-protection -fcf-protection=full -o nvram.o -c /home/pterjan/rpmbuild/BUILD/slof-0.1.git20210217-build/SLOF-qemu-slof-20210217/lib/libnvram/nvram.c
cc1: error: '-fcf-protection=full' is not supported for this target
make[3]: *** [/home/pterjan/rpmbuild/BUILD/slof-0.1.git20210217-build/SLOF-qemu-slof-20210217/make.rules:55: nvram.o] Error 1
make[3]: Leaving directory '/home/pterjan/rpmbuild/BUILD/slof-0.1.git20210217-build/SLOF-qemu-slof-20210217/lib/libnvram'
make[3]: Entering directory '/home/pterjan/rpmbuild/BUILD/slof-0.1.git20210217-build/SLOF-qemu-slof-20210217/lib/libc'
powerpc64-linux-gnu-gcc -m64  -I/home/pterjan/rpmbuild/BUILD/slof-0.1.git20210217-build/SLOF-qemu-slof-20210217/lib/libc/include -O2 -g -pipe -Wformat -Werror=format-security -Wp,-U_FORTIFY_SOURCE,-D_FORTIFY_SOURCE=3 -specs=/usr/lib/rpm/redhat/redhat-hardened-cc1 -fstack-protector-strong -m64 -fasynchronous-unwind-tables -fstack-clash-protection -fcf-protection=full -c /home/pterjan/rpmbuild/BUILD/slof-0.1.git20210217-build/SLOF-qemu-slof-20210217/lib/libc/string/strcat.c -o strcat.o
cc1: error: '-fcf-protection=full' is not supported for this target
make[3]: *** [/home/pterjan/rpmbuild/BUILD/slof-0.1.git20210217-build/SLOF-qemu-slof-20210217/lib/libc/string/Makefile.inc:22: strcat.o] Error 1
make[3]: Leaving directory '/home/pterjan/rpmbuild/BUILD/slof-0.1.git20210217-build/SLOF-qemu-slof-20210217/lib/libc'
make[3]: *** Waiting for unfinished jobs....
make[3]: *** Waiting for unfinished jobs....
make[3]: Entering directory '/home/pterjan/rpmbuild/BUILD/slof-0.1.git20210217-build/SLOF-qemu-slof-20210217/lib/libbootmenu'
powerpc64-linux-gnu-gcc -m64   -O2 -g -pipe -Wformat -Werror=format-security -Wp,-U_FORTIFY_SOURCE,-D_FORTIFY_SOURCE=3 -specs=/usr/lib/rpm/redhat/redhat-hardened-cc1 -fstack-protector-strong -m64 -fasynchronous-unwind-tables -fstack-clash-protection -fcf-protection=full -I. -I.. -I../libc/include -I/home/pterjan/rpmbuild/BUILD/slof-0.1.git20210217-build/SLOF-qemu-slof-20210217/slof -I/home/pterjan/rpmbuild/BUILD/slof-0.1.git20210217-build/SLOF-qemu-slof-20210217/include -o bootmenu.o -c /home/pterjan/rpmbuild/BUILD/slof-0.1.git20210217-build/SLOF-qemu-slof-20210217/lib/libbootmenu/bootmenu.c
cc1: error: '-fcf-protection=full' is not supported for this target
make[3]: *** [/home/pterjan/rpmbuild/BUILD/slof-0.1.git20210217-build/SLOF-qemu-slof-20210217/make.rules:55: bootmenu.o] Error 1
make[3]: Leaving directory '/home/pterjan/rpmbuild/BUILD/slof-0.1.git20210217-build/SLOF-qemu-slof-20210217/lib/libbootmenu'
make[3]: Entering directory '/home/pterjan/rpmbuild/BUILD/slof-0.1.git20210217-build/SLOF-qemu-slof-20210217/lib/libhvcall'
powerpc64-linux-gnu-gcc -m64  -I../libc/include -DCPU_PPCP7 -I/home/pterjan/rpmbuild/BUILD/slof-0.1.git20210217-build/SLOF-qemu-slof-20210217/board-qemu/include -I/home/pterjan/rpmbuild/BUILD/slof-0.1.git20210217-build/SLOF-qemu-slof-20210217/include -I/home/pterjan/rpmbuild/BUILD/slof-0.1.git20210217-build/SLOF-qemu-slof-20210217/include/ppcp7 -O2 -g -pipe -Wformat -Werror=format-security -Wp,-U_FORTIFY_SOURCE,-D_FORTIFY_SOURCE=3 -specs=/usr/lib/rpm/redhat/redhat-hardened-cc1 -fstack-protector-strong -m64 -fasynchronous-unwind-tables -fstack-clash-protection -fcf-protection=full -o brokensc1.o -c /home/pterjan/rpmbuild/BUILD/slof-0.1.git20210217-build/SLOF-qemu-slof-20210217/lib/libhvcall/brokensc1.c
cc1: error: '-fcf-protection=full' is not supported for this target
make[3]: *** [/home/pterjan/rpmbuild/BUILD/slof-0.1.git20210217-build/SLOF-qemu-slof-20210217/make.rules:55: brokensc1.o] Error 1
make[3]: Leaving directory '/home/pterjan/rpmbuild/BUILD/slof-0.1.git20210217-build/SLOF-qemu-slof-20210217/lib/libhvcall'
make[3]: *** Waiting for unfinished jobs....
make[2]: *** [Makefile:24: libbootmenu] Error 2
make[2]: Entering directory '/home/pterjan/rpmbuild/BUILD/slof-0.1.git20210217-build/SLOF-qemu-slof-20210217/romfs/tools'
gcc -I/home/pterjan/rpmbuild/BUILD/slof-0.1.git20210217-build/SLOF-qemu-slof-20210217/include -I/home/pterjan/rpmbuild/BUILD/slof-0.1.git20210217-build/SLOF-qemu-slof-20210217/board-qemu/include -I. -g -Wall -W -O2 -I. -I../include -DRTAS_NVRAM -DBROKEN_SC1 -DDHCPARCH=0x0C  -c crclib.c -o crclib.o
make[2]: Leaving directory '/home/pterjan/rpmbuild/BUILD/slof-0.1.git20210217-build/SLOF-qemu-slof-20210217/romfs/tools'
make[3]: Entering directory '/home/pterjan/rpmbuild/BUILD/slof-0.1.git20210217-build/SLOF-qemu-slof-20210217/lib/libbootmsg'
powerpc64-linux-gnu-gcc -m64  -I../libc/include -DCPU_PPCP7 -I/home/pterjan/rpmbuild/BUILD/slof-0.1.git20210217-build/SLOF-qemu-slof-20210217/board-qemu/include -I. -I../../include -DRTAS_NVRAM -DBROKEN_SC1 -DDHCPARCH=0x0C   -DCPU_PPCP7 -Wa,-mregnames -c bootmsg_lvl.S -o bootmsg_lvl.o
make[3]: Leaving directory '/home/pterjan/rpmbuild/BUILD/slof-0.1.git20210217-build/SLOF-qemu-slof-20210217/lib/libbootmsg'
make[2]: Entering directory '/home/pterjan/rpmbuild/BUILD/slof-0.1.git20210217-build/SLOF-qemu-slof-20210217/romfs/tools'
gcc -I/home/pterjan/rpmbuild/BUILD/slof-0.1.git20210217-build/SLOF-qemu-slof-20210217/include -I/home/pterjan/rpmbuild/BUILD/slof-0.1.git20210217-build/SLOF-qemu-slof-20210217/board-qemu/include -I. -g -Wall -W -O2 -I. -I../include -DRTAS_NVRAM -DBROKEN_SC1 -DDHCPARCH=0x0C  -c create_flash.c -o create_flash.o
make[2]: Leaving directory '/home/pterjan/rpmbuild/BUILD/slof-0.1.git20210217-build/SLOF-qemu-slof-20210217/romfs/tools'
make[3]: Entering directory '/home/pterjan/rpmbuild/BUILD/slof-0.1.git20210217-build/SLOF-qemu-slof-20210217/lib/libbootmsg'
ar -rc ../libbootmsg.a  bootmsg_lvl.o
powerpc64-linux-gnu-ranlib ../libbootmsg.a
make[3]: Leaving directory '/home/pterjan/rpmbuild/BUILD/slof-0.1.git20210217-build/SLOF-qemu-slof-20210217/lib/libbootmsg'
make[3]: Entering directory '/home/pterjan/rpmbuild/BUILD/slof-0.1.git20210217-build/SLOF-qemu-slof-20210217/lib/libnvram'
powerpc64-linux-gnu-gcc -m64  -I../libc/include -DCPU_PPCP7 -DRTAS_NVRAM -DBROKEN_SC1 -DDHCPARCH=0x0C  -I/home/pterjan/rpmbuild/BUILD/slof-0.1.git20210217-build/SLOF-qemu-slof-20210217/board-qemu/include -I/home/pterjan/rpmbuild/BUILD/slof-0.1.git20210217-build/SLOF-qemu-slof-20210217/include/ppcp7 -I. -I../../include -O2 -g -pipe -Wformat -Werror=format-security -Wp,-U_FORTIFY_SOURCE,-D_FORTIFY_SOURCE=3 -specs=/usr/lib/rpm/redhat/redhat-hardened-cc1 -fstack-protector-strong -m64 -fasynchronous-unwind-tables -fstack-clash-protection -fcf-protection=full -o envvar.o -c /home/pterjan/rpmbuild/BUILD/slof-0.1.git20210217-build/SLOF-qemu-slof-20210217/lib/libnvram/envvar.c
cc1: error: '-fcf-protection=full' is not supported for this target
make[3]: *** [/home/pterjan/rpmbuild/BUILD/slof-0.1.git20210217-build/SLOF-qemu-slof-20210217/make.rules:55: envvar.o] Error 1
make[3]: Leaving directory '/home/pterjan/rpmbuild/BUILD/slof-0.1.git20210217-build/SLOF-qemu-slof-20210217/lib/libnvram'
make[3]: Entering directory '/home/pterjan/rpmbuild/BUILD/slof-0.1.git20210217-build/SLOF-qemu-slof-20210217/lib/libelf'
powerpc64-linux-gnu-gcc -m64  -I../libc/include -DCPU_PPCP7 -I/home/pterjan/rpmbuild/BUILD/slof-0.1.git20210217-build/SLOF-qemu-slof-20210217/include -I/home/pterjan/rpmbuild/BUILD/slof-0.1.git20210217-build/SLOF-qemu-slof-20210217/include/ppcp7 -O2 -g -pipe -Wformat -Werror=format-security -Wp,-U_FORTIFY_SOURCE,-D_FORTIFY_SOURCE=3 -specs=/usr/lib/rpm/redhat/redhat-hardened-cc1 -fstack-protector-strong -m64 -fasynchronous-unwind-tables -fstack-clash-protection -fcf-protection=full -o elf.o -c /home/pterjan/rpmbuild/BUILD/slof-0.1.git20210217-build/SLOF-qemu-slof-20210217/lib/libelf/elf.c
cc1: error: '-fcf-protection=full' is not supported for this target
make[3]: *** [/home/pterjan/rpmbuild/BUILD/slof-0.1.git20210217-build/SLOF-qemu-slof-20210217/make.rules:55: elf.o] Error 1
make[3]: Leaving directory '/home/pterjan/rpmbuild/BUILD/slof-0.1.git20210217-build/SLOF-qemu-slof-20210217/lib/libelf'
make[3]: *** Waiting for unfinished jobs....
make[3]: Entering directory '/home/pterjan/rpmbuild/BUILD/slof-0.1.git20210217-build/SLOF-qemu-slof-20210217/lib/libhvcall'
powerpc64-linux-gnu-gcc -m64  -I../libc/include -DCPU_PPCP7 -I/home/pterjan/rpmbuild/BUILD/slof-0.1.git20210217-build/SLOF-qemu-slof-20210217/board-qemu/include -I/home/pterjan/rpmbuild/BUILD/slof-0.1.git20210217-build/SLOF-qemu-slof-20210217/include -I/home/pterjan/rpmbuild/BUILD/slof-0.1.git20210217-build/SLOF-qemu-slof-20210217/include/ppcp7 -O2 -g -pipe -Wformat -Werror=format-security -Wp,-U_FORTIFY_SOURCE,-D_FORTIFY_SOURCE=3 -specs=/usr/lib/rpm/redhat/redhat-hardened-cc1 -fstack-protector-strong -m64 -fasynchronous-unwind-tables -fstack-clash-protection -fcf-protection=full -o rfill.o -c /home/pterjan/rpmbuild/BUILD/slof-0.1.git20210217-build/SLOF-qemu-slof-20210217/lib/libhvcall/rfill.c
cc1: error: '-fcf-protection=full' is not supported for this target
make[3]: *** [/home/pterjan/rpmbuild/BUILD/slof-0.1.git20210217-build/SLOF-qemu-slof-20210217/make.rules:55: rfill.o] Error 1
make[3]: Leaving directory '/home/pterjan/rpmbuild/BUILD/slof-0.1.git20210217-build/SLOF-qemu-slof-20210217/lib/libhvcall'
make[2]: *** [Makefile:24: libnvram] Error 2
make[3]: Entering directory '/home/pterjan/rpmbuild/BUILD/slof-0.1.git20210217-build/SLOF-qemu-slof-20210217/lib/libelf'
powerpc64-linux-gnu-gcc -m64  -I../libc/include -DCPU_PPCP7 -I/home/pterjan/rpmbuild/BUILD/slof-0.1.git20210217-build/SLOF-qemu-slof-20210217/include -I/home/pterjan/rpmbuild/BUILD/slof-0.1.git20210217-build/SLOF-qemu-slof-20210217/include/ppcp7 -O2 -g -pipe -Wformat -Werror=format-security -Wp,-U_FORTIFY_SOURCE,-D_FORTIFY_SOURCE=3 -specs=/usr/lib/rpm/redhat/redhat-hardened-cc1 -fstack-protector-strong -m64 -fasynchronous-unwind-tables -fstack-clash-protection -fcf-protection=full -o elf32.o -c /home/pterjan/rpmbuild/BUILD/slof-0.1.git20210217-build/SLOF-qemu-slof-20210217/lib/libelf/elf32.c
cc1: error: '-fcf-protection=full' is not supported for this target
make[3]: *** [/home/pterjan/rpmbuild/BUILD/slof-0.1.git20210217-build/SLOF-qemu-slof-20210217/make.rules:55: elf32.o] Error 1
make[3]: Leaving directory '/home/pterjan/rpmbuild/BUILD/slof-0.1.git20210217-build/SLOF-qemu-slof-20210217/lib/libelf'
make[3]: Entering directory '/home/pterjan/rpmbuild/BUILD/slof-0.1.git20210217-build/SLOF-qemu-slof-20210217/lib/libelf'
powerpc64-linux-gnu-gcc -m64  -I../libc/include -DCPU_PPCP7 -I/home/pterjan/rpmbuild/BUILD/slof-0.1.git20210217-build/SLOF-qemu-slof-20210217/include -I/home/pterjan/rpmbuild/BUILD/slof-0.1.git20210217-build/SLOF-qemu-slof-20210217/include/ppcp7 -O2 -g -pipe -Wformat -Werror=format-security -Wp,-U_FORTIFY_SOURCE,-D_FORTIFY_SOURCE=3 -specs=/usr/lib/rpm/redhat/redhat-hardened-cc1 -fstack-protector-strong -m64 -fasynchronous-unwind-tables -fstack-clash-protection -fcf-protection=full -o elf64.o -c /home/pterjan/rpmbuild/BUILD/slof-0.1.git20210217-build/SLOF-qemu-slof-20210217/lib/libelf/elf64.c
cc1: error: '-fcf-protection=full' is not supported for this target
make[3]: *** [/home/pterjan/rpmbuild/BUILD/slof-0.1.git20210217-build/SLOF-qemu-slof-20210217/make.rules:55: elf64.o] Error 1
make[3]: Leaving directory '/home/pterjan/rpmbuild/BUILD/slof-0.1.git20210217-build/SLOF-qemu-slof-20210217/lib/libelf'
make[3]: Entering directory '/home/pterjan/rpmbuild/BUILD/slof-0.1.git20210217-build/SLOF-qemu-slof-20210217/lib/libelf'
powerpc64-linux-gnu-gcc -m64  -I../libc/include -DCPU_PPCP7 -I/home/pterjan/rpmbuild/BUILD/slof-0.1.git20210217-build/SLOF-qemu-slof-20210217/include -I/home/pterjan/rpmbuild/BUILD/slof-0.1.git20210217-build/SLOF-qemu-slof-20210217/include/ppcp7 -O2 -g -pipe -Wformat -Werror=format-security -Wp,-U_FORTIFY_SOURCE,-D_FORTIFY_SOURCE=3 -specs=/usr/lib/rpm/redhat/redhat-hardened-cc1 -fstack-protector-strong -m64 -fasynchronous-unwind-tables -fstack-clash-protection -fcf-protection=full -o elf_claim.o -c /home/pterjan/rpmbuild/BUILD/slof-0.1.git20210217-build/SLOF-qemu-slof-20210217/lib/libelf/elf_claim.c
cc1: error: '-fcf-protection=full' is not supported for this target
make[3]: *** [/home/pterjan/rpmbuild/BUILD/slof-0.1.git20210217-build/SLOF-qemu-slof-20210217/make.rules:55: elf_claim.o] Error 1
make[3]: Leaving directory '/home/pterjan/rpmbuild/BUILD/slof-0.1.git20210217-build/SLOF-qemu-slof-20210217/lib/libelf'
make[2]: *** [Makefile:24: libelf] Error 2
make[3]: Entering directory '/home/pterjan/rpmbuild/BUILD/slof-0.1.git20210217-build/SLOF-qemu-slof-20210217/lib/libvirtio'
powerpc64-linux-gnu-gcc -m64  -M -I../libc/include -DCPU_PPCP7 -I/home/pterjan/rpmbuild/BUILD/slof-0.1.git20210217-build/SLOF-qemu-slof-20210217/board-qemu/include -I/home/pterjan/rpmbuild/BUILD/slof-0.1.git20210217-build/SLOF-qemu-slof-20210217/include -I/home/pterjan/rpmbuild/BUILD/slof-0.1.git20210217-build/SLOF-qemu-slof-20210217/include/ppcp7 -O2 -g -pipe -Wformat -Werror=format-security -Wp,-U_FORTIFY_SOURCE,-D_FORTIFY_SOURCE=3 -specs=/usr/lib/rpm/redhat/redhat-hardened-cc1 -fstack-protector-strong -m64 -fasynchronous-unwind-tables -fstack-clash-protection -fcf-protection=full virtio.c virtio-blk.c p9.c virtio-9p.c virtio-scsi.c virtio-net.c virtio-serial.c  > Makefile.dep
cc1: error: '-fcf-protection=full' is not supported for this target
cc1: error: '-fcf-protection=full' is not supported for this target
cc1: error: '-fcf-protection=full' is not supported for this target
cc1: error: '-fcf-protection=full' is not supported for this target
cc1: error: '-fcf-protection=full' is not supported for this target
cc1: error: '-fcf-protection=full' is not supported for this target
cc1: error: '-fcf-protection=full' is not supported for this target
make[3]: Leaving directory '/home/pterjan/rpmbuild/BUILD/slof-0.1.git20210217-build/SLOF-qemu-slof-20210217/lib/libvirtio'
make[2]: Entering directory '/home/pterjan/rpmbuild/BUILD/slof-0.1.git20210217-build/SLOF-qemu-slof-20210217/romfs/tools'
gcc -I/home/pterjan/rpmbuild/BUILD/slof-0.1.git20210217-build/SLOF-qemu-slof-20210217/include -I/home/pterjan/rpmbuild/BUILD/slof-0.1.git20210217-build/SLOF-qemu-slof-20210217/board-qemu/include -I. -g -Wall -W -O2 -I. -I../include -DRTAS_NVRAM -DBROKEN_SC1 -DDHCPARCH=0x0C  -c create_crc.c -o create_crc.o
In file included from create_crc.c:22:
create_crc.c: In function 'createHeaderImage':
/home/pterjan/rpmbuild/BUILD/slof-0.1.git20210217-build/SLOF-qemu-slof-20210217/board-qemu/include/product.h:21:23: warning: initializer-string for array of 'char' truncates NUL terminator but destination lacks 'nonstring' attribute (9 chars into 8 available) [-Wunterminated-string-initialization]
   21 | #define FLASHFS_MAGIC "magic123"
      |                       ^~~~~~~~~~
create_crc.c:81:26: note: in expansion of macro 'FLASHFS_MAGIC'
   81 |                 .magic = FLASHFS_MAGIC,
      |                          ^~~~~~~~~~~~~
make[2]: Leaving directory '/home/pterjan/rpmbuild/BUILD/slof-0.1.git20210217-build/SLOF-qemu-slof-20210217/romfs/tools'
make[3]: Entering directory '/home/pterjan/rpmbuild/BUILD/slof-0.1.git20210217-build/SLOF-qemu-slof-20210217/lib/libusb'
powerpc64-linux-gnu-gcc -m64  -M -I../libc/include -DCPU_PPCP7 -I/home/pterjan/rpmbuild/BUILD/slof-0.1.git20210217-build/SLOF-qemu-slof-20210217/board-qemu/include -I/home/pterjan/rpmbuild/BUILD/slof-0.1.git20210217-build/SLOF-qemu-slof-20210217/include -I/home/pterjan/rpmbuild/BUILD/slof-0.1.git20210217-build/SLOF-qemu-slof-20210217/include/ppcp7 -I/home/pterjan/rpmbuild/BUILD/slof-0.1.git20210217-build/SLOF-qemu-slof-20210217/slof -O2 -g -pipe -Wformat -Werror=format-security -Wp,-U_FORTIFY_SOURCE,-D_FORTIFY_SOURCE=3 -specs=/usr/lib/rpm/redhat/redhat-hardened-cc1 -fstack-protector-strong -m64 -fasynchronous-unwind-tables -fstack-clash-protection -fcf-protection=full usb-core.c usb-ohci.c usb-ehci.c usb-slof.c usb-key.c usb-hid.c usb-hub.c usb-xhci.c  > Makefile.dep
cc1: error: '-fcf-protection=full' is not supported for this target
cc1: error: '-fcf-protection=full' is not supported for this target
cc1: error: '-fcf-protection=full' is not supported for this target
cc1: error: '-fcf-protection=full' is not supported for this target
cc1: error: '-fcf-protection=full' is not supported for this target
cc1: error: '-fcf-protection=full' is not supported for this target
cc1: error: '-fcf-protection=full' is not supported for this target
cc1: error: '-fcf-protection=full' is not supported for this target
make[3]: Leaving directory '/home/pterjan/rpmbuild/BUILD/slof-0.1.git20210217-build/SLOF-qemu-slof-20210217/lib/libusb'
make[3]: Entering directory '/home/pterjan/rpmbuild/BUILD/slof-0.1.git20210217-build/SLOF-qemu-slof-20210217/lib/libvirtio'
powerpc64-linux-gnu-gcc -m64  -I../libc/include -DCPU_PPCP7 -I/home/pterjan/rpmbuild/BUILD/slof-0.1.git20210217-build/SLOF-qemu-slof-20210217/board-qemu/include -I/home/pterjan/rpmbuild/BUILD/slof-0.1.git20210217-build/SLOF-qemu-slof-20210217/include -I/home/pterjan/rpmbuild/BUILD/slof-0.1.git20210217-build/SLOF-qemu-slof-20210217/include/ppcp7 -O2 -g -pipe -Wformat -Werror=format-security -Wp,-U_FORTIFY_SOURCE,-D_FORTIFY_SOURCE=3 -specs=/usr/lib/rpm/redhat/redhat-hardened-cc1 -fstack-protector-strong -m64 -fasynchronous-unwind-tables -fstack-clash-protection -fcf-protection=full -o virtio.o -c /home/pterjan/rpmbuild/BUILD/slof-0.1.git20210217-build/SLOF-qemu-slof-20210217/lib/libvirtio/virtio.c
cc1: error: '-fcf-protection=full' is not supported for this target
make[3]: *** [/home/pterjan/rpmbuild/BUILD/slof-0.1.git20210217-build/SLOF-qemu-slof-20210217/make.rules:55: virtio.o] Error 1
make[3]: Leaving directory '/home/pterjan/rpmbuild/BUILD/slof-0.1.git20210217-build/SLOF-qemu-slof-20210217/lib/libvirtio'
make[3]: *** Waiting for unfinished jobs....
make[3]: Entering directory '/home/pterjan/rpmbuild/BUILD/slof-0.1.git20210217-build/SLOF-qemu-slof-20210217/lib/libvirtio'
powerpc64-linux-gnu-gcc -m64  -I../libc/include -DCPU_PPCP7 -I/home/pterjan/rpmbuild/BUILD/slof-0.1.git20210217-build/SLOF-qemu-slof-20210217/board-qemu/include -I/home/pterjan/rpmbuild/BUILD/slof-0.1.git20210217-build/SLOF-qemu-slof-20210217/include -I/home/pterjan/rpmbuild/BUILD/slof-0.1.git20210217-build/SLOF-qemu-slof-20210217/include/ppcp7 -O2 -g -pipe -Wformat -Werror=format-security -Wp,-U_FORTIFY_SOURCE,-D_FORTIFY_SOURCE=3 -specs=/usr/lib/rpm/redhat/redhat-hardened-cc1 -fstack-protector-strong -m64 -fasynchronous-unwind-tables -fstack-clash-protection -fcf-protection=full -o virtio-blk.o -c /home/pterjan/rpmbuild/BUILD/slof-0.1.git20210217-build/SLOF-qemu-slof-20210217/lib/libvirtio/virtio-blk.c
cc1: error: '-fcf-protection=full' is not supported for this target
make[3]: *** [/home/pterjan/rpmbuild/BUILD/slof-0.1.git20210217-build/SLOF-qemu-slof-20210217/make.rules:55: virtio-blk.o] Error 1
make[3]: Leaving directory '/home/pterjan/rpmbuild/BUILD/slof-0.1.git20210217-build/SLOF-qemu-slof-20210217/lib/libvirtio'
make[3]: Entering directory '/home/pterjan/rpmbuild/BUILD/slof-0.1.git20210217-build/SLOF-qemu-slof-20210217/lib/libvirtio'
powerpc64-linux-gnu-gcc -m64  -I../libc/include -DCPU_PPCP7 -I/home/pterjan/rpmbuild/BUILD/slof-0.1.git20210217-build/SLOF-qemu-slof-20210217/board-qemu/include -I/home/pterjan/rpmbuild/BUILD/slof-0.1.git20210217-build/SLOF-qemu-slof-20210217/include -I/home/pterjan/rpmbuild/BUILD/slof-0.1.git20210217-build/SLOF-qemu-slof-20210217/include/ppcp7 -O2 -g -pipe -Wformat -Werror=format-security -Wp,-U_FORTIFY_SOURCE,-D_FORTIFY_SOURCE=3 -specs=/usr/lib/rpm/redhat/redhat-hardened-cc1 -fstack-protector-strong -m64 -fasynchronous-unwind-tables -fstack-clash-protection -fcf-protection=full -o p9.o -c /home/pterjan/rpmbuild/BUILD/slof-0.1.git20210217-build/SLOF-qemu-slof-20210217/lib/libvirtio/p9.c
cc1: error: '-fcf-protection=full' is not supported for this target
make[3]: *** [/home/pterjan/rpmbuild/BUILD/slof-0.1.git20210217-build/SLOF-qemu-slof-20210217/make.rules:55: p9.o] Error 1
make[3]: Leaving directory '/home/pterjan/rpmbuild/BUILD/slof-0.1.git20210217-build/SLOF-qemu-slof-20210217/lib/libvirtio'
make[3]: Entering directory '/home/pterjan/rpmbuild/BUILD/slof-0.1.git20210217-build/SLOF-qemu-slof-20210217/lib/libvirtio'
powerpc64-linux-gnu-gcc -m64  -I../libc/include -DCPU_PPCP7 -I/home/pterjan/rpmbuild/BUILD/slof-0.1.git20210217-build/SLOF-qemu-slof-20210217/board-qemu/include -I/home/pterjan/rpmbuild/BUILD/slof-0.1.git20210217-build/SLOF-qemu-slof-20210217/include -I/home/pterjan/rpmbuild/BUILD/slof-0.1.git20210217-build/SLOF-qemu-slof-20210217/include/ppcp7 -O2 -g -pipe -Wformat -Werror=format-security -Wp,-U_FORTIFY_SOURCE,-D_FORTIFY_SOURCE=3 -specs=/usr/lib/rpm/redhat/redhat-hardened-cc1 -fstack-protector-strong -m64 -fasynchronous-unwind-tables -fstack-clash-protection -fcf-protection=full -o virtio-9p.o -c /home/pterjan/rpmbuild/BUILD/slof-0.1.git20210217-build/SLOF-qemu-slof-20210217/lib/libvirtio/virtio-9p.c
cc1: error: '-fcf-protection=full' is not supported for this target
make[3]: *** [/home/pterjan/rpmbuild/BUILD/slof-0.1.git20210217-build/SLOF-qemu-slof-20210217/make.rules:55: virtio-9p.o] Error 1
make[3]: Leaving directory '/home/pterjan/rpmbuild/BUILD/slof-0.1.git20210217-build/SLOF-qemu-slof-20210217/lib/libvirtio'
make[3]: Entering directory '/home/pterjan/rpmbuild/BUILD/slof-0.1.git20210217-build/SLOF-qemu-slof-20210217/lib/libvirtio'
powerpc64-linux-gnu-gcc -m64  -I../libc/include -DCPU_PPCP7 -I/home/pterjan/rpmbuild/BUILD/slof-0.1.git20210217-build/SLOF-qemu-slof-20210217/board-qemu/include -I/home/pterjan/rpmbuild/BUILD/slof-0.1.git20210217-build/SLOF-qemu-slof-20210217/include -I/home/pterjan/rpmbuild/BUILD/slof-0.1.git20210217-build/SLOF-qemu-slof-20210217/include/ppcp7 -O2 -g -pipe -Wformat -Werror=format-security -Wp,-U_FORTIFY_SOURCE,-D_FORTIFY_SOURCE=3 -specs=/usr/lib/rpm/redhat/redhat-hardened-cc1 -fstack-protector-strong -m64 -fasynchronous-unwind-tables -fstack-clash-protection -fcf-protection=full -o virtio-scsi.o -c /home/pterjan/rpmbuild/BUILD/slof-0.1.git20210217-build/SLOF-qemu-slof-20210217/lib/libvirtio/virtio-scsi.c
cc1: error: '-fcf-protection=full' is not supported for this target
make[3]: *** [/home/pterjan/rpmbuild/BUILD/slof-0.1.git20210217-build/SLOF-qemu-slof-20210217/make.rules:55: virtio-scsi.o] Error 1
make[3]: Leaving directory '/home/pterjan/rpmbuild/BUILD/slof-0.1.git20210217-build/SLOF-qemu-slof-20210217/lib/libvirtio'
make[3]: Entering directory '/home/pterjan/rpmbuild/BUILD/slof-0.1.git20210217-build/SLOF-qemu-slof-20210217/lib/libusb'
powerpc64-linux-gnu-gcc -m64  -I../libc/include -DCPU_PPCP7 -I/home/pterjan/rpmbuild/BUILD/slof-0.1.git20210217-build/SLOF-qemu-slof-20210217/board-qemu/include -I/home/pterjan/rpmbuild/BUILD/slof-0.1.git20210217-build/SLOF-qemu-slof-20210217/include -I/home/pterjan/rpmbuild/BUILD/slof-0.1.git20210217-build/SLOF-qemu-slof-20210217/include/ppcp7 -I/home/pterjan/rpmbuild/BUILD/slof-0.1.git20210217-build/SLOF-qemu-slof-20210217/slof -O2 -g -pipe -Wformat -Werror=format-security -Wp,-U_FORTIFY_SOURCE,-D_FORTIFY_SOURCE=3 -specs=/usr/lib/rpm/redhat/redhat-hardened-cc1 -fstack-protector-strong -m64 -fasynchronous-unwind-tables -fstack-clash-protection -fcf-protection=full -o usb-core.o -c /home/pterjan/rpmbuild/BUILD/slof-0.1.git20210217-build/SLOF-qemu-slof-20210217/lib/libusb/usb-core.c
cc1: error: '-fcf-protection=full' is not supported for this target
make[3]: *** [/home/pterjan/rpmbuild/BUILD/slof-0.1.git20210217-build/SLOF-qemu-slof-20210217/make.rules:55: usb-core.o] Error 1
make[3]: Leaving directory '/home/pterjan/rpmbuild/BUILD/slof-0.1.git20210217-build/SLOF-qemu-slof-20210217/lib/libusb'
make[3]: *** Waiting for unfinished jobs....
make[3]: Entering directory '/home/pterjan/rpmbuild/BUILD/slof-0.1.git20210217-build/SLOF-qemu-slof-20210217/lib/libvirtio'
powerpc64-linux-gnu-gcc -m64  -I../libc/include -DCPU_PPCP7 -I/home/pterjan/rpmbuild/BUILD/slof-0.1.git20210217-build/SLOF-qemu-slof-20210217/board-qemu/include -I/home/pterjan/rpmbuild/BUILD/slof-0.1.git20210217-build/SLOF-qemu-slof-20210217/include -I/home/pterjan/rpmbuild/BUILD/slof-0.1.git20210217-build/SLOF-qemu-slof-20210217/include/ppcp7 -O2 -g -pipe -Wformat -Werror=format-security -Wp,-U_FORTIFY_SOURCE,-D_FORTIFY_SOURCE=3 -specs=/usr/lib/rpm/redhat/redhat-hardened-cc1 -fstack-protector-strong -m64 -fasynchronous-unwind-tables -fstack-clash-protection -fcf-protection=full -o virtio-net.o -c /home/pterjan/rpmbuild/BUILD/slof-0.1.git20210217-build/SLOF-qemu-slof-20210217/lib/libvirtio/virtio-net.c
cc1: error: '-fcf-protection=full' is not supported for this target
make[3]: *** [/home/pterjan/rpmbuild/BUILD/slof-0.1.git20210217-build/SLOF-qemu-slof-20210217/make.rules:55: virtio-net.o] Error 1
make[3]: Leaving directory '/home/pterjan/rpmbuild/BUILD/slof-0.1.git20210217-build/SLOF-qemu-slof-20210217/lib/libvirtio'
make[2]: *** [Makefile:24: libvirtio] Error 2
make[3]: Entering directory '/home/pterjan/rpmbuild/BUILD/slof-0.1.git20210217-build/SLOF-qemu-slof-20210217/lib/libusb'
powerpc64-linux-gnu-gcc -m64  -I../libc/include -DCPU_PPCP7 -I/home/pterjan/rpmbuild/BUILD/slof-0.1.git20210217-build/SLOF-qemu-slof-20210217/board-qemu/include -I/home/pterjan/rpmbuild/BUILD/slof-0.1.git20210217-build/SLOF-qemu-slof-20210217/include -I/home/pterjan/rpmbuild/BUILD/slof-0.1.git20210217-build/SLOF-qemu-slof-20210217/include/ppcp7 -I/home/pterjan/rpmbuild/BUILD/slof-0.1.git20210217-build/SLOF-qemu-slof-20210217/slof -O2 -g -pipe -Wformat -Werror=format-security -Wp,-U_FORTIFY_SOURCE,-D_FORTIFY_SOURCE=3 -specs=/usr/lib/rpm/redhat/redhat-hardened-cc1 -fstack-protector-strong -m64 -fasynchronous-unwind-tables -fstack-clash-protection -fcf-protection=full -o usb-ohci.o -c /home/pterjan/rpmbuild/BUILD/slof-0.1.git20210217-build/SLOF-qemu-slof-20210217/lib/libusb/usb-ohci.c
cc1: error: '-fcf-protection=full' is not supported for this target
make[3]: *** [/home/pterjan/rpmbuild/BUILD/slof-0.1.git20210217-build/SLOF-qemu-slof-20210217/make.rules:55: usb-ohci.o] Error 1
make[3]: Leaving directory '/home/pterjan/rpmbuild/BUILD/slof-0.1.git20210217-build/SLOF-qemu-slof-20210217/lib/libusb'
make[3]: Entering directory '/home/pterjan/rpmbuild/BUILD/slof-0.1.git20210217-build/SLOF-qemu-slof-20210217/lib/libc'
powerpc64-linux-gnu-gcc -m64  -I/home/pterjan/rpmbuild/BUILD/slof-0.1.git20210217-build/SLOF-qemu-slof-20210217/lib/libc/include -O2 -g -pipe -Wformat -Werror=format-security -Wp,-U_FORTIFY_SOURCE,-D_FORTIFY_SOURCE=3 -specs=/usr/lib/rpm/redhat/redhat-hardened-cc1 -fstack-protector-strong -m64 -fasynchronous-unwind-tables -fstack-clash-protection -fcf-protection=full -c /home/pterjan/rpmbuild/BUILD/slof-0.1.git20210217-build/SLOF-qemu-slof-20210217/lib/libc/string/strchr.c -o strchr.o
cc1: error: '-fcf-protection=full' is not supported for this target
make[3]: *** [/home/pterjan/rpmbuild/BUILD/slof-0.1.git20210217-build/SLOF-qemu-slof-20210217/lib/libc/string/Makefile.inc:22: strchr.o] Error 1
make[3]: Leaving directory '/home/pterjan/rpmbuild/BUILD/slof-0.1.git20210217-build/SLOF-qemu-slof-20210217/lib/libc'
make[2]: *** [Makefile:24: libc] Error 2
make[3]: Entering directory '/home/pterjan/rpmbuild/BUILD/slof-0.1.git20210217-build/SLOF-qemu-slof-20210217/lib/libusb'
powerpc64-linux-gnu-gcc -m64  -I../libc/include -DCPU_PPCP7 -I/home/pterjan/rpmbuild/BUILD/slof-0.1.git20210217-build/SLOF-qemu-slof-20210217/board-qemu/include -I/home/pterjan/rpmbuild/BUILD/slof-0.1.git20210217-build/SLOF-qemu-slof-20210217/include -I/home/pterjan/rpmbuild/BUILD/slof-0.1.git20210217-build/SLOF-qemu-slof-20210217/include/ppcp7 -I/home/pterjan/rpmbuild/BUILD/slof-0.1.git20210217-build/SLOF-qemu-slof-20210217/slof -O2 -g -pipe -Wformat -Werror=format-security -Wp,-U_FORTIFY_SOURCE,-D_FORTIFY_SOURCE=3 -specs=/usr/lib/rpm/redhat/redhat-hardened-cc1 -fstack-protector-strong -m64 -fasynchronous-unwind-tables -fstack-clash-protection -fcf-protection=full -o usb-ehci.o -c /home/pterjan/rpmbuild/BUILD/slof-0.1.git20210217-build/SLOF-qemu-slof-20210217/lib/libusb/usb-ehci.c
cc1: error: '-fcf-protection=full' is not supported for this target
make[3]: *** [/home/pterjan/rpmbuild/BUILD/slof-0.1.git20210217-build/SLOF-qemu-slof-20210217/make.rules:55: usb-ehci.o] Error 1
make[3]: Leaving directory '/home/pterjan/rpmbuild/BUILD/slof-0.1.git20210217-build/SLOF-qemu-slof-20210217/lib/libusb'
make[3]: Entering directory '/home/pterjan/rpmbuild/BUILD/slof-0.1.git20210217-build/SLOF-qemu-slof-20210217/lib/libusb'
powerpc64-linux-gnu-gcc -m64  -I../libc/include -DCPU_PPCP7 -I/home/pterjan/rpmbuild/BUILD/slof-0.1.git20210217-build/SLOF-qemu-slof-20210217/board-qemu/include -I/home/pterjan/rpmbuild/BUILD/slof-0.1.git20210217-build/SLOF-qemu-slof-20210217/include -I/home/pterjan/rpmbuild/BUILD/slof-0.1.git20210217-build/SLOF-qemu-slof-20210217/include/ppcp7 -I/home/pterjan/rpmbuild/BUILD/slof-0.1.git20210217-build/SLOF-qemu-slof-20210217/slof -O2 -g -pipe -Wformat -Werror=format-security -Wp,-U_FORTIFY_SOURCE,-D_FORTIFY_SOURCE=3 -specs=/usr/lib/rpm/redhat/redhat-hardened-cc1 -fstack-protector-strong -m64 -fasynchronous-unwind-tables -fstack-clash-protection -fcf-protection=full -o usb-slof.o -c /home/pterjan/rpmbuild/BUILD/slof-0.1.git20210217-build/SLOF-qemu-slof-20210217/lib/libusb/usb-slof.c
cc1: error: '-fcf-protection=full' is not supported for this target
make[3]: *** [/home/pterjan/rpmbuild/BUILD/slof-0.1.git20210217-build/SLOF-qemu-slof-20210217/make.rules:55: usb-slof.o] Error 1
make[3]: Leaving directory '/home/pterjan/rpmbuild/BUILD/slof-0.1.git20210217-build/SLOF-qemu-slof-20210217/lib/libusb'
make[3]: Entering directory '/home/pterjan/rpmbuild/BUILD/slof-0.1.git20210217-build/SLOF-qemu-slof-20210217/lib/libhvcall'
powerpc64-linux-gnu-gcc -m64  -I../libc/include -DCPU_PPCP7 -I/home/pterjan/rpmbuild/BUILD/slof-0.1.git20210217-build/SLOF-qemu-slof-20210217/board-qemu/include -I/home/pterjan/rpmbuild/BUILD/slof-0.1.git20210217-build/SLOF-qemu-slof-20210217/include -I/home/pterjan/rpmbuild/BUILD/slof-0.1.git20210217-build/SLOF-qemu-slof-20210217/include/ppcp7 -DRTAS_NVRAM -DBROKEN_SC1 -DDHCPARCH=0x0C   -DCPU_PPCP7 -Wa,-mregnames -c hvcall.S -o hvcall.o
make[3]: Leaving directory '/home/pterjan/rpmbuild/BUILD/slof-0.1.git20210217-build/SLOF-qemu-slof-20210217/lib/libhvcall'
make[2]: Entering directory '/home/pterjan/rpmbuild/BUILD/slof-0.1.git20210217-build/SLOF-qemu-slof-20210217/romfs/tools'
gcc -I/home/pterjan/rpmbuild/BUILD/slof-0.1.git20210217-build/SLOF-qemu-slof-20210217/include -I/home/pterjan/rpmbuild/BUILD/slof-0.1.git20210217-build/SLOF-qemu-slof-20210217/board-qemu/include -I. -g -Wall -W -O2 -I. -I../include -DRTAS_NVRAM -DBROKEN_SC1 -DDHCPARCH=0x0C  -c cfg_parse.c -o cfg_parse.o
make[2]: Leaving directory '/home/pterjan/rpmbuild/BUILD/slof-0.1.git20210217-build/SLOF-qemu-slof-20210217/romfs/tools'
make[2]: *** [Makefile:24: libhvcall] Error 2
make[3]: Entering directory '/home/pterjan/rpmbuild/BUILD/slof-0.1.git20210217-build/SLOF-qemu-slof-20210217/lib/libusb'
powerpc64-linux-gnu-gcc -m64  -I../libc/include -DCPU_PPCP7 -I/home/pterjan/rpmbuild/BUILD/slof-0.1.git20210217-build/SLOF-qemu-slof-20210217/board-qemu/include -I/home/pterjan/rpmbuild/BUILD/slof-0.1.git20210217-build/SLOF-qemu-slof-20210217/include -I/home/pterjan/rpmbuild/BUILD/slof-0.1.git20210217-build/SLOF-qemu-slof-20210217/include/ppcp7 -I/home/pterjan/rpmbuild/BUILD/slof-0.1.git20210217-build/SLOF-qemu-slof-20210217/slof -O2 -g -pipe -Wformat -Werror=format-security -Wp,-U_FORTIFY_SOURCE,-D_FORTIFY_SOURCE=3 -specs=/usr/lib/rpm/redhat/redhat-hardened-cc1 -fstack-protector-strong -m64 -fasynchronous-unwind-tables -fstack-clash-protection -fcf-protection=full -o usb-key.o -c /home/pterjan/rpmbuild/BUILD/slof-0.1.git20210217-build/SLOF-qemu-slof-20210217/lib/libusb/usb-key.c
cc1: error: '-fcf-protection=full' is not supported for this target
make[3]: *** [/home/pterjan/rpmbuild/BUILD/slof-0.1.git20210217-build/SLOF-qemu-slof-20210217/make.rules:55: usb-key.o] Error 1
make[3]: Leaving directory '/home/pterjan/rpmbuild/BUILD/slof-0.1.git20210217-build/SLOF-qemu-slof-20210217/lib/libusb'
make[3]: Entering directory '/home/pterjan/rpmbuild/BUILD/slof-0.1.git20210217-build/SLOF-qemu-slof-20210217/lib/libusb'
powerpc64-linux-gnu-gcc -m64  -I../libc/include -DCPU_PPCP7 -I/home/pterjan/rpmbuild/BUILD/slof-0.1.git20210217-build/SLOF-qemu-slof-20210217/board-qemu/include -I/home/pterjan/rpmbuild/BUILD/slof-0.1.git20210217-build/SLOF-qemu-slof-20210217/include -I/home/pterjan/rpmbuild/BUILD/slof-0.1.git20210217-build/SLOF-qemu-slof-20210217/include/ppcp7 -I/home/pterjan/rpmbuild/BUILD/slof-0.1.git20210217-build/SLOF-qemu-slof-20210217/slof -O2 -g -pipe -Wformat -Werror=format-security -Wp,-U_FORTIFY_SOURCE,-D_FORTIFY_SOURCE=3 -specs=/usr/lib/rpm/redhat/redhat-hardened-cc1 -fstack-protector-strong -m64 -fasynchronous-unwind-tables -fstack-clash-protection -fcf-protection=full -o usb-hid.o -c /home/pterjan/rpmbuild/BUILD/slof-0.1.git20210217-build/SLOF-qemu-slof-20210217/lib/libusb/usb-hid.c
cc1: error: '-fcf-protection=full' is not supported for this target
make[3]: *** [/home/pterjan/rpmbuild/BUILD/slof-0.1.git20210217-build/SLOF-qemu-slof-20210217/make.rules:55: usb-hid.o] Error 1
make[3]: Leaving directory '/home/pterjan/rpmbuild/BUILD/slof-0.1.git20210217-build/SLOF-qemu-slof-20210217/lib/libusb'
make[2]: *** [Makefile:24: libusb] Error 2
make[2]: Entering directory '/home/pterjan/rpmbuild/BUILD/slof-0.1.git20210217-build/SLOF-qemu-slof-20210217/romfs/tools'
gcc -I/home/pterjan/rpmbuild/BUILD/slof-0.1.git20210217-build/SLOF-qemu-slof-20210217/include -I/home/pterjan/rpmbuild/BUILD/slof-0.1.git20210217-build/SLOF-qemu-slof-20210217/board-qemu/include -I. -g -Wall -W -O2 -I. -I../include -DRTAS_NVRAM -DBROKEN_SC1 -DDHCPARCH=0x0C  -c build_ffs.c -o build_ffs.o
make[2]: Leaving directory '/home/pterjan/rpmbuild/BUILD/slof-0.1.git20210217-build/SLOF-qemu-slof-20210217/romfs/tools'
make[3]: Entering directory '/home/pterjan/rpmbuild/BUILD/slof-0.1.git20210217-build/SLOF-qemu-slof-20210217/lib/libnet'
powerpc64-linux-gnu-gcc -m64  -M  -O2 -g -pipe -Wformat -Werror=format-security -Wp,-U_FORTIFY_SOURCE,-D_FORTIFY_SOURCE=3 -specs=/usr/lib/rpm/redhat/redhat-hardened-cc1 -fstack-protector-strong -m64 -fasynchronous-unwind-tables -fstack-clash-protection -fcf-protection=full -I. -I.. -I../libc/include -I/home/pterjan/rpmbuild/BUILD/slof-0.1.git20210217-build/SLOF-qemu-slof-20210217/include -DRTAS_NVRAM -DBROKEN_SC1 -DDHCPARCH=0x0C  ethernet.c ipv4.c udp.c tcp.c dns.c bootp.c dhcp.c tftp.c ipv6.c dhcpv6.c icmpv6.c ndp.c netload.c ping.c args.c pxelinux.c > Makefile.dep
cc1: error: '-fcf-protection=full' is not supported for this target
cc1: error: '-fcf-protection=full' is not supported for this target
cc1: error: '-fcf-protection=full' is not supported for this target
cc1: error: '-fcf-protection=full' is not supported for this target
cc1: error: '-fcf-protection=full' is not supported for this target
cc1: error: '-fcf-protection=full' is not supported for this target
cc1: error: '-fcf-protection=full' is not supported for this target
cc1: error: '-fcf-protection=full' is not supported for this target
cc1: error: '-fcf-protection=full' is not supported for this target
cc1: error: '-fcf-protection=full' is not supported for this target
cc1: error: '-fcf-protection=full' is not supported for this target
cc1: error: '-fcf-protection=full' is not supported for this target
cc1: error: '-fcf-protection=full' is not supported for this target
cc1: error: '-fcf-protection=full' is not supported for this target
cc1: error: '-fcf-protection=full' is not supported for this target
cc1: error: '-fcf-protection=full' is not supported for this target
make[3]: Leaving directory '/home/pterjan/rpmbuild/BUILD/slof-0.1.git20210217-build/SLOF-qemu-slof-20210217/lib/libnet'
make[3]: Entering directory '/home/pterjan/rpmbuild/BUILD/slof-0.1.git20210217-build/SLOF-qemu-slof-20210217/lib/libnet'
powerpc64-linux-gnu-gcc -m64   -O2 -g -pipe -Wformat -Werror=format-security -Wp,-U_FORTIFY_SOURCE,-D_FORTIFY_SOURCE=3 -specs=/usr/lib/rpm/redhat/redhat-hardened-cc1 -fstack-protector-strong -m64 -fasynchronous-unwind-tables -fstack-clash-protection -fcf-protection=full -I. -I.. -I../libc/include -I/home/pterjan/rpmbuild/BUILD/slof-0.1.git20210217-build/SLOF-qemu-slof-20210217/include -DRTAS_NVRAM -DBROKEN_SC1 -DDHCPARCH=0x0C  -o ethernet.o -c /home/pterjan/rpmbuild/BUILD/slof-0.1.git20210217-build/SLOF-qemu-slof-20210217/lib/libnet/ethernet.c
cc1: error: '-fcf-protection=full' is not supported for this target
make[3]: *** [/home/pterjan/rpmbuild/BUILD/slof-0.1.git20210217-build/SLOF-qemu-slof-20210217/make.rules:55: ethernet.o] Error 1
make[3]: Leaving directory '/home/pterjan/rpmbuild/BUILD/slof-0.1.git20210217-build/SLOF-qemu-slof-20210217/lib/libnet'
make[3]: *** Waiting for unfinished jobs....
make[3]: Entering directory '/home/pterjan/rpmbuild/BUILD/slof-0.1.git20210217-build/SLOF-qemu-slof-20210217/lib/libnet'
powerpc64-linux-gnu-gcc -m64   -O2 -g -pipe -Wformat -Werror=format-security -Wp,-U_FORTIFY_SOURCE,-D_FORTIFY_SOURCE=3 -specs=/usr/lib/rpm/redhat/redhat-hardened-cc1 -fstack-protector-strong -m64 -fasynchronous-unwind-tables -fstack-clash-protection -fcf-protection=full -I. -I.. -I../libc/include -I/home/pterjan/rpmbuild/BUILD/slof-0.1.git20210217-build/SLOF-qemu-slof-20210217/include -DRTAS_NVRAM -DBROKEN_SC1 -DDHCPARCH=0x0C  -o ipv4.o -c /home/pterjan/rpmbuild/BUILD/slof-0.1.git20210217-build/SLOF-qemu-slof-20210217/lib/libnet/ipv4.c
cc1: error: '-fcf-protection=full' is not supported for this target
make[3]: *** [/home/pterjan/rpmbuild/BUILD/slof-0.1.git20210217-build/SLOF-qemu-slof-20210217/make.rules:55: ipv4.o] Error 1
make[3]: Leaving directory '/home/pterjan/rpmbuild/BUILD/slof-0.1.git20210217-build/SLOF-qemu-slof-20210217/lib/libnet'
make[2]: *** [Makefile:24: libnet] Error 2
make[1]: *** [/home/pterjan/rpmbuild/BUILD/slof-0.1.git20210217-build/SLOF-qemu-slof-20210217/Makefile.gen:167: common-libs] Error 2
make[1]: *** Waiting for unfinished jobs....
make[2]: Entering directory '/home/pterjan/rpmbuild/BUILD/slof-0.1.git20210217-build/SLOF-qemu-slof-20210217/romfs/tools'
gcc -g -Wall -W -O2 -I. -I../include -DRTAS_NVRAM -DBROKEN_SC1 -DDHCPARCH=0x0C  -o build_romfs build_ffs.o cfg_parse.o create_flash.o create_crc.o crclib.o
make[2]: Leaving directory '/home/pterjan/rpmbuild/BUILD/slof-0.1.git20210217-build/SLOF-qemu-slof-20210217/romfs/tools'
make: *** [Makefile:56: qemu] Error 2
error: Bad exit status from /home/pterjan/rpmbuild/tmp/rpm-tmp.wv2xRs (%build)

RPM build warnings:
    /home/pterjan/rpmbuild/SPECS/slof.spec line 56: autopatch: no matching patches in range

RPM build errors:
    Bad exit status from /home/pterjan/rpmbuild/tmp/rpm-tmp.wv2xRs (%build)
I: [iurt_root_command] ERROR: chroot