D: [iurt_root_command] chroot
Building target platforms: x86_64
Building for target x86_64
sh: line 4: [: -j8: integer expression expected
sh: line 4: [: -j8: integer expression expected
Installing /home/pterjan/rpmbuild/SRPMS/dssi-1.1.1-10.mga10.src.rpm
Executing(%mkbuilddir): /bin/sh -e /home/pterjan/rpmbuild/tmp/rpm-tmp.T5Fu1n
+ umask 022
+ cd /home/pterjan/rpmbuild/BUILD/dssi-1.1.1-build
+ test -d /home/pterjan/rpmbuild/BUILD/dssi-1.1.1-build
+ /usr/bin/chmod -Rf a+rX,u+w,g-w,o-w /home/pterjan/rpmbuild/BUILD/dssi-1.1.1-build
+ /usr/bin/rm -rf /home/pterjan/rpmbuild/BUILD/dssi-1.1.1-build
+ /usr/bin/mkdir -p /home/pterjan/rpmbuild/BUILD/dssi-1.1.1-build
+ /usr/bin/mkdir -p /home/pterjan/rpmbuild/BUILD/dssi-1.1.1-build/SPECPARTS
+ RPM_EC=0
++ jobs -p
+ exit 0
sh: line 4: [: -j8: integer expression expected
Executing(%prep): /bin/sh -e /home/pterjan/rpmbuild/tmp/rpm-tmp.47xWF1
+ umask 022
+ cd /home/pterjan/rpmbuild/BUILD/dssi-1.1.1-build
+ '[' 1 -eq 1 ']'
+ '[' 1 -eq 1 ']'
+ '[' 1 -eq 1 ']'
+ cd /home/pterjan/rpmbuild/BUILD/dssi-1.1.1-build
+ rm -rf dssi-1.1.1
+ /usr/lib/rpm/rpmuncompress -x /home/pterjan/rpmbuild/SOURCES/dssi-1.1.1.tar.gz
+ STATUS=0
+ '[' 0 -ne 0 ']'
+ cd dssi-1.1.1
+ /usr/bin/chmod -Rf a+rX,u+w,g-w,o-w .
+ RPM_EC=0
++ jobs -p
+ exit 0
sh: line 4: [: -j8: integer expression expected
Executing(%build): /bin/sh -e /home/pterjan/rpmbuild/tmp/rpm-tmp.iNJDNI
+ umask 022
+ cd /home/pterjan/rpmbuild/BUILD/dssi-1.1.1-build
+ CFLAGS='-O2 -g -pipe -Wformat -Werror=format-security -Wp,-U_FORTIFY_SOURCE,-D_FORTIFY_SOURCE=3 -specs=/usr/lib/rpm/redhat/redhat-hardened-cc1 -fstack-protector-strong -m64 -fasynchronous-unwind-tables -fstack-clash-protection -fcf-protection=full'
+ export CFLAGS
+ CXXFLAGS='-O2 -g -pipe -Wformat -Werror=format-security -Wp,-U_FORTIFY_SOURCE,-D_FORTIFY_SOURCE=3 -specs=/usr/lib/rpm/redhat/redhat-hardened-cc1 -fstack-protector-strong -m64 -fasynchronous-unwind-tables -fstack-clash-protection -fcf-protection=full'
+ export CXXFLAGS
+ FFLAGS='-O2 -g -pipe -Wformat -Werror=format-security -Wp,-U_FORTIFY_SOURCE,-D_FORTIFY_SOURCE=3 -specs=/usr/lib/rpm/redhat/redhat-hardened-cc1 -fstack-protector-strong -m64 -fasynchronous-unwind-tables -fstack-clash-protection -fcf-protection=full '
+ export FFLAGS
+ FCFLAGS='-O2 -g -pipe -Wformat -Werror=format-security -Wp,-U_FORTIFY_SOURCE,-D_FORTIFY_SOURCE=3 -specs=/usr/lib/rpm/redhat/redhat-hardened-cc1 -fstack-protector-strong -m64 -fasynchronous-unwind-tables -fstack-clash-protection -fcf-protection=full '
+ export FCFLAGS
+ VALAFLAGS=-g
+ export VALAFLAGS
+ RUSTFLAGS='-Copt-level=3 -Cdebuginfo=2 -Ccodegen-units=1 -Cstrip=none --cap-lints=warn'
+ export RUSTFLAGS
+ LDFLAGS='-Wl,--as-needed -Wl,--no-undefined -Wl,-z,relro -Wl,-z,now -Wl,-O1 -Wl,--build-id=sha1 -Wl,--enable-new-dtags -specs=/usr/lib/rpm/redhat/redhat-hardened-ld'
+ export LDFLAGS
+ LT_SYS_LIBRARY_PATH=/usr/lib64:
+ export LT_SYS_LIBRARY_PATH
+ CC=gcc
+ export CC
+ CXX=g++
+ export CXX
+ cd dssi-1.1.1
+ '[' 1 -eq 1 ']'
+ '[' 1 -eq 1 ']'
+ autoreconf -vfi
autoreconf: export WARNINGS=
autoreconf: Entering directory '.'
autoreconf: configure.ac: not using Gettext
autoreconf: running: aclocal --force 
autoreconf: configure.ac: tracing
autoreconf: running: libtoolize --copy --force
libtoolize: putting auxiliary files in '.'.
libtoolize: copying file './ltmain.sh'
libtoolize: Consider adding 'AC_CONFIG_MACRO_DIRS([m4])' to configure.ac,
libtoolize: and rerunning libtoolize and aclocal.
libtoolize: Consider adding '-I m4' to ACLOCAL_AMFLAGS in Makefile.am.
autoreconf: configure.ac: not using Intltool
autoreconf: configure.ac: not using Gtkdoc
autoreconf: running: aclocal --force 
autoreconf: running: /usr/bin/autoconf --force
configure.ac:7: warning: 'AM_CONFIG_HEADER': this macro is obsolete.
configure.ac:7: You should use the 'AC_CONFIG_HEADERS' macro instead.
aclocal.m4:10247: AM_CONFIG_HEADER is expanded from...
configure.ac:7: the top level
configure.ac:13: warning: The macro 'AC_PROG_LIBTOOL' is obsolete.
configure.ac:13: You should run autoupdate.
aclocal.m4:122: AC_PROG_LIBTOOL is expanded from...
configure.ac:13: the top level
configure.ac:61: warning: The macro 'AC_LANG_CPLUSPLUS' is obsolete.
configure.ac:61: You should run autoupdate.
./lib/autoconf/c.m4:270: AC_LANG_CPLUSPLUS is expanded from...
configure.ac:61: the top level
configure.ac:88: warning: The macro 'AC_LANG_CPLUSPLUS' is obsolete.
configure.ac:88: You should run autoupdate.
./lib/autoconf/c.m4:270: AC_LANG_CPLUSPLUS is expanded from...
configure.ac:88: the top level
configure.ac:91: warning: The macro 'AC_TRY_COMPILE' is obsolete.
configure.ac:91: You should run autoupdate.
./lib/autoconf/general.m4:2845: AC_TRY_COMPILE is expanded from...
configure.ac:91: the top level
configure.ac:158: warning: AC_OUTPUT should be used without arguments.
configure.ac:158: You should run autoupdate.
autoreconf: running: /usr/bin/autoheader --force
autoreconf: running: automake --add-missing --copy --force-missing
configure.ac:9: installing './compile'
configure.ac:6: installing './missing'
examples/Makefile.am:114: warning: '%'-style pattern rules are a GNU make extension
examples/Makefile.am: installing './depcomp'
jack-dssi-host/Makefile.am:13: warning: source file '../message_buffer/message_buffer.c' is in a subdirectory,
jack-dssi-host/Makefile.am:13: but option 'subdir-objects' is disabled
automake: warning: possible forward-incompatibility.
automake: At least one source file is in a subdirectory, but the 'subdir-objects'
automake: automake option hasn't been enabled.  For now, the corresponding output
automake: object file(s) will be placed in the top-level directory.  However, this
automake: behavior may change in a future Automake major version, with object
automake: files being placed in the same subdirectory as the corresponding sources.
automake: You are advised to start using 'subdir-objects' option throughout your
automake: project, to avoid future incompatibility.
parallel-tests: installing './test-driver'
autoreconf: Leaving directory '.'
+ CFLAGS='-O2 -g -pipe -Wformat -Werror=format-security -Wp,-U_FORTIFY_SOURCE,-D_FORTIFY_SOURCE=3 -specs=/usr/lib/rpm/redhat/redhat-hardened-cc1 -fstack-protector-strong -m64 -fasynchronous-unwind-tables -fstack-clash-protection -fcf-protection=full'
+ export CFLAGS
+ CXXFLAGS='-O2 -g -pipe -Wformat -Werror=format-security -Wp,-U_FORTIFY_SOURCE,-D_FORTIFY_SOURCE=3 -specs=/usr/lib/rpm/redhat/redhat-hardened-cc1 -fstack-protector-strong -m64 -fasynchronous-unwind-tables -fstack-clash-protection -fcf-protection=full'
+ export CXXFLAGS
+ FFLAGS='-O2 -g -pipe -Wformat -Werror=format-security -Wp,-U_FORTIFY_SOURCE,-D_FORTIFY_SOURCE=3 -specs=/usr/lib/rpm/redhat/redhat-hardened-cc1 -fstack-protector-strong -m64 -fasynchronous-unwind-tables -fstack-clash-protection -fcf-protection=full '
+ export FFLAGS
+ FCFLAGS='-O2 -g -pipe -Wformat -Werror=format-security -Wp,-U_FORTIFY_SOURCE,-D_FORTIFY_SOURCE=3 -specs=/usr/lib/rpm/redhat/redhat-hardened-cc1 -fstack-protector-strong -m64 -fasynchronous-unwind-tables -fstack-clash-protection -fcf-protection=full '
+ export FCFLAGS
+ VALAFLAGS=-g
+ export VALAFLAGS
+ RUSTFLAGS='-Copt-level=3 -Cdebuginfo=2 -Ccodegen-units=1 -Cstrip=none --cap-lints=warn'
+ export RUSTFLAGS
+ LDFLAGS='-Wl,--as-needed -Wl,--no-undefined -Wl,-z,relro -Wl,-z,now -Wl,-O1 -Wl,--build-id=sha1 -Wl,--enable-new-dtags -specs=/usr/lib/rpm/redhat/redhat-hardened-ld'
+ export LDFLAGS
+ LT_SYS_LIBRARY_PATH=/usr/lib64:
+ export LT_SYS_LIBRARY_PATH
+ CC=gcc
+ export CC
+ CXX=g++
+ export CXX
+ CONFIGURE_TOP=.
+ '[' 1 = 1 ']'
++ find . -name config.guess -o -name config.sub
+ for i in $(find ${CONFIGURE_TOP} -name config.guess -o -name config.sub)
++ basename ./config.guess
+ '[' -f /usr/lib/rpm/mageia/config.guess ']'
++ basename ./config.guess
+ cp -af /usr/lib/rpm/mageia/config.guess ./config.guess
+ for i in $(find ${CONFIGURE_TOP} -name config.guess -o -name config.sub)
++ basename ./config.sub
+ '[' -f /usr/lib/rpm/mageia/config.sub ']'
++ basename ./config.sub
+ cp -af /usr/lib/rpm/mageia/config.sub ./config.sub
+ /usr/lib/rpm/mageia/force-as-needed-for-shared-lib-in-libtool
Forcing -Wl,--as-needed in configure/libtool to workaround libtool bug (cf http://lists.gnu.org/archive/html/libtool-patches/2004-06/msg00002.html)
+ /usr/lib/rpm/mageia/drop-ld-no-undefined-for-shared-lib-modules-in-libtool
Modifying ltmain.sh underlinking for plugins (cf http://wiki.mandriva.com/en/Underlinking)
+ /usr/lib/rpm/mageia/fix-libtool-ltmain-from-overlinking
Fixing libtool's ltmain.sh to prevent overlinking (cf http://wiki.mandriva.com/en/Overlinking)
+ /usr/lib/rpm/mageia/fix-libtool-from-moving-options-after-libs .
+ /usr/lib/rpm/mageia/fix-dlsearch-path-in-libtool-for-multilib . lib64
+ ./configure --host=x86_64-mageia-linux-gnu --build=x86_64-mageia-linux-gnu --program-prefix= --disable-dependency-tracking --prefix=/usr --exec-prefix=/usr --bindir=/usr/bin --sbindir=/usr/sbin --sysconfdir=/etc --datadir=/usr/share --includedir=/usr/include --libdir=/usr/lib64 --libexecdir=/usr/libexec --localstatedir=/var --sharedstatedir=/var/lib --mandir=/usr/share/man --infodir=/usr/share/info
checking for a BSD-compatible install... /usr/bin/install -c
checking whether sleep supports fractional seconds... yes
checking filesystem timestamp resolution... 0.01
checking whether build environment is sane... yes
checking for a race-free mkdir -p... /usr/bin/mkdir -p
checking for gawk... gawk
checking whether make sets $(MAKE)... yes
checking whether make supports nested variables... yes
checking xargs -n works... yes
checking for x86_64-mageia-linux-gnu-gcc... gcc
checking whether the C compiler works... yes
checking for C compiler default output file name... a.out
checking for suffix of executables... 
checking whether we are cross compiling... no
checking for suffix of object files... o
checking whether the compiler supports GNU C... yes
checking whether gcc accepts -g... yes
checking for gcc option to enable C11 features... none needed
checking whether gcc understands -c and -o together... yes
checking whether make supports the include directive... yes (GNU style)
checking dependency style of gcc... none
checking whether the compiler supports GNU C++... yes
checking whether g++ accepts -g... yes
checking for g++ option to enable C++11 features... none needed
checking dependency style of g++... none
checking build system type... x86_64-mageia-linux-gnu
checking host system type... x86_64-mageia-linux-gnu
checking how to print strings... printf
checking for a sed that does not truncate output... /usr/bin/sed
checking for grep that handles long lines and -e... /usr/bin/grep
checking for egrep... /usr/bin/grep -E
checking for fgrep... /usr/bin/grep -F
checking for ld used by gcc... /usr/bin/ld
checking if the linker (/usr/bin/ld) is GNU ld... yes
checking for BSD- or MS-compatible name lister (nm)... /usr/bin/nm -B
checking the name lister (/usr/bin/nm -B) interface... BSD nm
checking whether ln -s works... yes
checking the maximum length of command line arguments... 1572864
checking how to convert x86_64-mageia-linux-gnu file names to x86_64-mageia-linux-gnu format... func_convert_file_noop
checking how to convert x86_64-mageia-linux-gnu file names to toolchain format... func_convert_file_noop
checking for /usr/bin/ld option to reload object files... -r
checking for file... file
checking for x86_64-mageia-linux-gnu-objdump... no
checking for objdump... objdump
checking how to recognize dependent libraries... pass_all
checking for x86_64-mageia-linux-gnu-dlltool... no
checking for dlltool... no
checking how to associate runtime and link libraries... printf %s\n
checking for x86_64-mageia-linux-gnu-ranlib... no
checking for ranlib... ranlib
checking for x86_64-mageia-linux-gnu-ar... no
checking for ar... ar
checking for archiver @FILE support... @
checking for x86_64-mageia-linux-gnu-strip... no
checking for strip... strip
checking command to parse /usr/bin/nm -B output from gcc object... ok
checking for sysroot... no
checking for a working dd... /usr/bin/dd
checking how to truncate binary pipes... /usr/bin/dd bs=4096 count=1
checking for x86_64-mageia-linux-gnu-mt... no
checking for mt... no
checking if : is a manifest tool... no
checking for stdio.h... yes
checking for stdlib.h... yes
checking for string.h... yes
checking for inttypes.h... yes
checking for stdint.h... yes
checking for strings.h... yes
checking for sys/stat.h... yes
checking for sys/types.h... yes
checking for unistd.h... yes
checking for dlfcn.h... yes
checking for objdir... .libs
checking if gcc supports -fno-rtti -fno-exceptions... no
checking for gcc option to produce PIC... -fPIC -DPIC
checking if gcc PIC flag -fPIC -DPIC works... yes
checking if gcc static flag -static works... no
checking if gcc supports -c -o file.o... yes
checking if gcc supports -c -o file.o... (cached) yes
checking whether the gcc linker (/usr/bin/ld -m elf_x86_64) supports shared libraries... yes
checking whether -lc should be explicitly linked in... no
checking dynamic linker characteristics... GNU/Linux ld.so
checking how to hardcode library paths into programs... immediate
checking whether stripping libraries is possible... yes
checking if libtool supports shared libraries... yes
checking whether to build shared libraries... yes
checking whether to build static libraries... no
checking how to run the C++ preprocessor... g++ -E
checking for ld used by g++... /usr/bin/ld -m elf_x86_64
checking if the linker (/usr/bin/ld -m elf_x86_64) is GNU ld... yes
checking whether the g++ linker (/usr/bin/ld -m elf_x86_64) supports shared libraries... yes
checking for g++ option to produce PIC... -fPIC -DPIC
checking if g++ PIC flag -fPIC -DPIC works... yes
checking if g++ static flag -static works... no
checking if g++ supports -c -o file.o... yes
checking if g++ supports -c -o file.o... (cached) yes
checking whether the g++ linker (/usr/bin/ld -m elf_x86_64) supports shared libraries... yes
checking dynamic linker characteristics... (cached) GNU/Linux ld.so
checking how to hardcode library paths into programs... immediate
checking whether ln -s works... yes
checking whether byte ordering is bigendian... no
checking for ladspa.h... yes
checking for x86_64-mageia-linux-gnu-pkg-config... /usr/bin/x86_64-mageia-linux-gnu-pkg-config
checking pkg-config is at least version 0.9.0... yes
checking for alsa >= 0.9... yes
checking for liblo >= 0.12... yes
checking for jack >= 0.99.14... yes
checking for sndfile... yes
checking for samplerate... yes
checking for QtCore >= 4.0.1 QtGui >= 4.0.1... no
configure: pkg-config could not find Qt >= 4.0.1
checking that generated files are newer than configure... done
configure: creating ./config.status
config.status: creating Makefile
config.status: creating dssi.pc
config.status: creating jack-dssi-host/Makefile
config.status: creating examples/Makefile
config.status: creating tests/Makefile
config.status: creating config.h
config.status: executing depfiles commands
config.status: executing libtool commands
* ======== DSSI 1.1.1 configured ========
* building jack-dssi-host:            yes
* building DSSI list/analyse tools:   yes
* building DSSI OSC tools:            yes
* building trivial_synth plugin:      yes
* building less_trivial_synth plugin: yes
* building karplong plugin:           yes
* building trivial_sampler plugin:    yes
* building less_trivial_synth GUI:    no (missing Qt4)
* building trivial_sampler GUI:       no (missing Qt4)
+ /usr/bin/make -O -j48 V=1 VERBOSE=1
/usr/bin/make  all-recursive
Making all in jack-dssi-host
make[2]: Entering directory '/home/pterjan/rpmbuild/BUILD/dssi-1.1.1-build/dssi-1.1.1/jack-dssi-host'
gcc -DHAVE_CONFIG_H -I. -I..    -I../dssi     -O2 -g -pipe -Wformat -Werror=format-security -Wp,-U_FORTIFY_SOURCE,-D_FORTIFY_SOURCE=3 -specs=/usr/lib/rpm/redhat/redhat-hardened-cc1 -fstack-protector-strong -m64 -fasynchronous-unwind-tables -fstack-clash-protection -fcf-protection=full -Wall -c -o jack_dssi_host-message_buffer.o `test -f '../message_buffer/message_buffer.c' || echo './'`../message_buffer/message_buffer.c
make[2]: Leaving directory '/home/pterjan/rpmbuild/BUILD/dssi-1.1.1-build/dssi-1.1.1/jack-dssi-host'
make[2]: Entering directory '/home/pterjan/rpmbuild/BUILD/dssi-1.1.1-build/dssi-1.1.1/jack-dssi-host'
gcc -DHAVE_CONFIG_H -I. -I..    -I../dssi     -O2 -g -pipe -Wformat -Werror=format-security -Wp,-U_FORTIFY_SOURCE,-D_FORTIFY_SOURCE=3 -specs=/usr/lib/rpm/redhat/redhat-hardened-cc1 -fstack-protector-strong -m64 -fasynchronous-unwind-tables -fstack-clash-protection -fcf-protection=full -Wall -c -o jack_dssi_host-jack-dssi-host.o `test -f 'jack-dssi-host.c' || echo './'`jack-dssi-host.c
In file included from /usr/include/unistd.h:25,
                 from /usr/include/alsa/asoundlib.h:31,
                 from jack-dssi-host.c:41:
/usr/include/features.h:197:3: warning: #warning "_BSD_SOURCE and _SVID_SOURCE are deprecated, use _DEFAULT_SOURCE" [-Wcpp]
  197 | # warning "_BSD_SOURCE and _SVID_SOURCE are deprecated, use _DEFAULT_SOURCE"
      |   ^~~~~~~
jack-dssi-host.c: In function 'main':
jack-dssi-host.c:1236:59: error: passing argument 4 of 'lo_server_thread_add_method' from incompatible pointer type [-Wincompatible-pointer-types]
 1236 |     lo_server_thread_add_method(serverThread, NULL, NULL, osc_message_handler,
      |                                                           ^~~~~~~~~~~~~~~~~~~
      |                                                           |
      |                                                           int (*)(const char *, const char *, lo_arg **, int,  void *, void *)
In file included from /usr/include/lo/lo.h:33,
                 from jack-dssi-host.c:60:
/usr/include/lo/lo_serverthread.h:151:72: note: expected 'lo_method_handler' {aka 'int (*)(const char *, const char *, lo_arg **, int,  struct lo_message_ *, void *)'} but argument is of type 'int (*)(const char *, const char *, lo_arg **, int,  void *, void *)'
  151 |                                const char *typespec, lo_method_handler h,
      |                                                      ~~~~~~~~~~~~~~~~~~^
make[2]: *** [Makefile:460: jack_dssi_host-jack-dssi-host.o] Error 1
make[2]: Leaving directory '/home/pterjan/rpmbuild/BUILD/dssi-1.1.1-build/dssi-1.1.1/jack-dssi-host'
make[1]: *** [Makefile:566: all-recursive] Error 1
make: *** [Makefile:411: all] Error 2
error: Bad exit status from /home/pterjan/rpmbuild/tmp/rpm-tmp.iNJDNI (%build)

RPM build errors:
    Bad exit status from /home/pterjan/rpmbuild/tmp/rpm-tmp.iNJDNI (%build)
I: [iurt_root_command] ERROR: chroot