D: [iurt_root_command] chroot
RTNETLINK answers: Invalid argument
RTNETLINK answers: Invalid argument
RTNETLINK answers: Invalid argument
RTNETLINK answers: Invalid argument
Installing /home/iurt/rpmbuild/SRPMS/powerdevil-5.20.2-1.mga8.src.rpm
Building target platforms: x86_64
Building for target x86_64
Executing(%prep): /bin/sh -e /home/iurt/rpmbuild/tmp/rpm-tmp.Gqx29t
+ umask 022
+ cd /home/iurt/rpmbuild/BUILD
+ '[' 1 -eq 1 ']'
+ '[' 1 -eq 1 ']'
+ '[' 1 -eq 1 ']'
+ cd /home/iurt/rpmbuild/BUILD
+ rm -rf powerdevil-5.20.2
+ /usr/bin/xz -dc /home/iurt/rpmbuild/SOURCES/powerdevil-5.20.2.tar.xz
+ /usr/bin/tar -xof -
+ STATUS=0
+ '[' 0 -ne 0 ']'
+ cd powerdevil-5.20.2
+ /usr/bin/chmod -Rf a+rX,u+w,g-w,o-w .
+ RPM_EC=0
++ jobs -p
+ exit 0
Executing(%build): /bin/sh -e /home/iurt/rpmbuild/tmp/rpm-tmp.reBXIs
+ umask 022
+ cd /home/iurt/rpmbuild/BUILD
+ cd powerdevil-5.20.2
+ '[' 1 -eq 1 ']'
+ '[' 1 -eq 1 ']'
+ QTDIR=/usr/lib64/qt5
+ export QTDIR
+ PATH=/usr/lib64/qt5/bin:/usr/local/bin:/usr/bin:/usr/local/games:/usr/games:/usr/local/sbin:/usr/sbin:/usr/lib64/qt5/bin:/home/iurt/.local/bin:/home/iurt/bin
+ export PATH
+ CFLAGS='-O2 -g -pipe -Wformat -Werror=format-security -Wp,-D_FORTIFY_SOURCE=2 -fstack-protector --param=ssp-buffer-size=4 -fasynchronous-unwind-tables'
+ export CFLAGS
+ CXXFLAGS='-O2 -g -pipe -Wformat -Werror=format-security -Wp,-D_FORTIFY_SOURCE=2 -fstack-protector --param=ssp-buffer-size=4 -fasynchronous-unwind-tables'
+ export CXXFLAGS
+ FFLAGS='-O2 -g -pipe -Wformat -Werror=format-security -Wp,-D_FORTIFY_SOURCE=2 -fstack-protector --param=ssp-buffer-size=4 -fasynchronous-unwind-tables '
+ export FFLAGS
+ FCFLAGS='-O2 -g -pipe -Wformat -Werror=format-security -Wp,-D_FORTIFY_SOURCE=2 -fstack-protector --param=ssp-buffer-size=4 -fasynchronous-unwind-tables '
+ export FCFLAGS
+ LDFLAGS=' -Wl,--as-needed -Wl,--no-undefined -Wl,-z,relro -Wl,-O1 -Wl,--build-id -Wl,--enable-new-dtags'
+ export LDFLAGS
+ /usr/bin/cmake -Wno-dev -S . -B build -DCMAKE_INSTALL_PREFIX:PATH=/usr -DCMAKE_INSTALL_LIBDIR:PATH=/usr/lib64 -DCMAKE_INSTALL_LIBEXECDIR:PATH=/usr/libexec -DCMAKE_INSTALL_RUNSTATEDIR:PATH=/run -DCMAKE_INSTALL_SYSCONFDIR:PATH=/etc -DINCLUDE_INSTALL_DIR:PATH=/usr/include -DLIB_INSTALL_DIR:PATH=/usr/lib64 -DSYSCONF_INSTALL_DIR:PATH=/etc -DSHARE_INSTALL_PREFIX:PATH=/usr/share -DCMAKE_BUILD_TYPE=RelWithDebInfo -DCMAKE_CXX_FLAGS_RELWITHDEBINFO:STRING=-DNDEBUG -DCMAKE_C_FLAGS_RELWITHDEBINFO:STRING=-DNDEBUG -DLIB_SUFFIX=64 -DCMAKE_VERBOSE_MAKEFILE:BOOL=ON '-DCMAKE_MODULE_LINKER_FLAGS=-Wl,--as-needed -Wl,-z,relro -Wl,-O1 -Wl,--build-id -Wl,--enable-new-dtags' -DBUILD_SHARED_LIBS:BOOL=ON -DBUILD_STATIC_LIBS:BOOL=OFF -DBUILD_SHARED_LIBS:BOOL=ON -DBUILD_TESTING:BOOL=FALSE -DCMAKE_INSTALL_PREFIX:PATH=/usr -DCMAKE_INSTALL_FULL_BINDIR=/usr/bin -DCMAKE_INSTALL_FULL_LIBEXECDIR=/usr/libexec -DCMAKE_INSTALL_FULL_LIBEXECDIR_KF5=/usr/libexec/kf5 -DCMAKE_USE_RELATIVE_PATHS:BOOL=ON -DCMAKE_VERBOSE_MAKEFILE:BOOL=ON -DBIN_INSTALL_DIR:PATH=/usr/bin -DINCLUDE_INSTALL_DIR:PATH=/usr/include -DLIB_INSTALL_DIR:PATH=lib64 -DKCFG_INSTALL_DIR:PATH=/usr/share/config.kcfg -DPLUGIN_INSTALL_DIR:PATH=/usr/lib64/qt5/plugins -DQT_PLUGIN_INSTALL_DIR:PATH=/usr/lib64/qt5/plugins -DQML_INSTALL_DIR:PATH=/usr/lib64/qt5/qml -DIMPORTS_INSTALL_DIR:PATH=/usr/lib64/qt5/imports -DECM_MKSPECS_INSTALL_DIR:PATH=/usr/lib64/qt5/mkspecs/modules -DSYSCONF_INSTALL_DIR:PATH=/etc -DLIBEXEC_INSTALL_DIR:PATH=/usr/libexec -DKF5_LIBEXEC_INSTALL_DIR=/usr/libexec/kf5 -DKF5_INCLUDE_INSTALL_DIR=/usr/include/KF5 -DDBUS_INTERFACES_INSTALL_DIR=share/dbus-1/interfaces -DKDE_INSTALL_USE_QT_SYS_PATHS:BOOL=ON -DKDE_INSTALL_BINDIR:PATH=/usr/bin -DKDE_INSTALL_INCLUDEDIR:PATH=/usr/include -DKDE_INSTALL_KCFGDIR:PATH=/usr/share/config.kcfg -DKDE_INSTALL_LIBDIR:PATH=/usr/lib64 -DKDE_INSTALL_LIBEXECDIR:PATH=/usr/libexec -DKDE_INSTALL_METAINFODIR:PATH=/usr/share/metainfo -DKDE_INSTALL_PLUGINDIR:PATH=/usr/lib64/qt5/plugins -DKDE_INSTALL_QMLDIR:PATH=/usr/lib64/qt5/qml -DKDE_INSTALL_QTPLUGINDIR:PATH=/usr/lib64/qt5/plugins -DKDE_INSTALL_QTQUICKIMPORTSDIR:PATH=/usr/lib64/qt5/imports -DKDE_INSTALL_SYSCONFDIR:PATH=/etc
-- The C compiler identification is GNU 10.2.0
-- The CXX compiler identification is GNU 10.2.0
-- Detecting C compiler ABI info
-- Detecting C compiler ABI info - done
-- Check for working C compiler: /usr/bin/cc - skipped
-- Detecting C compile features
-- Detecting C compile features - done
-- Detecting CXX compiler ABI info
-- Detecting CXX compiler ABI info - done
-- Check for working CXX compiler: /usr/bin/c++ - skipped
-- Detecting CXX compile features
-- Detecting CXX compile features - done
-- Looking for __GLIBC__
-- Looking for __GLIBC__ - found
-- Performing Test _OFFT_IS_64BIT
-- Performing Test _OFFT_IS_64BIT - Success
-- Performing Test HAVE_DATE_TIME
-- Performing Test HAVE_DATE_TIME - Success
-- Found KF5Activities: /usr/lib64/cmake/KF5Activities/KF5ActivitiesConfig.cmake (found version "5.75.0")
-- Found KF5Auth: /usr/lib64/cmake/KF5Auth/KF5AuthConfig.cmake (found version "5.75.0")
-- Found KF5IdleTime: /usr/lib64/cmake/KF5IdleTime/KF5IdleTimeConfig.cmake (found version "5.75.0")
-- Found KF5Config: /usr/lib64/cmake/KF5Config/KF5ConfigConfig.cmake (found version "5.75.0")
-- Found KF5DBusAddons: /usr/lib64/cmake/KF5DBusAddons/KF5DBusAddonsConfig.cmake (found version "5.75.0")
-- Found KF5Solid: /usr/lib64/cmake/KF5Solid/KF5SolidConfig.cmake (found version "5.75.0")
-- Found Gettext: /usr/bin/msgmerge (found version "0.21")
-- Found KF5I18n: /usr/lib64/cmake/KF5I18n/KF5I18nConfig.cmake (found version "5.75.0")
-- Found KF5GlobalAccel: /usr/lib64/cmake/KF5GlobalAccel/KF5GlobalAccelConfig.cmake (found version "5.75.0")
-- Found KF5KIO: /usr/lib64/cmake/KF5KIO/KF5KIOConfig.cmake (found version "5.75.0")
-- Found KF5NotifyConfig: /usr/lib64/cmake/KF5NotifyConfig/KF5NotifyConfigConfig.cmake (found version "5.75.0")
-- Found KF5Wayland: /usr/lib64/cmake/KF5Wayland/KF5WaylandConfig.cmake (found version "5.75.0")
-- Found KF5DocTools: /usr/lib64/cmake/KF5DocTools/KF5DocToolsConfig.cmake (found version "5.75.0")
-- Found KF5Crash: /usr/lib64/cmake/KF5Crash/KF5CrashConfig.cmake (found version "5.75.0")
-- Found KF5Notifications: /usr/lib64/cmake/KF5Notifications/KF5NotificationsConfig.cmake (found version "5.75.0")
-- Found KF5: success (found suitable version "5.75.0", minimum required is "5.74") found components: Activities Auth IdleTime Config DBusAddons Solid I18n GlobalAccel KIO NotifyConfig Wayland DocTools Crash Notifications
-- Found UDev: /usr/include (found version "246")
-- Found PkgConfig: /usr/bin/pkg-config (found version "1.7.3")
-- Found XCB_XCB: /usr/lib64/libxcb.so (found version "1.14")
-- Found XCB_DPMS: /usr/lib64/libxcb-dpms.so (found version "1.14")
-- Found XCB_RANDR: /usr/lib64/libxcb-randr.so (found version "1.14")
-- Found XCB: /usr/lib64/libxcb.so;/usr/lib64/libxcb-dpms.so;/usr/lib64/libxcb-randr.so (found version "1.14") found components: XCB RANDR DPMS
-- Found Libcap: /usr/sbin/setcap
-- The following features have been enabled:
* Wireless power saving, Support turning off signal-transmitting devices to save energy
-- The following OPTIONAL packages have been found:
* KF5Service (required version >= 5.75.0)
* KF5Completion (required version >= 5.75.0)
* KF5ItemViews (required version >= 5.75.0)
* KF5JobWidgets (required version >= 5.75.0)
* KF5CoreAddons (required version >= 5.75.0)
* KF5Codecs (required version >= 5.75.0)
* KF5WidgetsAddons (required version >= 5.75.0)
* KF5ConfigWidgets (required version >= 5.75.0)
* KF5XmlGui (required version >= 5.75.0)
* KF5WindowSystem (required version >= 5.75.0)
* KF5BluezQt (required version >= 5.74), Qt wrapper for BlueZ 5 DBus API
Support for wireless energy saving actions
* KF5NetworkManagerQt (required version >= 5.74), Qt wrapper for NetworkManager API
Support for wireless energy saving actions
* PkgConfig
* Libcap, Capabilities are a measure to limit the omnipotence of the superuser.,
Needed for scheduled wakeup which can wake from suspend (CAP_WAKE_ALARM)
-- The following REQUIRED packages have been found:
* ECM (required version >= 5.74)
* Qt5X11Extras
* Qt5 (required version >= 5.15.0)
* KF5Activities (required version >= 5.74)
* KF5IdleTime (required version >= 5.74)
* KF5DBusAddons (required version >= 5.74)
* Gettext
* KF5I18n (required version >= 5.74)
* KF5GlobalAccel (required version >= 5.74)
* KF5Solid (required version >= 5.75.0)
* KF5Auth (required version >= 5.75.0)
* KF5KIO (required version >= 5.74)
* KF5NotifyConfig (required version >= 5.74)
* KF5Wayland (required version >= 5.74)
* KF5DocTools (required version >= 5.74)
* KF5Crash (required version >= 5.74)
* Qt5Widgets (required version >= 5.12.0)
* Qt5DBus (required version >= 5.12.0)
* KF5Notifications (required version >= 5.74)
* KF5 (required version >= 5.74)
* Qt5Gui (required version >= 5.15.0)
* KF5Screen
* Qt5Core (required version >= 5.15.0)
* LibKWorkspace (required version >= 5.20.2)
* UDev, API for enumerating and introspecting local devices (part of systemd),
* XCB, X protocol C-language Binding,
-- The following features have been disabled:
* DDCUtil, DDCUtil library support is disabled by default as recommended by authors, add -DHAVE_DDCUTIL=On to enable
-- Configuring done
-- Generating done
CMake Warning:
Manually-specified variables were not used by the project:
BUILD_STATIC_LIBS
CMAKE_C_FLAGS_RELWITHDEBINFO
CMAKE_INSTALL_RUNSTATEDIR
CMAKE_USE_RELATIVE_PATHS
ECM_MKSPECS_INSTALL_DIR
LIB_SUFFIX
-- Build files have been written to: /home/iurt/rpmbuild/BUILD/powerdevil-5.20.2/build
+ /usr/bin/cmake --build build -j8 --verbose
/usr/bin/cmake -S/home/iurt/rpmbuild/BUILD/powerdevil-5.20.2 -B/home/iurt/rpmbuild/BUILD/powerdevil-5.20.2/build --check-build-system CMakeFiles/Makefile.cmake 0
/usr/bin/cmake -E cmake_progress_start /home/iurt/rpmbuild/BUILD/powerdevil-5.20.2/build/CMakeFiles /home/iurt/rpmbuild/BUILD/powerdevil-5.20.2/build//CMakeFiles/progress.marks
/usr/bin/gmake -f CMakeFiles/Makefile2 all
gmake[1]: Entering directory '/home/iurt/rpmbuild/BUILD/powerdevil-5.20.2/build'
/usr/bin/gmake -f CMakeFiles/po-uk-docs-kcontrol-powerdevil-index-cache-bz2.dir/build.make CMakeFiles/po-uk-docs-kcontrol-powerdevil-index-cache-bz2.dir/depend
/usr/bin/gmake -f CMakeFiles/po-ru-docs-kcontrol-powerdevil-index-cache-bz2.dir/build.make CMakeFiles/po-ru-docs-kcontrol-powerdevil-index-cache-bz2.dir/depend
/usr/bin/gmake -f CMakeFiles/po-pt-BR-docs-kcontrol-powerdevil-index-cache-bz2.dir/build.make CMakeFiles/po-pt-BR-docs-kcontrol-powerdevil-index-cache-bz2.dir/depend
/usr/bin/gmake -f CMakeFiles/po-pt-docs-kcontrol-powerdevil-index-cache-bz2.dir/build.make CMakeFiles/po-pt-docs-kcontrol-powerdevil-index-cache-bz2.dir/depend
/usr/bin/gmake -f CMakeFiles/po-ca-docs-kcontrol-powerdevil-index-cache-bz2.dir/build.make CMakeFiles/po-ca-docs-kcontrol-powerdevil-index-cache-bz2.dir/depend
gmake[2]: Entering directory '/home/iurt/rpmbuild/BUILD/powerdevil-5.20.2/build'
cd /home/iurt/rpmbuild/BUILD/powerdevil-5.20.2/build && /usr/bin/cmake -E cmake_depends "Unix Makefiles" /home/iurt/rpmbuild/BUILD/powerdevil-5.20.2 /home/iurt/rpmbuild/BUILD/powerdevil-5.20.2 /home/iurt/rpmbuild/BUILD/powerdevil-5.20.2/build /home/iurt/rpmbuild/BUILD/powerdevil-5.20.2/build /home/iurt/rpmbuild/BUILD/powerdevil-5.20.2/build/CMakeFiles/po-uk-docs-kcontrol-powerdevil-index-cache-bz2.dir/DependInfo.cmake --color=
gmake[2]: Entering directory '/home/iurt/rpmbuild/BUILD/powerdevil-5.20.2/build'
cd /home/iurt/rpmbuild/BUILD/powerdevil-5.20.2/build && /usr/bin/cmake -E cmake_depends "Unix Makefiles" /home/iurt/rpmbuild/BUILD/powerdevil-5.20.2 /home/iurt/rpmbuild/BUILD/powerdevil-5.20.2 /home/iurt/rpmbuild/BUILD/powerdevil-5.20.2/build /home/iurt/rpmbuild/BUILD/powerdevil-5.20.2/build /home/iurt/rpmbuild/BUILD/powerdevil-5.20.2/build/CMakeFiles/po-ru-docs-kcontrol-powerdevil-index-cache-bz2.dir/DependInfo.cmake --color=
gmake[2]: Entering directory '/home/iurt/rpmbuild/BUILD/powerdevil-5.20.2/build'
cd /home/iurt/rpmbuild/BUILD/powerdevil-5.20.2/build && /usr/bin/cmake -E cmake_depends "Unix Makefiles" /home/iurt/rpmbuild/BUILD/powerdevil-5.20.2 /home/iurt/rpmbuild/BUILD/powerdevil-5.20.2 /home/iurt/rpmbuild/BUILD/powerdevil-5.20.2/build /home/iurt/rpmbuild/BUILD/powerdevil-5.20.2/build /home/iurt/rpmbuild/BUILD/powerdevil-5.20.2/build/CMakeFiles/po-pt-BR-docs-kcontrol-powerdevil-index-cache-bz2.dir/DependInfo.cmake --color=
/usr/bin/gmake -f CMakeFiles/tsfiles-1461fade86c8906cf14134d5adb52f0b.dir/build.make CMakeFiles/tsfiles-1461fade86c8906cf14134d5adb52f0b.dir/depend
gmake[2]: Entering directory '/home/iurt/rpmbuild/BUILD/powerdevil-5.20.2/build'
cd /home/iurt/rpmbuild/BUILD/powerdevil-5.20.2/build && /usr/bin/cmake -E cmake_depends "Unix Makefiles" /home/iurt/rpmbuild/BUILD/powerdevil-5.20.2 /home/iurt/rpmbuild/BUILD/powerdevil-5.20.2 /home/iurt/rpmbuild/BUILD/powerdevil-5.20.2/build /home/iurt/rpmbuild/BUILD/powerdevil-5.20.2/build /home/iurt/rpmbuild/BUILD/powerdevil-5.20.2/build/CMakeFiles/po-pt-docs-kcontrol-powerdevil-index-cache-bz2.dir/DependInfo.cmake --color=
/usr/bin/gmake -f CMakeFiles/po-de-docs-kcontrol-powerdevil-index-cache-bz2.dir/build.make CMakeFiles/po-de-docs-kcontrol-powerdevil-index-cache-bz2.dir/depend
/usr/bin/gmake -f CMakeFiles/pofiles-1461fade86c8906cf14134d5adb52f0b.dir/build.make CMakeFiles/pofiles-1461fade86c8906cf14134d5adb52f0b.dir/depend
gmake[2]: Entering directory '/home/iurt/rpmbuild/BUILD/powerdevil-5.20.2/build'
cd /home/iurt/rpmbuild/BUILD/powerdevil-5.20.2/build && /usr/bin/cmake -E cmake_depends "Unix Makefiles" /home/iurt/rpmbuild/BUILD/powerdevil-5.20.2 /home/iurt/rpmbuild/BUILD/powerdevil-5.20.2 /home/iurt/rpmbuild/BUILD/powerdevil-5.20.2/build /home/iurt/rpmbuild/BUILD/powerdevil-5.20.2/build /home/iurt/rpmbuild/BUILD/powerdevil-5.20.2/build/CMakeFiles/po-ca-docs-kcontrol-powerdevil-index-cache-bz2.dir/DependInfo.cmake --color=
gmake[2]: Entering directory '/home/iurt/rpmbuild/BUILD/powerdevil-5.20.2/build'
cd /home/iurt/rpmbuild/BUILD/powerdevil-5.20.2/build && /usr/bin/cmake -E cmake_depends "Unix Makefiles" /home/iurt/rpmbuild/BUILD/powerdevil-5.20.2 /home/iurt/rpmbuild/BUILD/powerdevil-5.20.2 /home/iurt/rpmbuild/BUILD/powerdevil-5.20.2/build /home/iurt/rpmbuild/BUILD/powerdevil-5.20.2/build /home/iurt/rpmbuild/BUILD/powerdevil-5.20.2/build/CMakeFiles/tsfiles-1461fade86c8906cf14134d5adb52f0b.dir/DependInfo.cmake --color=
gmake[2]: Entering directory '/home/iurt/rpmbuild/BUILD/powerdevil-5.20.2/build'
cd /home/iurt/rpmbuild/BUILD/powerdevil-5.20.2/build && /usr/bin/cmake -E cmake_depends "Unix Makefiles" /home/iurt/rpmbuild/BUILD/powerdevil-5.20.2 /home/iurt/rpmbuild/BUILD/powerdevil-5.20.2 /home/iurt/rpmbuild/BUILD/powerdevil-5.20.2/build /home/iurt/rpmbuild/BUILD/powerdevil-5.20.2/build /home/iurt/rpmbuild/BUILD/powerdevil-5.20.2/build/CMakeFiles/po-de-docs-kcontrol-powerdevil-index-cache-bz2.dir/DependInfo.cmake --color=
gmake[2]: Entering directory '/home/iurt/rpmbuild/BUILD/powerdevil-5.20.2/build'
cd /home/iurt/rpmbuild/BUILD/powerdevil-5.20.2/build && /usr/bin/cmake -E cmake_depends "Unix Makefiles" /home/iurt/rpmbuild/BUILD/powerdevil-5.20.2 /home/iurt/rpmbuild/BUILD/powerdevil-5.20.2 /home/iurt/rpmbuild/BUILD/powerdevil-5.20.2/build /home/iurt/rpmbuild/BUILD/powerdevil-5.20.2/build /home/iurt/rpmbuild/BUILD/powerdevil-5.20.2/build/CMakeFiles/pofiles-1461fade86c8906cf14134d5adb52f0b.dir/DependInfo.cmake --color=
Dependee "/home/iurt/rpmbuild/BUILD/powerdevil-5.20.2/build/CMakeFiles/po-ru-docs-kcontrol-powerdevil-index-cache-bz2.dir/DependInfo.cmake" is newer than depender "/home/iurt/rpmbuild/BUILD/powerdevil-5.20.2/build/CMakeFiles/po-ru-docs-kcontrol-powerdevil-index-cache-bz2.dir/depend.internal".
Dependee "/home/iurt/rpmbuild/BUILD/powerdevil-5.20.2/build/CMakeFiles/CMakeDirectoryInformation.cmake" is newer than depender "/home/iurt/rpmbuild/BUILD/powerdevil-5.20.2/build/CMakeFiles/po-ru-docs-kcontrol-powerdevil-index-cache-bz2.dir/depend.internal".
Scanning dependencies of target po-ru-docs-kcontrol-powerdevil-index-cache-bz2
Dependee "/home/iurt/rpmbuild/BUILD/powerdevil-5.20.2/build/CMakeFiles/po-uk-docs-kcontrol-powerdevil-index-cache-bz2.dir/DependInfo.cmake" is newer than depender "/home/iurt/rpmbuild/BUILD/powerdevil-5.20.2/build/CMakeFiles/po-uk-docs-kcontrol-powerdevil-index-cache-bz2.dir/depend.internal".
Dependee "/home/iurt/rpmbuild/BUILD/powerdevil-5.20.2/build/CMakeFiles/CMakeDirectoryInformation.cmake" is newer than depender "/home/iurt/rpmbuild/BUILD/powerdevil-5.20.2/build/CMakeFiles/po-uk-docs-kcontrol-powerdevil-index-cache-bz2.dir/depend.internal".
Scanning dependencies of target po-uk-docs-kcontrol-powerdevil-index-cache-bz2
gmake[2]: Leaving directory '/home/iurt/rpmbuild/BUILD/powerdevil-5.20.2/build'
Dependee "/home/iurt/rpmbuild/BUILD/powerdevil-5.20.2/build/CMakeFiles/tsfiles-1461fade86c8906cf14134d5adb52f0b.dir/DependInfo.cmake" is newer than depender "/home/iurt/rpmbuild/BUILD/powerdevil-5.20.2/build/CMakeFiles/tsfiles-1461fade86c8906cf14134d5adb52f0b.dir/depend.internal".
Dependee "/home/iurt/rpmbuild/BUILD/powerdevil-5.20.2/build/CMakeFiles/CMakeDirectoryInformation.cmake" is newer than depender "/home/iurt/rpmbuild/BUILD/powerdevil-5.20.2/build/CMakeFiles/tsfiles-1461fade86c8906cf14134d5adb52f0b.dir/depend.internal".
/usr/bin/gmake -f CMakeFiles/po-ru-docs-kcontrol-powerdevil-index-cache-bz2.dir/build.make CMakeFiles/po-ru-docs-kcontrol-powerdevil-index-cache-bz2.dir/build
Dependee "/home/iurt/rpmbuild/BUILD/powerdevil-5.20.2/build/CMakeFiles/po-de-docs-kcontrol-powerdevil-index-cache-bz2.dir/DependInfo.cmake" is newer than depender "/home/iurt/rpmbuild/BUILD/powerdevil-5.20.2/build/CMakeFiles/po-de-docs-kcontrol-powerdevil-index-cache-bz2.dir/depend.internal".
Dependee "/home/iurt/rpmbuild/BUILD/powerdevil-5.20.2/build/CMakeFiles/CMakeDirectoryInformation.cmake" is newer than depender "/home/iurt/rpmbuild/BUILD/powerdevil-5.20.2/build/CMakeFiles/po-de-docs-kcontrol-powerdevil-index-cache-bz2.dir/depend.internal".
Scanning dependencies of target tsfiles-1461fade86c8906cf14134d5adb52f0b
gmake[2]: Leaving directory '/home/iurt/rpmbuild/BUILD/powerdevil-5.20.2/build'
Dependee "/home/iurt/rpmbuild/BUILD/powerdevil-5.20.2/build/CMakeFiles/po-ca-docs-kcontrol-powerdevil-index-cache-bz2.dir/DependInfo.cmake" is newer than depender "/home/iurt/rpmbuild/BUILD/powerdevil-5.20.2/build/CMakeFiles/po-ca-docs-kcontrol-powerdevil-index-cache-bz2.dir/depend.internal".
Dependee "/home/iurt/rpmbuild/BUILD/powerdevil-5.20.2/build/CMakeFiles/CMakeDirectoryInformation.cmake" is newer than depender "/home/iurt/rpmbuild/BUILD/powerdevil-5.20.2/build/CMakeFiles/po-ca-docs-kcontrol-powerdevil-index-cache-bz2.dir/depend.internal".
Scanning dependencies of target po-de-docs-kcontrol-powerdevil-index-cache-bz2
Dependee "/home/iurt/rpmbuild/BUILD/powerdevil-5.20.2/build/CMakeFiles/pofiles-1461fade86c8906cf14134d5adb52f0b.dir/DependInfo.cmake" is newer than depender "/home/iurt/rpmbuild/BUILD/powerdevil-5.20.2/build/CMakeFiles/pofiles-1461fade86c8906cf14134d5adb52f0b.dir/depend.internal".
Dependee "/home/iurt/rpmbuild/BUILD/powerdevil-5.20.2/build/CMakeFiles/CMakeDirectoryInformation.cmake" is newer than depender "/home/iurt/rpmbuild/BUILD/powerdevil-5.20.2/build/CMakeFiles/pofiles-1461fade86c8906cf14134d5adb52f0b.dir/depend.internal".
/usr/bin/gmake -f CMakeFiles/po-uk-docs-kcontrol-powerdevil-index-cache-bz2.dir/build.make CMakeFiles/po-uk-docs-kcontrol-powerdevil-index-cache-bz2.dir/build
Dependee "/home/iurt/rpmbuild/BUILD/powerdevil-5.20.2/build/CMakeFiles/po-pt-docs-kcontrol-powerdevil-index-cache-bz2.dir/DependInfo.cmake" is newer than depender "/home/iurt/rpmbuild/BUILD/powerdevil-5.20.2/build/CMakeFiles/po-pt-docs-kcontrol-powerdevil-index-cache-bz2.dir/depend.internal".
Dependee "/home/iurt/rpmbuild/BUILD/powerdevil-5.20.2/build/CMakeFiles/CMakeDirectoryInformation.cmake" is newer than depender "/home/iurt/rpmbuild/BUILD/powerdevil-5.20.2/build/CMakeFiles/po-pt-docs-kcontrol-powerdevil-index-cache-bz2.dir/depend.internal".
Scanning dependencies of target po-ca-docs-kcontrol-powerdevil-index-cache-bz2
Scanning dependencies of target pofiles-1461fade86c8906cf14134d5adb52f0b
Scanning dependencies of target po-pt-docs-kcontrol-powerdevil-index-cache-bz2
gmake[2]: Entering directory '/home/iurt/rpmbuild/BUILD/powerdevil-5.20.2/build'
gmake[2]: Leaving directory '/home/iurt/rpmbuild/BUILD/powerdevil-5.20.2/build'
gmake[2]: Leaving directory '/home/iurt/rpmbuild/BUILD/powerdevil-5.20.2/build'
/usr/bin/gmake -f CMakeFiles/tsfiles-1461fade86c8906cf14134d5adb52f0b.dir/build.make CMakeFiles/tsfiles-1461fade86c8906cf14134d5adb52f0b.dir/build
gmake[2]: Leaving directory '/home/iurt/rpmbuild/BUILD/powerdevil-5.20.2/build'
gmake[2]: Entering directory '/home/iurt/rpmbuild/BUILD/powerdevil-5.20.2/build'
/usr/bin/gmake -f CMakeFiles/po-de-docs-kcontrol-powerdevil-index-cache-bz2.dir/build.make CMakeFiles/po-de-docs-kcontrol-powerdevil-index-cache-bz2.dir/build
gmake[2]: Leaving directory '/home/iurt/rpmbuild/BUILD/powerdevil-5.20.2/build'
/usr/bin/gmake -f CMakeFiles/pofiles-1461fade86c8906cf14134d5adb52f0b.dir/build.make CMakeFiles/pofiles-1461fade86c8906cf14134d5adb52f0b.dir/build
gmake[2]: Leaving directory '/home/iurt/rpmbuild/BUILD/powerdevil-5.20.2/build'
/usr/bin/gmake -f CMakeFiles/po-ca-docs-kcontrol-powerdevil-index-cache-bz2.dir/build.make CMakeFiles/po-ca-docs-kcontrol-powerdevil-index-cache-bz2.dir/build
/usr/bin/gmake -f CMakeFiles/po-pt-docs-kcontrol-powerdevil-index-cache-bz2.dir/build.make CMakeFiles/po-pt-docs-kcontrol-powerdevil-index-cache-bz2.dir/build
gmake[2]: Entering directory '/home/iurt/rpmbuild/BUILD/powerdevil-5.20.2/build'
gmake[2]: Entering directory '/home/iurt/rpmbuild/BUILD/powerdevil-5.20.2/build'
gmake[2]: Entering directory '/home/iurt/rpmbuild/BUILD/powerdevil-5.20.2/build'
gmake[2]: Entering directory '/home/iurt/rpmbuild/BUILD/powerdevil-5.20.2/build'
gmake[2]: Entering directory '/home/iurt/rpmbuild/BUILD/powerdevil-5.20.2/build'
[ 1%] Generating po/ru/docs/kcontrol/powerdevil/index.cache.bz2
[ 1%] Generating po/uk/docs/kcontrol/powerdevil/index.cache.bz2
[ 2%] Generating po/de/docs/kcontrol/powerdevil/index.cache.bz2
[ 4%] Generating po/ca/docs/kcontrol/powerdevil/index.cache.bz2
[ 4%] Generating mo...
[ 4%] Generating ts...
cd /home/iurt/rpmbuild/BUILD/powerdevil-5.20.2 && /usr/bin/meinproc5 --check --cache /home/iurt/rpmbuild/BUILD/powerdevil-5.20.2/build/po/de/docs/kcontrol/powerdevil/index.cache.bz2 po/de/docs/kcontrol/powerdevil/index.docbook
[ 4%] Generating po/pt/docs/kcontrol/powerdevil/index.cache.bz2
cd /home/iurt/rpmbuild/BUILD/powerdevil-5.20.2 && /usr/bin/meinproc5 --check --cache /home/iurt/rpmbuild/BUILD/powerdevil-5.20.2/build/po/uk/docs/kcontrol/powerdevil/index.cache.bz2 po/uk/docs/kcontrol/powerdevil/index.docbook
/usr/bin/cmake -DGETTEXT_MSGFMT_EXECUTABLE=/usr/bin/msgfmt -DCOPY_TO=/home/iurt/rpmbuild/BUILD/powerdevil-5.20.2/build/locale -DPO_DIR=/home/iurt/rpmbuild/BUILD/powerdevil-5.20.2/po -P /usr/lib64/cmake/KF5I18n/build-pofiles.cmake
cd /home/iurt/rpmbuild/BUILD/powerdevil-5.20.2 && /usr/bin/meinproc5 --check --cache /home/iurt/rpmbuild/BUILD/powerdevil-5.20.2/build/po/ru/docs/kcontrol/powerdevil/index.cache.bz2 po/ru/docs/kcontrol/powerdevil/index.docbook
cd /home/iurt/rpmbuild/BUILD/powerdevil-5.20.2 && /usr/bin/meinproc5 --check --cache /home/iurt/rpmbuild/BUILD/powerdevil-5.20.2/build/po/ca/docs/kcontrol/powerdevil/index.cache.bz2 po/ca/docs/kcontrol/powerdevil/index.docbook
/usr/bin/cmake -DPYTHON_EXECUTABLE=/usr/bin/python3 -D_ki18n_pmap_compile_script=/usr/lib64/cmake/KF5I18n/ts-pmap-compile.py -DCOPY_TO=/home/iurt/rpmbuild/BUILD/powerdevil-5.20.2/build/locale -DPO_DIR=/home/iurt/rpmbuild/BUILD/powerdevil-5.20.2/po -P /usr/lib64/cmake/KF5I18n/build-tsfiles.cmake
cd /home/iurt/rpmbuild/BUILD/powerdevil-5.20.2 && /usr/bin/meinproc5 --check --cache /home/iurt/rpmbuild/BUILD/powerdevil-5.20.2/build/po/pt/docs/kcontrol/powerdevil/index.cache.bz2 po/pt/docs/kcontrol/powerdevil/index.docbook
gmake[2]: Leaving directory '/home/iurt/rpmbuild/BUILD/powerdevil-5.20.2/build'
[ 4%] Built target tsfiles-1461fade86c8906cf14134d5adb52f0b
/usr/bin/gmake -f CMakeFiles/po-fr-docs-kcontrol-powerdevil-index-cache-bz2.dir/build.make CMakeFiles/po-fr-docs-kcontrol-powerdevil-index-cache-bz2.dir/depend
gmake[2]: Entering directory '/home/iurt/rpmbuild/BUILD/powerdevil-5.20.2/build'
cd /home/iurt/rpmbuild/BUILD/powerdevil-5.20.2/build && /usr/bin/cmake -E cmake_depends "Unix Makefiles" /home/iurt/rpmbuild/BUILD/powerdevil-5.20.2 /home/iurt/rpmbuild/BUILD/powerdevil-5.20.2 /home/iurt/rpmbuild/BUILD/powerdevil-5.20.2/build /home/iurt/rpmbuild/BUILD/powerdevil-5.20.2/build /home/iurt/rpmbuild/BUILD/powerdevil-5.20.2/build/CMakeFiles/po-fr-docs-kcontrol-powerdevil-index-cache-bz2.dir/DependInfo.cmake --color=
Dependee "/home/iurt/rpmbuild/BUILD/powerdevil-5.20.2/build/CMakeFiles/po-fr-docs-kcontrol-powerdevil-index-cache-bz2.dir/DependInfo.cmake" is newer than depender "/home/iurt/rpmbuild/BUILD/powerdevil-5.20.2/build/CMakeFiles/po-fr-docs-kcontrol-powerdevil-index-cache-bz2.dir/depend.internal".
Dependee "/home/iurt/rpmbuild/BUILD/powerdevil-5.20.2/build/CMakeFiles/CMakeDirectoryInformation.cmake" is newer than depender "/home/iurt/rpmbuild/BUILD/powerdevil-5.20.2/build/CMakeFiles/po-fr-docs-kcontrol-powerdevil-index-cache-bz2.dir/depend.internal".
Scanning dependencies of target po-fr-docs-kcontrol-powerdevil-index-cache-bz2
gmake[2]: Leaving directory '/home/iurt/rpmbuild/BUILD/powerdevil-5.20.2/build'
/usr/bin/gmake -f CMakeFiles/po-fr-docs-kcontrol-powerdevil-index-cache-bz2.dir/build.make CMakeFiles/po-fr-docs-kcontrol-powerdevil-index-cache-bz2.dir/build
gmake[2]: Entering directory '/home/iurt/rpmbuild/BUILD/powerdevil-5.20.2/build'
[ 5%] Generating po/fr/docs/kcontrol/powerdevil/index.cache.bz2
cd /home/iurt/rpmbuild/BUILD/powerdevil-5.20.2 && /usr/bin/meinproc5 --check --cache /home/iurt/rpmbuild/BUILD/powerdevil-5.20.2/build/po/fr/docs/kcontrol/powerdevil/index.cache.bz2 po/fr/docs/kcontrol/powerdevil/index.docbook
Dependee "/home/iurt/rpmbuild/BUILD/powerdevil-5.20.2/build/CMakeFiles/po-pt-BR-docs-kcontrol-powerdevil-index-cache-bz2.dir/DependInfo.cmake" is newer than depender "/home/iurt/rpmbuild/BUILD/powerdevil-5.20.2/build/CMakeFiles/po-pt-BR-docs-kcontrol-powerdevil-index-cache-bz2.dir/depend.internal".
Dependee "/home/iurt/rpmbuild/BUILD/powerdevil-5.20.2/build/CMakeFiles/CMakeDirectoryInformation.cmake" is newer than depender "/home/iurt/rpmbuild/BUILD/powerdevil-5.20.2/build/CMakeFiles/po-pt-BR-docs-kcontrol-powerdevil-index-cache-bz2.dir/depend.internal".
Scanning dependencies of target po-pt-BR-docs-kcontrol-powerdevil-index-cache-bz2
gmake[2]: Leaving directory '/home/iurt/rpmbuild/BUILD/powerdevil-5.20.2/build'
/usr/bin/gmake -f CMakeFiles/po-pt-BR-docs-kcontrol-powerdevil-index-cache-bz2.dir/build.make CMakeFiles/po-pt-BR-docs-kcontrol-powerdevil-index-cache-bz2.dir/build
gmake[2]: Entering directory '/home/iurt/rpmbuild/BUILD/powerdevil-5.20.2/build'
[ 6%] Generating po/pt_BR/docs/kcontrol/powerdevil/index.cache.bz2
cd /home/iurt/rpmbuild/BUILD/powerdevil-5.20.2 && /usr/bin/meinproc5 --check --cache /home/iurt/rpmbuild/BUILD/powerdevil-5.20.2/build/po/pt_BR/docs/kcontrol/powerdevil/index.cache.bz2 po/pt_BR/docs/kcontrol/powerdevil/index.docbook
gmake[2]: Leaving directory '/home/iurt/rpmbuild/BUILD/powerdevil-5.20.2/build'
[ 6%] Built target po-pt-docs-kcontrol-powerdevil-index-cache-bz2
/usr/bin/gmake -f CMakeFiles/po-et-docs-kcontrol-powerdevil-index-cache-bz2.dir/build.make CMakeFiles/po-et-docs-kcontrol-powerdevil-index-cache-bz2.dir/depend
gmake[2]: Entering directory '/home/iurt/rpmbuild/BUILD/powerdevil-5.20.2/build'
cd /home/iurt/rpmbuild/BUILD/powerdevil-5.20.2/build && /usr/bin/cmake -E cmake_depends "Unix Makefiles" /home/iurt/rpmbuild/BUILD/powerdevil-5.20.2 /home/iurt/rpmbuild/BUILD/powerdevil-5.20.2 /home/iurt/rpmbuild/BUILD/powerdevil-5.20.2/build /home/iurt/rpmbuild/BUILD/powerdevil-5.20.2/build /home/iurt/rpmbuild/BUILD/powerdevil-5.20.2/build/CMakeFiles/po-et-docs-kcontrol-powerdevil-index-cache-bz2.dir/DependInfo.cmake --color=
gmake[2]: Leaving directory '/home/iurt/rpmbuild/BUILD/powerdevil-5.20.2/build'
gmake[2]: Leaving directory '/home/iurt/rpmbuild/BUILD/powerdevil-5.20.2/build'
Dependee "/home/iurt/rpmbuild/BUILD/powerdevil-5.20.2/build/CMakeFiles/po-et-docs-kcontrol-powerdevil-index-cache-bz2.dir/DependInfo.cmake" is newer than depender "/home/iurt/rpmbuild/BUILD/powerdevil-5.20.2/build/CMakeFiles/po-et-docs-kcontrol-powerdevil-index-cache-bz2.dir/depend.internal".
Dependee "/home/iurt/rpmbuild/BUILD/powerdevil-5.20.2/build/CMakeFiles/CMakeDirectoryInformation.cmake" is newer than depender "/home/iurt/rpmbuild/BUILD/powerdevil-5.20.2/build/CMakeFiles/po-et-docs-kcontrol-powerdevil-index-cache-bz2.dir/depend.internal".
gmake[2]: Leaving directory '/home/iurt/rpmbuild/BUILD/powerdevil-5.20.2/build'
Scanning dependencies of target po-et-docs-kcontrol-powerdevil-index-cache-bz2
gmake[2]: Leaving directory '/home/iurt/rpmbuild/BUILD/powerdevil-5.20.2/build'
gmake[2]: Leaving directory '/home/iurt/rpmbuild/BUILD/powerdevil-5.20.2/build'
I/O warning : failed to load external entity "/usr/share/kf5/kdoctools/customization/xsl/pt-BR.xml"
[ 6%] Built target po-de-docs-kcontrol-powerdevil-index-cache-bz2
[ 6%] Built target po-ru-docs-kcontrol-powerdevil-index-cache-bz2
/usr/bin/gmake -f CMakeFiles/po-et-docs-kcontrol-powerdevil-index-cache-bz2.dir/build.make CMakeFiles/po-et-docs-kcontrol-powerdevil-index-cache-bz2.dir/build
[ 6%] Built target po-uk-docs-kcontrol-powerdevil-index-cache-bz2
/usr/bin/gmake -f CMakeFiles/po-nl-docs-kcontrol-powerdevil-index-cache-bz2.dir/build.make CMakeFiles/po-nl-docs-kcontrol-powerdevil-index-cache-bz2.dir/depend
gmake[2]: Entering directory '/home/iurt/rpmbuild/BUILD/powerdevil-5.20.2/build'
/usr/bin/gmake -f CMakeFiles/po-id-docs-kcontrol-powerdevil-index-cache-bz2.dir/build.make CMakeFiles/po-id-docs-kcontrol-powerdevil-index-cache-bz2.dir/depend
gmake[2]: Entering directory '/home/iurt/rpmbuild/BUILD/powerdevil-5.20.2/build'
cd /home/iurt/rpmbuild/BUILD/powerdevil-5.20.2/build && /usr/bin/cmake -E cmake_depends "Unix Makefiles" /home/iurt/rpmbuild/BUILD/powerdevil-5.20.2 /home/iurt/rpmbuild/BUILD/powerdevil-5.20.2 /home/iurt/rpmbuild/BUILD/powerdevil-5.20.2/build /home/iurt/rpmbuild/BUILD/powerdevil-5.20.2/build /home/iurt/rpmbuild/BUILD/powerdevil-5.20.2/build/CMakeFiles/po-nl-docs-kcontrol-powerdevil-index-cache-bz2.dir/DependInfo.cmake --color=
gmake[2]: Leaving directory '/home/iurt/rpmbuild/BUILD/powerdevil-5.20.2/build'
[ 6%] Built target po-fr-docs-kcontrol-powerdevil-index-cache-bz2
gmake[2]: Entering directory '/home/iurt/rpmbuild/BUILD/powerdevil-5.20.2/build'
cd /home/iurt/rpmbuild/BUILD/powerdevil-5.20.2/build && /usr/bin/cmake -E cmake_depends "Unix Makefiles" /home/iurt/rpmbuild/BUILD/powerdevil-5.20.2 /home/iurt/rpmbuild/BUILD/powerdevil-5.20.2 /home/iurt/rpmbuild/BUILD/powerdevil-5.20.2/build /home/iurt/rpmbuild/BUILD/powerdevil-5.20.2/build /home/iurt/rpmbuild/BUILD/powerdevil-5.20.2/build/CMakeFiles/po-id-docs-kcontrol-powerdevil-index-cache-bz2.dir/DependInfo.cmake --color=
Dependee "/home/iurt/rpmbuild/BUILD/powerdevil-5.20.2/build/CMakeFiles/po-nl-docs-kcontrol-powerdevil-index-cache-bz2.dir/DependInfo.cmake" is newer than depender "/home/iurt/rpmbuild/BUILD/powerdevil-5.20.2/build/CMakeFiles/po-nl-docs-kcontrol-powerdevil-index-cache-bz2.dir/depend.internal".
Dependee "/home/iurt/rpmbuild/BUILD/powerdevil-5.20.2/build/CMakeFiles/CMakeDirectoryInformation.cmake" is newer than depender "/home/iurt/rpmbuild/BUILD/powerdevil-5.20.2/build/CMakeFiles/po-nl-docs-kcontrol-powerdevil-index-cache-bz2.dir/depend.internal".
[ 6%] Generating po/et/docs/kcontrol/powerdevil/index.cache.bz2
Scanning dependencies of target po-nl-docs-kcontrol-powerdevil-index-cache-bz2
cd /home/iurt/rpmbuild/BUILD/powerdevil-5.20.2 && /usr/bin/meinproc5 --check --cache /home/iurt/rpmbuild/BUILD/powerdevil-5.20.2/build/po/et/docs/kcontrol/powerdevil/index.cache.bz2 po/et/docs/kcontrol/powerdevil/index.docbook
Dependee "/home/iurt/rpmbuild/BUILD/powerdevil-5.20.2/build/CMakeFiles/po-id-docs-kcontrol-powerdevil-index-cache-bz2.dir/DependInfo.cmake" is newer than depender "/home/iurt/rpmbuild/BUILD/powerdevil-5.20.2/build/CMakeFiles/po-id-docs-kcontrol-powerdevil-index-cache-bz2.dir/depend.internal".
Dependee "/home/iurt/rpmbuild/BUILD/powerdevil-5.20.2/build/CMakeFiles/CMakeDirectoryInformation.cmake" is newer than depender "/home/iurt/rpmbuild/BUILD/powerdevil-5.20.2/build/CMakeFiles/po-id-docs-kcontrol-powerdevil-index-cache-bz2.dir/depend.internal".
Scanning dependencies of target po-id-docs-kcontrol-powerdevil-index-cache-bz2
gmake[2]: Leaving directory '/home/iurt/rpmbuild/BUILD/powerdevil-5.20.2/build'
gmake[2]: Leaving directory '/home/iurt/rpmbuild/BUILD/powerdevil-5.20.2/build'
/usr/bin/gmake -f CMakeFiles/po-nl-docs-kcontrol-powerdevil-index-cache-bz2.dir/build.make CMakeFiles/po-nl-docs-kcontrol-powerdevil-index-cache-bz2.dir/build
gmake[2]: Entering directory '/home/iurt/rpmbuild/BUILD/powerdevil-5.20.2/build'
/usr/bin/gmake -f CMakeFiles/po-id-docs-kcontrol-powerdevil-index-cache-bz2.dir/build.make CMakeFiles/po-id-docs-kcontrol-powerdevil-index-cache-bz2.dir/build
No "pt_br" localization of "footer-doc-comment" exists; using "en".
[ 6%] Built target po-ca-docs-kcontrol-powerdevil-index-cache-bz2
/usr/bin/gmake -f CMakeFiles/po-it-docs-kcontrol-powerdevil-index-cache-bz2.dir/build.make CMakeFiles/po-it-docs-kcontrol-powerdevil-index-cache-bz2.dir/depend
gmake[2]: Entering directory '/home/iurt/rpmbuild/BUILD/powerdevil-5.20.2/build'
gmake[2]: /bin/sh: Operation not permitted
gmake[2]: *** [CMakeFiles/po-id-docs-kcontrol-powerdevil-index-cache-bz2.dir/build.make:83: po/id/docs/kcontrol/powerdevil/index.cache.bz2] Error 127
gmake[2]: Leaving directory '/home/iurt/rpmbuild/BUILD/powerdevil-5.20.2/build'
[ 6%] Generating po/nl/docs/kcontrol/powerdevil/index.cache.bz2
gmake[1]: *** [CMakeFiles/Makefile2:822: CMakeFiles/po-id-docs-kcontrol-powerdevil-index-cache-bz2.dir/all] Error 2
gmake[1]: *** Waiting for unfinished jobs....
cd /home/iurt/rpmbuild/BUILD/powerdevil-5.20.2 && /usr/bin/meinproc5 --check --cache /home/iurt/rpmbuild/BUILD/powerdevil-5.20.2/build/po/nl/docs/kcontrol/powerdevil/index.cache.bz2 po/nl/docs/kcontrol/powerdevil/index.docbook
No "pt_br" localization of "footer-doc-feedback" exists; using "en".
No "pt_br" localization of "footer-doc-teamname" exists; using "en".
gmake[2]: Entering directory '/home/iurt/rpmbuild/BUILD/powerdevil-5.20.2/build'
cd /home/iurt/rpmbuild/BUILD/powerdevil-5.20.2/build && /usr/bin/cmake -E cmake_depends "Unix Makefiles" /home/iurt/rpmbuild/BUILD/powerdevil-5.20.2 /home/iurt/rpmbuild/BUILD/powerdevil-5.20.2 /home/iurt/rpmbuild/BUILD/powerdevil-5.20.2/build /home/iurt/rpmbuild/BUILD/powerdevil-5.20.2/build /home/iurt/rpmbuild/BUILD/powerdevil-5.20.2/build/CMakeFiles/po-it-docs-kcontrol-powerdevil-index-cache-bz2.dir/DependInfo.cmake --color=
No "pt_br" localization of "footer-doc-comment" exists; using "en".
No "pt_br" localization of "footer-doc-feedback" exists; using "en".
No "pt_br" localization of "footer-doc-teamname" exists; using "en".
Dependee "/home/iurt/rpmbuild/BUILD/powerdevil-5.20.2/build/CMakeFiles/po-it-docs-kcontrol-powerdevil-index-cache-bz2.dir/DependInfo.cmake" is newer than depender "/home/iurt/rpmbuild/BUILD/powerdevil-5.20.2/build/CMakeFiles/po-it-docs-kcontrol-powerdevil-index-cache-bz2.dir/depend.internal".
Dependee "/home/iurt/rpmbuild/BUILD/powerdevil-5.20.2/build/CMakeFiles/CMakeDirectoryInformation.cmake" is newer than depender "/home/iurt/rpmbuild/BUILD/powerdevil-5.20.2/build/CMakeFiles/po-it-docs-kcontrol-powerdevil-index-cache-bz2.dir/depend.internal".
Scanning dependencies of target po-it-docs-kcontrol-powerdevil-index-cache-bz2
gmake[2]: Leaving directory '/home/iurt/rpmbuild/BUILD/powerdevil-5.20.2/build'
/usr/bin/gmake -f CMakeFiles/po-it-docs-kcontrol-powerdevil-index-cache-bz2.dir/build.make CMakeFiles/po-it-docs-kcontrol-powerdevil-index-cache-bz2.dir/build
gmake[2]: Entering directory '/home/iurt/rpmbuild/BUILD/powerdevil-5.20.2/build'
gmake[2]: Leaving directory '/home/iurt/rpmbuild/BUILD/powerdevil-5.20.2/build'
[ 7%] Generating po/it/docs/kcontrol/powerdevil/index.cache.bz2
cd /home/iurt/rpmbuild/BUILD/powerdevil-5.20.2 && /usr/bin/meinproc5 --check --cache /home/iurt/rpmbuild/BUILD/powerdevil-5.20.2/build/po/it/docs/kcontrol/powerdevil/index.cache.bz2 po/it/docs/kcontrol/powerdevil/index.docbook
[ 7%] Built target po-pt-BR-docs-kcontrol-powerdevil-index-cache-bz2
gmake[2]: Leaving directory '/home/iurt/rpmbuild/BUILD/powerdevil-5.20.2/build'
[ 7%] Built target po-nl-docs-kcontrol-powerdevil-index-cache-bz2
gmake[2]: Leaving directory '/home/iurt/rpmbuild/BUILD/powerdevil-5.20.2/build'
[ 7%] Built target po-et-docs-kcontrol-powerdevil-index-cache-bz2
gmake[2]: Leaving directory '/home/iurt/rpmbuild/BUILD/powerdevil-5.20.2/build'
[ 7%] Built target po-it-docs-kcontrol-powerdevil-index-cache-bz2
gmake[2]: Leaving directory '/home/iurt/rpmbuild/BUILD/powerdevil-5.20.2/build'
[ 7%] Built target pofiles-1461fade86c8906cf14134d5adb52f0b
gmake[1]: Leaving directory '/home/iurt/rpmbuild/BUILD/powerdevil-5.20.2/build'
gmake: *** [Makefile:152: all] Error 2
error: Bad exit status from /home/iurt/rpmbuild/tmp/rpm-tmp.reBXIs (%build)
RPM build errors:
Bad exit status from /home/iurt/rpmbuild/tmp/rpm-tmp.reBXIs (%build)
I: [iurt_root_command] ERROR: chroot