D: [iurt_root_command] chroot Installing /home/iurt/rpmbuild/SRPMS/junitperf-1.9.1-8.mga8.src.rpm Building target platforms: x86_64 Building for target x86_64 Executing(%prep): /bin/sh -e /home/iurt/rpmbuild/tmp/rpm-tmp.13WEJL + umask 022 + cd /home/iurt/rpmbuild/BUILD + '[' 1 -eq 1 ']' + '[' 1 -eq 1 ']' + '[' 1 -eq 1 ']' + cd /home/iurt/rpmbuild/BUILD + rm -rf junitperf-1.9.1 + /usr/bin/unzip -qq /home/iurt/rpmbuild/SOURCES/junitperf-1.9.1.zip + STATUS=0 + '[' 0 -ne 0 ']' + cd junitperf-1.9.1 + /usr/bin/chmod -Rf a+rX,u+w,g-w,o-w . + find . -name '*.jar' -exec rm -f '{}' ';' + find . -name '*.class' -exec rm -f '{}' ';' + RPM_EC=0 ++ jobs -p + exit 0 Executing(%build): /bin/sh -e /home/iurt/rpmbuild/tmp/rpm-tmp.que6ZM + umask 022 + cd /home/iurt/rpmbuild/BUILD + cd junitperf-1.9.1 + '[' 1 -eq 1 ']' + '[' 1 -eq 1 ']' ++ build-classpath junit + CLASSPATH=/usr/share/java/junit.jar + ant -Dbuild.sysclasspath=first jar test javadoc Buildfile: /home/iurt/rpmbuild/BUILD/junitperf-1.9.1/build.xml prepare: [mkdir] Created dir: /home/iurt/rpmbuild/BUILD/junitperf-1.9.1/build compile: [javac] Compiling 10 source files to /home/iurt/rpmbuild/BUILD/junitperf-1.9.1/build [javac] Note: /home/iurt/rpmbuild/BUILD/junitperf-1.9.1/src/com/clarkware/junitperf/TestMethodFactory.java uses unchecked or unsafe operations. [javac] Note: Recompile with -Xlint:unchecked for details. jar: [mkdir] Created dir: /home/iurt/rpmbuild/BUILD/junitperf-1.9.1/dist [jar] Building jar: /home/iurt/rpmbuild/BUILD/junitperf-1.9.1/dist/junitperf-1.9.1.jar prepare: compile: compile-tests: [javac] Compiling 7 source files to /home/iurt/rpmbuild/BUILD/junitperf-1.9.1/build compile-samples: [javac] Compiling 7 source files to /home/iurt/rpmbuild/BUILD/junitperf-1.9.1/build test-samples: [junit] WARNING: multiple versions of ant detected in path for junit [junit] jar:file:/usr/share/java/ant.jar!/org/apache/tools/ant/Project.class [junit] and jar:file:/usr/share/ant/lib/ant.jar!/org/apache/tools/ant/Project.class [junit] Testsuite: com.clarkware.junitperf.ExamplePerfTestSuite [junit] Tests run: 121, Failures: 0, Errors: 0, Skipped: 0, Time elapsed: 20.263 sec [junit] ------------- Standard Output --------------- [junit] TimedTest (WAITING): testOneSecondResponse(com.clarkware.junitperf.ExampleTestCase): 1011 ms [junit] TimedTest (WAITING): LoadTest (NON-ATOMIC): ThreadedTest: testOneSecondResponse(com.clarkware.junitperf.ExampleTestCase)(repeated): 19071 ms [junit] ------------- ---------------- --------------- [junit] [junit] Testcase: testOneSecondResponse took 1.001 sec [junit] Testcase: testState took 0.001 sec [junit] Testcase: testState took 0.005 sec [junit] Testcase: testState took 0 sec [junit] Testcase: testState took 0.001 sec [junit] Testcase: testState took 0.006 sec [junit] Testcase: testState took 0.007 sec [junit] Testcase: testState took 0.002 sec [junit] Testcase: testState took 0.001 sec [junit] Testcase: testState took 0.003 sec [junit] Testcase: testState took 0.002 sec [junit] Testcase: testState took 0 sec [junit] Testcase: testState took 0 sec [junit] Testcase: testState took 0 sec [junit] Testcase: testState took 0 sec [junit] Testcase: testState took 0 sec [junit] Testcase: testState took 0 sec [junit] Testcase: testState took 0.001 sec [junit] Testcase: testState took 0.001 sec [junit] Testcase: testState took 0.002 sec [junit] Testcase: testState took 0.002 sec [junit] Testcase: testOneSecondResponse took 1.001 sec [junit] Testcase: testOneSecondResponse took 0.999 sec [junit] Testcase: testOneSecondResponse took 0.001 sec [junit] Testcase: testOneSecondResponse took 0.999 sec [junit] Testcase: testOneSecondResponse took 0.999 sec [junit] Testcase: testOneSecondResponse took 0.001 sec [junit] Testcase: testOneSecondResponse took 0.999 sec [junit] Testcase: testOneSecondResponse took 0.999 sec [junit] Testcase: testOneSecondResponse took 0.999 sec [junit] Testcase: testOneSecondResponse took 1 sec [junit] Testcase: testOneSecondResponse took 0.719 sec [junit] Testcase: testOneSecondResponse took 0.719 sec [junit] Testcase: testOneSecondResponse took 0.719 sec [junit] Testcase: testOneSecondResponse took 0.719 sec [junit] Testcase: testOneSecondResponse took 0.719 sec [junit] Testcase: testOneSecondResponse took 0.001 sec [junit] Testcase: testOneSecondResponse took 0.28 sec [junit] Testcase: testOneSecondResponse took 0.719 sec [junit] Testcase: testOneSecondResponse took 0.719 sec [junit] Testcase: testOneSecondResponse took 0.719 sec [junit] Testcase: testOneSecondResponse took 0.001 sec [junit] Testcase: testOneSecondResponse took 0.001 sec [junit] Testcase: testOneSecondResponse took 0.001 sec [junit] Testcase: testOneSecondResponse took 0.28 sec [junit] Testcase: testOneSecondResponse took 0.001 sec [junit] Testcase: testOneSecondResponse took 0.717 sec [junit] Testcase: testOneSecondResponse took 0.717 sec [junit] Testcase: testOneSecondResponse took 0.717 sec [junit] Testcase: testOneSecondResponse took 0 sec [junit] Testcase: testOneSecondResponse took 0 sec [junit] Testcase: testOneSecondResponse took 0 sec [junit] Testcase: testOneSecondResponse took 0.279 sec [junit] Testcase: testOneSecondResponse took 0.279 sec [junit] Testcase: testOneSecondResponse took 0.001 sec [junit] Testcase: testOneSecondResponse took 0.718 sec [junit] Testcase: testOneSecondResponse took 0.718 sec [junit] Testcase: testOneSecondResponse took 0.718 sec [junit] Testcase: testOneSecondResponse took 0.001 sec [junit] Testcase: testOneSecondResponse took 0.001 sec [junit] Testcase: testOneSecondResponse took 0.001 sec [junit] Testcase: testOneSecondResponse took 0.279 sec [junit] Testcase: testOneSecondResponse took 0 sec [junit] Testcase: testOneSecondResponse took 0 sec [junit] Testcase: testOneSecondResponse took 0 sec [junit] Testcase: testOneSecondResponse took 0.717 sec [junit] Testcase: testOneSecondResponse took 0.718 sec [junit] Testcase: testOneSecondResponse took 0.718 sec [junit] Testcase: testOneSecondResponse took 0 sec [junit] Testcase: testOneSecondResponse took 0 sec [junit] Testcase: testOneSecondResponse took 0 sec [junit] Testcase: testOneSecondResponse took 0.279 sec [junit] Testcase: testOneSecondResponse took 0.28 sec [junit] Testcase: testOneSecondResponse took 0.28 sec [junit] Testcase: testOneSecondResponse took 0.001 sec [junit] Testcase: testOneSecondResponse took 0.716 sec [junit] Testcase: testOneSecondResponse took 0.716 sec [junit] Testcase: testOneSecondResponse took 0.717 sec [junit] Testcase: testOneSecondResponse took 0 sec [junit] Testcase: testOneSecondResponse took 0 sec [junit] Testcase: testOneSecondResponse took 0 sec [junit] Testcase: testOneSecondResponse took 0.274 sec [junit] Testcase: testOneSecondResponse took 0.002 sec [junit] Testcase: testOneSecondResponse took 0.002 sec [junit] Testcase: testOneSecondResponse took 0.002 sec [junit] Testcase: testOneSecondResponse took 0.666 sec [junit] Testcase: testOneSecondResponse took 0.005 sec [junit] Testcase: testOneSecondResponse took 0.005 sec [junit] Testcase: testOneSecondResponse took 0.005 sec [junit] Testcase: testOneSecondResponse took 0.005 sec [junit] Testcase: testOneSecondResponse took 0.273 sec [junit] Testcase: testOneSecondResponse took 0.052 sec [junit] Testcase: testOneSecondResponse took 0.052 sec [junit] Testcase: testOneSecondResponse took 0.052 sec [junit] Testcase: testOneSecondResponse took 0.665 sec [junit] Testcase: testOneSecondResponse took 0.007 sec [junit] Testcase: testOneSecondResponse took 0.007 sec [junit] Testcase: testOneSecondResponse took 0.007 sec [junit] Testcase: testOneSecondResponse took 0.273 sec [junit] Testcase: testOneSecondResponse took 0.049 sec [junit] Testcase: testOneSecondResponse took 0.049 sec [junit] Testcase: testOneSecondResponse took 0 sec [junit] Testcase: testOneSecondResponse took 0.657 sec [junit] Testcase: testOneSecondResponse took 0.004 sec [junit] Testcase: testOneSecondResponse took 0.004 sec [junit] Testcase: testOneSecondResponse took 0.272 sec [junit] Testcase: testOneSecondResponse took 0.03 sec [junit] Testcase: testOneSecondResponse took 0.031 sec [junit] Testcase: testOneSecondResponse took 0.008 sec [junit] Testcase: testOneSecondResponse took 0.656 sec [junit] Testcase: testOneSecondResponse took 0.664 sec [junit] Testcase: testOneSecondResponse took 0.956 sec [junit] Testcase: testOneSecondResponse took 0.03 sec [junit] Testcase: testOneSecondResponse took 0.011 sec [junit] Testcase: testOneSecondResponse took 0.011 sec [junit] Testcase: testOneSecondResponse took 0.958 sec [junit] Testcase: testOneSecondResponse took 0.029 sec [junit] Testcase: testOneSecondResponse took 0.041 sec [junit] Testcase: testOneSecondResponse took 0.958 sec [junit] Testcase: testOneSecondResponse took 0.042 sec [junit] Testcase: testOneSecondResponse took 1 sec test: [junit] WARNING: multiple versions of ant detected in path for junit [junit] jar:file:/usr/share/java/ant.jar!/org/apache/tools/ant/Project.class [junit] and jar:file:/usr/share/ant/lib/ant.jar!/org/apache/tools/ant/Project.class [junit] Testsuite: com.clarkware.junitperf.AllTests [junit] Tests run: 44, Failures: 0, Errors: 0, Skipped: 0, Time elapsed: 34.665 sec [junit] ------------- Standard Output --------------- [junit] TimedTest (WAITING): LoadTest (NON-ATOMIC): ThreadedTest: testNonAtomic2SecondResponseWithWorkerThread(com.clarkware.junitperf.MockTest): 2004 ms [junit] TimedTest (WAITING): LoadTest (ATOMIC): ThreadedTest: testNonAtomic2SecondResponseWithWorkerThread(com.clarkware.junitperf.MockTest): 2003 ms [junit] TimedTest (WAITING): LoadTest (NON-ATOMIC): ThreadedTest: testAtomic2SecondResponseWithWorkerThread(com.clarkware.junitperf.MockTest): 1001 ms [junit] TimedTest (WAITING): LoadTest (ATOMIC): ThreadedTest: testAtomic2SecondResponseWithWorkerThread(com.clarkware.junitperf.MockTest): 2004 ms [junit] TimedTest (WAITING): LoadTest (NON-ATOMIC): ThreadedTest: testOneSecondExecutionTime(com.clarkware.junitperf.MockTest): 1002 ms [junit] TimedTest (NON-WAITING): testOneSecondExecutionTimeWithFailure(com.clarkware.junitperf.MockTest): 900 ms [junit] TimedTest (NON-WAITING): testOneSecondExecutionTimeWithFailure(com.clarkware.junitperf.MockTest): 1001 ms [junit] TimedTest (WAITING): testOneSecondExecutionTimeWithFailure(com.clarkware.junitperf.MockTest): 1000 ms [junit] TimedTest (WAITING): testOneSecondExecutionTime(com.clarkware.junitperf.MockTest): 1000 ms [junit] TimedTest (WAITING): LoadTest (NON-ATOMIC): ThreadedTest: testOneSecondExecutionTime(com.clarkware.junitperf.MockTest): 4001 ms [junit] TimedTest (NON-WAITING): testInfiniteExecutionTime(com.clarkware.junitperf.MockTest): 1101 ms [junit] TimedTest (WAITING): LoadTest (NON-ATOMIC): ThreadedTest: testOneSecondExecutionTime(com.clarkware.junitperf.MockTest): 1053 ms [junit] TimedTest (NON-WAITING): testLongExecutionTime(com.clarkware.junitperf.MockTest): 2100 ms [junit] TimedTest (WAITING): LoadTest (NON-ATOMIC): ThreadedTest: testOneSecondExecutionTime(com.clarkware.junitperf.MockTest): 4000 ms [junit] TimedTest (WAITING): testOneSecondExecutionTimeWithFailure(com.clarkware.junitperf.MockTest): 1000 ms [junit] TimedTest (WAITING): LoadTest (NON-ATOMIC): ThreadedTest: testOneSecondExecutionTime(com.clarkware.junitperf.MockTest): 1004 ms [junit] TimedTest (NON-WAITING): testOneSecondExecutionTime(com.clarkware.junitperf.MockTest): 1001 ms [junit] TimedTest (WAITING): testOneSecondExecutionTime(com.clarkware.junitperf.MockTest): 1001 ms [junit] TimedTest (NON-WAITING): testOneSecondExecutionTimeWithFailure(com.clarkware.junitperf.MockTest): 901 ms [junit] TimedTest (NON-WAITING): testOneSecondExecutionTimeWithFailure(com.clarkware.junitperf.MockTest): 1001 ms [junit] TimedTest (WAITING): LoadTest (NON-ATOMIC): ThreadedTest: testOneSecondExecutionTime(com.clarkware.junitperf.MockTest): 1003 ms [junit] TimedTest (WAITING): testOneSecondExecutionTime(com.clarkware.junitperf.MockTest): 1001 ms [junit] ------------- ---------------- --------------- [junit] [junit] Testcase: testOneUserRogueThread took 0.053 sec [junit] Testcase: testMultiUserWithDelay took 0.051 sec [junit] Testcase: testMultiUserWithError took 0.05 sec [junit] Testcase: testTestStateConsistencyWithTestFactory took 0.055 sec [junit] Testcase: testOneUser took 0.05 sec [junit] Testcase: testMultiUserWithStop took 0 sec [junit] Testcase: testTestStateConsistencyFailure took 0.051 sec [junit] Testcase: testNonAtomic2SecondResponse took 2.069 sec [junit] Testcase: testMultiUserWithRepeatedTest took 0.051 sec [junit] Testcase: testMultiUserWithIterations took 0.051 sec [junit] Testcase: testMultiUser took 0.051 sec [junit] Testcase: testNonAtomic2SecondResponseEnforceTestAtomicity took 2.004 sec [junit] Testcase: testNonPositiveUser took 0 sec [junit] Testcase: testAtomic2SecondResponse took 1.002 sec [junit] Testcase: testNullTimer took 0 sec [junit] Testcase: testMultiUserWithFailure took 0.051 sec [junit] Testcase: testAtomic2SecondResponseEnforceTestAtomicity took 2.005 sec [junit] Testcase: testOneSecondResponseOneUserLoadFailure took 1.004 sec [junit] Testcase: testOneSecondResponseNonWaitingWithTimeFailure took 0.908 sec [junit] Testcase: testOneSecondResponseSuccessNonWaiting took 1.001 sec [junit] Testcase: testOneSecondResponseSuccessWaiting took 1 sec [junit] Testcase: testOneSecondResponseFailure took 1 sec [junit] Testcase: testOneSecondResponseMultiUserLoadTwoSecondDelaySuccess took 4.002 sec [junit] Testcase: testInfiniteNoWaitForCompletion took 1.101 sec [junit] Testcase: testOneSecondResponseMultiUserLoadSuccess took 1.053 sec [junit] Testcase: testLongResponseNoWaitForCompletion took 2.101 sec [junit] Testcase: testOneSecondResponseMultiUserLoadTwoSecondDelayFailure took 4.001 sec [junit] Testcase: testOneSecondResponseFailureWaiting took 1.001 sec [junit] Testcase: testOneSecondResponseMultiUserLoadFailure took 1.004 sec [junit] Testcase: testOneSecondResponseNoWaitForCompletion took 1.001 sec [junit] Testcase: testOneSecondResponseWaitForCompletion took 1.001 sec [junit] Testcase: testOneSecondResponseNonWaitingWithAmbiguousFailure took 0.902 sec [junit] Testcase: testOneSecondResponseNonWaitingWithTestFailure took 1.002 sec [junit] Testcase: testOneSecondResponseOneUserLoadSuccess took 1.003 sec [junit] Testcase: testOneSecondResponseDefault took 1.001 sec [junit] Testcase: testOneTestMethodFailure took 0.001 sec [junit] Testcase: testAllTestMethods took 0.001 sec [junit] Testcase: testOneTestMethodNoSuchMethod took 0 sec [junit] Testcase: testAllTestMethodsSameSuiteForSameThread took 0.001 sec [junit] Testcase: testOneTestMethodDifferentSuiteForDifferentThread took 0.253 sec [junit] Testcase: testAllTestMethodsDifferentSuiteForDifferentThread took 0.252 sec [junit] Testcase: testOneTestMethodSameSuiteForSameThread took 0 sec [junit] Testcase: testClassNotATestCase took 0 sec [junit] Testcase: testOneTestMethodSuccess took 0.001 sec prepare: compile: javadoc: [mkdir] Created dir: /home/iurt/rpmbuild/BUILD/junitperf-1.9.1/build/docs/api [javadoc] Generating Javadoc [javadoc] Javadoc execution [javadoc] Loading source files for package com.clarkware.junitperf... [javadoc] Constructing Javadoc information... [javadoc] /home/iurt/rpmbuild/BUILD/junitperf-1.9.1/src/com/clarkware/junitperf/TestMethodFactory.java:23: error: unexpected end tag:

[javadoc] *

[javadoc] ^ [javadoc] /home/iurt/rpmbuild/BUILD/junitperf-1.9.1/src/com/clarkware/junitperf/TestFactory.java:32: error: unexpected end tag:

[javadoc] *

[javadoc] ^ [javadoc] Standard Doclet version 11.0.9-ea [javadoc] Building tree for all the packages and classes... [javadoc] /home/iurt/rpmbuild/BUILD/junitperf-1.9.1/src/com/clarkware/junitperf/LoadTest.java:30: error: unexpected end tag:

[javadoc] *

[javadoc] ^ [javadoc] /home/iurt/rpmbuild/BUILD/junitperf-1.9.1/src/com/clarkware/junitperf/LoadTest.java:50: error: unexpected end tag:

[javadoc] *

[javadoc] ^ [javadoc] /home/iurt/rpmbuild/BUILD/junitperf-1.9.1/src/com/clarkware/junitperf/LoadTest.java:86: error: unexpected end tag:

[javadoc] *

[javadoc] ^ [javadoc] /home/iurt/rpmbuild/BUILD/junitperf-1.9.1/src/com/clarkware/junitperf/TimedTest.java:49: error: unexpected end tag:

[javadoc] *

[javadoc] ^ [javadoc] Building index for all the packages and classes... [javadoc] Building index for all classes... [javadoc] Building index for all classes... [javadoc] Generating /home/iurt/rpmbuild/BUILD/junitperf-1.9.1/build/docs/api/help-doc.html... [javadoc] 6 errors BUILD SUCCESSFUL Total time: 1 minute 0 seconds + /usr/bin/python3 /usr/share/java-utils/mvn_artifact.py /home/iurt/rpmbuild/SOURCES/junitperf-1.9.1.pom dist/junitperf-1.9.1.jar + RPM_EC=0 ++ jobs -p + exit 0 Executing(%install): /bin/sh -e /home/iurt/rpmbuild/tmp/rpm-tmp.3Nik7M + umask 022 + cd /home/iurt/rpmbuild/BUILD + '[' 1 -eq 1 ']' + '[' /home/iurt/rpmbuild/BUILDROOT/junitperf-1.9.1-8.mga8.x86_64 '!=' / ']' + rm -rf /home/iurt/rpmbuild/BUILDROOT/junitperf-1.9.1-8.mga8.x86_64 ++ dirname /home/iurt/rpmbuild/BUILDROOT/junitperf-1.9.1-8.mga8.x86_64 + mkdir -p /home/iurt/rpmbuild/BUILDROOT + mkdir /home/iurt/rpmbuild/BUILDROOT/junitperf-1.9.1-8.mga8.x86_64 + cd junitperf-1.9.1 + '[' 1 -eq 1 ']' + xmvn-install -R .xmvn-reactor -n junitperf -d /home/iurt/rpmbuild/BUILDROOT/junitperf-1.9.1-8.mga8.x86_64 [INFO] Installing artifact junitperf:junitperf:pom:1.9.1 [INFO] Installing artifact junitperf:junitperf:jar:1.9.1 [INFO] Installation successful + jdir=target/site/apidocs + '[' -d .xmvn/apidocs ']' + /usr/bin/mkdir -p /home/iurt/rpmbuild/BUILDROOT/junitperf-1.9.1-8.mga8.x86_64/usr/share/licenses + '[' -d target/site/apidocs ']' + install -d -m 0755 /home/iurt/rpmbuild/BUILDROOT/junitperf-1.9.1-8.mga8.x86_64/usr/share/javadoc/junitperf + cp -pr build/docs/api/allclasses-index.html build/docs/api/allclasses.html build/docs/api/allpackages-index.html build/docs/api/com build/docs/api/constant-values.html build/docs/api/deprecated-list.html build/docs/api/element-list build/docs/api/help-doc.html build/docs/api/index-all.html build/docs/api/index.html build/docs/api/jquery build/docs/api/member-search-index.js build/docs/api/member-search-index.zip build/docs/api/overview-tree.html build/docs/api/package-search-index.js build/docs/api/package-search-index.zip build/docs/api/resources build/docs/api/script.js build/docs/api/search.js build/docs/api/stylesheet.css build/docs/api/type-search-index.js build/docs/api/type-search-index.zip /home/iurt/rpmbuild/BUILDROOT/junitperf-1.9.1-8.mga8.x86_64/usr/share/javadoc/junitperf + install -d -m 0755 /home/iurt/rpmbuild/BUILDROOT/junitperf-1.9.1-8.mga8.x86_64/usr/share/junitperf + cp -pr samples /home/iurt/rpmbuild/BUILDROOT/junitperf-1.9.1-8.mga8.x86_64/usr/share/junitperf + /usr/lib/rpm/find-debuginfo.sh -j96 --strict-build-id -m -i --build-id-seed 1.9.1-8.mga8 --unique-debug-suffix -1.9.1-8.mga8.x86_64 --unique-debug-src-base junitperf-1.9.1-8.mga8.x86_64 --run-dwz --dwz-low-mem-die-limit 10000000 --dwz-max-die-limit 110000000 -S debugsourcefiles.list /home/iurt/rpmbuild/BUILD/junitperf-1.9.1 + /usr/lib/rpm/check-buildroot + '[' -n '' ']' + /usr/share/spec-helper/clean_files + '[' -n '' ']' + /usr/share/spec-helper/compress_files .xz + '[' -n '' ']' + /usr/share/spec-helper/relink_symlinks + '[' -n '' ']' + /usr/share/spec-helper/clean_perl + '[' -n '' ']' + /usr/share/spec-helper/lib_symlinks + '[' -n '' ']' + /usr/share/spec-helper/gprintify + '[' -n '' ']' + /usr/share/spec-helper/fix_mo + '[' -n '' ']' + /usr/share/spec-helper/fix_pamd + '[' -n '' ']' + /usr/share/spec-helper/remove_info_dir + '[' -n '' ']' + /usr/share/spec-helper/fix_eol + '[' -n '' ']' + /usr/share/spec-helper/check_desktop_files + '[' -n '' ']' + /usr/share/spec-helper/check_elf_files + /usr/lib/rpm/brp-python-bytecompile /usr/bin/python3 1 1 + /usr/lib/rpm/brp-python-hardlink + /usr/lib/rpm/redhat/brp-mangle-shebangs Processing files: junitperf-1.9.1-8.mga8.noarch Executing(%doc): /bin/sh -e /home/iurt/rpmbuild/tmp/rpm-tmp.iG31fN + umask 022 + cd /home/iurt/rpmbuild/BUILD + cd junitperf-1.9.1 + DOCDIR=/home/iurt/rpmbuild/BUILDROOT/junitperf-1.9.1-8.mga8.x86_64/usr/share/doc/junitperf + export LC_ALL=C + LC_ALL=C + export DOCDIR + /usr/bin/mkdir -p /home/iurt/rpmbuild/BUILDROOT/junitperf-1.9.1-8.mga8.x86_64/usr/share/doc/junitperf + cp -pr LICENSE /home/iurt/rpmbuild/BUILDROOT/junitperf-1.9.1-8.mga8.x86_64/usr/share/doc/junitperf + cp -pr README /home/iurt/rpmbuild/BUILDROOT/junitperf-1.9.1-8.mga8.x86_64/usr/share/doc/junitperf + cp -pr docs/JUnitPerf.html /home/iurt/rpmbuild/BUILDROOT/junitperf-1.9.1-8.mga8.x86_64/usr/share/doc/junitperf + RPM_EC=0 ++ jobs -p + exit 0 warning: File listed twice: /usr/share/java/junitperf [INFO maven.prov] input: ['/home/iurt/rpmbuild/BUILDROOT/junitperf-1.9.1-8.mga8.x86_64/usr/share/maven-metadata/junitperf.xml'] [INFO maven.prov] mvn(junitperf:junitperf) = 1.9.1, mvn(junitperf:junitperf:pom:) = 1.9.1 [INFO osgi.prov] input: ['/home/iurt/rpmbuild/BUILDROOT/junitperf-1.9.1-8.mga8.x86_64/usr/share/java/junitperf/junitperf.jar'] [INFO maven.req] input: ['/home/iurt/rpmbuild/BUILDROOT/junitperf-1.9.1-8.mga8.x86_64/usr/share/maven-metadata/junitperf.xml'] [INFO maven.req] javapackages-filesystem, java-headless [INFO osgi.req] input: ['/home/iurt/rpmbuild/BUILDROOT/junitperf-1.9.1-8.mga8.x86_64/usr/share/java/junitperf/junitperf.jar'] Provides: junitperf = 1.9.1-8.mga8 mvn(junitperf:junitperf) = 1.9.1 mvn(junitperf:junitperf:pom:) = 1.9.1 Requires(rpmlib): rpmlib(CompressedFileNames) <= 3.0.4-1 rpmlib(FileDigests) <= 4.6.0-1 rpmlib(PayloadFilesHavePrefix) <= 4.0-1 Requires: java-headless javapackages-filesystem Processing files: junitperf-javadoc-1.9.1-8.mga8.noarch Executing(%doc): /bin/sh -e /home/iurt/rpmbuild/tmp/rpm-tmp.NfFxGP + umask 022 + cd /home/iurt/rpmbuild/BUILD + cd junitperf-1.9.1 + DOCDIR=/home/iurt/rpmbuild/BUILDROOT/junitperf-1.9.1-8.mga8.x86_64/usr/share/doc/junitperf-javadoc + export LC_ALL=C + LC_ALL=C + export DOCDIR + /usr/bin/mkdir -p /home/iurt/rpmbuild/BUILDROOT/junitperf-1.9.1-8.mga8.x86_64/usr/share/doc/junitperf-javadoc + cp -pr LICENSE /home/iurt/rpmbuild/BUILDROOT/junitperf-1.9.1-8.mga8.x86_64/usr/share/doc/junitperf-javadoc + RPM_EC=0 ++ jobs -p + exit 0 pcregrep: line 13 of file /home/iurt/rpmbuild/BUILDROOT/junitperf-1.9.1-8.mga8.x86_64/usr/share/javadoc/junitperf/jquery/jszip/dist/jszip.min.js is too long for the internal buffer pcregrep: check the --buffer-size option pcregrep: line 13 of file /home/iurt/rpmbuild/BUILDROOT/junitperf-1.9.1-8.mga8.x86_64/usr/share/javadoc/junitperf/jquery/jszip/dist/jszip.min.js is too long for the internal buffer pcregrep: check the --buffer-size option Provides: junitperf-javadoc = 1.9.1-8.mga8 Requires(rpmlib): rpmlib(CompressedFileNames) <= 3.0.4-1 rpmlib(FileDigests) <= 4.6.0-1 rpmlib(PayloadFilesHavePrefix) <= 4.0-1 Requires: javapackages-filesystem Processing files: junitperf-demo-1.9.1-8.mga8.noarch Executing(%doc): /bin/sh -e /home/iurt/rpmbuild/tmp/rpm-tmp.7Q798M + umask 022 + cd /home/iurt/rpmbuild/BUILD + cd junitperf-1.9.1 + DOCDIR=/home/iurt/rpmbuild/BUILDROOT/junitperf-1.9.1-8.mga8.x86_64/usr/share/doc/junitperf-demo + export LC_ALL=C + LC_ALL=C + export DOCDIR + /usr/bin/mkdir -p /home/iurt/rpmbuild/BUILDROOT/junitperf-1.9.1-8.mga8.x86_64/usr/share/doc/junitperf-demo + cp -pr LICENSE /home/iurt/rpmbuild/BUILDROOT/junitperf-1.9.1-8.mga8.x86_64/usr/share/doc/junitperf-demo + RPM_EC=0 ++ jobs -p + exit 0 Provides: junitperf-demo = 1.9.1-8.mga8 Requires(rpmlib): rpmlib(CompressedFileNames) <= 3.0.4-1 rpmlib(FileDigests) <= 4.6.0-1 rpmlib(PayloadFilesHavePrefix) <= 4.0-1 Checking for unpackaged file(s): /usr/lib/rpm/check-files /home/iurt/rpmbuild/BUILDROOT/junitperf-1.9.1-8.mga8.x86_64 Wrote: /home/iurt/rpmbuild/RPMS/noarch/junitperf-demo-1.9.1-8.mga8.noarch.rpm Wrote: /home/iurt/rpmbuild/RPMS/noarch/junitperf-1.9.1-8.mga8.noarch.rpm Wrote: /home/iurt/rpmbuild/RPMS/noarch/junitperf-javadoc-1.9.1-8.mga8.noarch.rpm Executing(%clean): /bin/sh -e /home/iurt/rpmbuild/tmp/rpm-tmp.2qpXpM + umask 022 + cd /home/iurt/rpmbuild/BUILD + cd junitperf-1.9.1 + /usr/bin/rm -rf /home/iurt/rpmbuild/BUILDROOT/junitperf-1.9.1-8.mga8.x86_64 + RPM_EC=0 ++ jobs -p + exit 0 Executing(--clean): /bin/sh -e /home/iurt/rpmbuild/tmp/rpm-tmp.CuTzeQ + umask 022 + cd /home/iurt/rpmbuild/BUILD + rm -rf junitperf-1.9.1 + RPM_EC=0 ++ jobs -p + exit 0 D: [iurt_root_command] Success!