D: [iurt_root_command] chroot
Installing /home/iurt/rpmbuild/SRPMS/jcsp-1.1-0.10.rc5.2.mga8.src.rpm
Building target platforms: x86_64
Building for target x86_64
Executing(%prep): /bin/sh -e /home/iurt/rpmbuild/tmp/rpm-tmp.mXJtHB
+ umask 022
+ cd /home/iurt/rpmbuild/BUILD
+ '[' 1 -eq 1 ']'
+ '[' 1 -eq 1 ']'
+ '[' 1 -eq 1 ']'
+ cd /home/iurt/rpmbuild/BUILD
+ rm -rf jcsp-1.1-rc5
+ /usr/bin/xz -dc /home/iurt/rpmbuild/SOURCES/jcsp-1.1-rc5-clean.tar.xz
+ /usr/bin/tar -xof -
+ STATUS=0
+ '[' 0 -ne 0 ']'
+ cd jcsp-1.1-rc5
+ /usr/bin/chmod -Rf a+rX,u+w,g-w,o-w .
+ /usr/bin/python3 /usr/share/java-utils/pom_editor.py pom_remove_plugin :cobertura-maven-plugin
+ /usr/bin/python3 /usr/share/java-utils/pom_editor.py pom_remove_plugin :findbugs-maven-plugin
+ /usr/bin/python3 /usr/share/java-utils/pom_editor.py pom_remove_plugin :jdepend-maven-plugin
+ /usr/bin/python3 /usr/share/java-utils/pom_editor.py pom_remove_plugin :rat-maven-plugin
+ /usr/bin/python3 /usr/share/java-utils/pom_editor.py pom_remove_plugin :taglist-maven-plugin
+ /usr/bin/python3 /usr/share/java-utils/pom_editor.py pom_change_dep :org.osgi.core org.osgi:osgi.core
+ /usr/bin/python3 /usr/share/java-utils/pom_editor.py pom_xpath_remove pom:project/pom:build/pom:extensions
+ /usr/bin/python3 /usr/share/java-utils/pom_editor.py pom_xpath_inject pom:project/pom:build '
src
**/*.java
**/doc-files/**
**/win32/*Services.txt
**/package.html
'
+ /usr/bin/python3 /usr/share/java-utils/pom_editor.py pom_xpath_remove 'pom:project/pom:reporting/pom:plugins/pom:plugin[pom:artifactId='\''maven-javadoc-plugin'\'']/pom:configuration/pom:excludePackageNames'
+ /usr/bin/python3 /usr/share/java-utils/pom_editor.py pom_xpath_remove 'pom:project/pom:build/pom:plugins/pom:plugin[pom:artifactId='\''maven-bundle-plugin'\'']/pom:configuration/pom:instructions/pom:Export-Package'
+ /usr/bin/python3 /usr/share/java-utils/pom_editor.py pom_xpath_inject 'pom:project/pom:build/pom:plugins/pom:plugin[pom:artifactId='\''maven-bundle-plugin'\'']/pom:configuration/pom:instructions' '
org.jcsp.*;version="${project.version}"'
+ sed -i 's|${name}|${project.name}|' pom.xml
+ sed -i 's|59 Temple Place, Suite 330, Boston, MA 02111-1307 USA|51 Franklin Street, Fifth Floor, Boston, MA 02110-1301 USA|' pom.xml
+ for d in LICENCE README
+ iconv -f iso8859-1 -t utf-8 LICENCE.txt
+ mv -f LICENCE.txt.conv LICENCE.txt
+ sed -i 's/\r//' LICENCE.txt
+ for d in LICENCE README
+ iconv -f iso8859-1 -t utf-8 README.txt
+ mv -f README.txt.conv README.txt
+ sed -i 's/\r//' README.txt
+ rm -r src/org/jcsp/win32 src/org/jcsp/net/remote/SpawnerServiceNT.java src/org/jcsp/net/tcpip/TCPIPCNSServerNT.java
+ /usr/bin/python3 /usr/share/java-utils/mvn_file.py : jcsp
+ RPM_EC=0
++ jobs -p
+ exit 0
Executing(%build): /bin/sh -e /home/iurt/rpmbuild/tmp/rpm-tmp.mTbXtA
+ umask 022
+ cd /home/iurt/rpmbuild/BUILD
+ cd jcsp-1.1-rc5
+ '[' 1 -eq 1 ']'
+ '[' 1 -eq 1 ']'
+ /usr/bin/python3 /usr/share/java-utils/mvn_build.py --xmvn-javadoc -- -Dproject.build.sourceEncoding=UTF-8
Executing: xmvn --batch-mode --offline -Dproject.build.sourceEncoding=UTF-8 verify org.fedoraproject.xmvn:xmvn-mojo:install org.fedoraproject.xmvn:xmvn-mojo:javadoc org.fedoraproject.xmvn:xmvn-mojo:builddep
['xmvn', '--batch-mode', '--offline', '-Dproject.build.sourceEncoding=UTF-8', 'verify', 'org.fedoraproject.xmvn:xmvn-mojo:install', 'org.fedoraproject.xmvn:xmvn-mojo:javadoc', 'org.fedoraproject.xmvn:xmvn-mojo:builddep']
[INFO] Scanning for projects...
[WARNING]
[WARNING] Some problems were encountered while building the effective model for org.codehaus.jcsp:jcsp:bundle:1.1-rc5
[WARNING] 'build.plugins.plugin.version' for org.apache.maven.plugins:maven-compiler-plugin is missing. @ line 99, column 15
[WARNING] 'build.plugins.plugin.version' for org.apache.felix:maven-bundle-plugin is missing. @ line 129, column 15
[WARNING]
[WARNING] It is highly recommended to fix these problems because they threaten the stability of your build.
[WARNING]
[WARNING] For this reason, future Maven versions might no longer support building such malformed projects.
[WARNING]
[INFO]
[INFO] -----------------------< org.codehaus.jcsp:jcsp >-----------------------
[INFO] Building The JCSP Library 1.1-rc5
[INFO] -------------------------------[ bundle ]-------------------------------
[INFO]
[INFO] --- maven-resources-plugin:3.2.0:resources (default-resources) @ jcsp ---
[INFO] Using 'UTF-8' encoding to copy filtered resources.
[INFO] Using 'UTF-8' encoding to copy filtered properties files.
[INFO] Copying 5 resources
[INFO]
[INFO] --- maven-compiler-plugin:3.8.1:compile (default-compile) @ jcsp ---
[INFO] Changes detected - recompiling the module!
[INFO] Compiling 591 source files to /home/iurt/rpmbuild/BUILD/jcsp-1.1-rc5/target/classes
[INFO] -------------------------------------------------------------
[ERROR] COMPILATION ERROR :
[INFO] -------------------------------------------------------------
[ERROR] Source option 5 is no longer supported. Use 6 or later.
[ERROR] Target option 1.5 is no longer supported. Use 1.6 or later.
[INFO] 2 errors
[INFO] -------------------------------------------------------------
[INFO]
[INFO] ------------------------------------------------------------------------
[INFO] Skipping The JCSP Library
[INFO] This project has been banned from the build due to previous failures.
[INFO] ------------------------------------------------------------------------
[INFO] ------------------------------------------------------------------------
[INFO] BUILD FAILURE
[INFO] ------------------------------------------------------------------------
[INFO] Total time: 3.406 s
[INFO] Finished at: 2020-11-08T09:47:33Z
[INFO] ------------------------------------------------------------------------
[ERROR] Failed to execute goal org.apache.maven.plugins:maven-compiler-plugin:3.8.1:compile (default-compile) on project jcsp: Compilation failure: Compilation failure:
[ERROR] Source option 5 is no longer supported. Use 6 or later.
[ERROR] Target option 1.5 is no longer supported. Use 1.6 or later.
[ERROR] -> [Help 1]
[ERROR]
[ERROR] To see the full stack trace of the errors, re-run Maven with the -e switch.
[ERROR] Re-run Maven using the -X switch to enable full debug logging.
[ERROR]
[ERROR] For more information about the errors and possible solutions, please read the following articles:
[ERROR] [Help 1] http://cwiki.apache.org/confluence/display/MAVEN/MojoFailureException
error: Bad exit status from /home/iurt/rpmbuild/tmp/rpm-tmp.mTbXtA (%build)
RPM build errors:
Bad exit status from /home/iurt/rpmbuild/tmp/rpm-tmp.mTbXtA (%build)
I: [iurt_root_command] ERROR: chroot