D: [iurt_root_command] chroot
Installing /home/iurt/rpmbuild/SRPMS/closure-compiler-20160315-4.mga8.src.rpm
Building target platforms: x86_64
Building for target x86_64
Executing(%prep): /bin/sh -e /home/iurt/rpmbuild/tmp/rpm-tmp.mNJEPG
+ umask 022
+ cd /home/iurt/rpmbuild/BUILD
+ '[' 1 -eq 1 ']'
+ '[' 1 -eq 1 ']'
+ '[' 1 -eq 1 ']'
+ cd /home/iurt/rpmbuild/BUILD
+ rm -rf closure-compiler-maven-release-v20160315
+ /usr/bin/gzip -dc /home/iurt/rpmbuild/SOURCES/closure-compiler-20160315.tar.gz
+ /usr/bin/tar -xof -
+ STATUS=0
+ '[' 0 -ne 0 ']'
+ cd closure-compiler-maven-release-v20160315
+ /usr/bin/chmod -Rf a+rX,u+w,g-w,o-w .
+ rm -rf lib/ant-launcher.jar lib/ant.jar lib/args4j.jar lib/gson.jar lib/guava.jar lib/jsr305.jar lib/junit.jar lib/protobuf-java.jar lib/truth.jar
+ /usr/bin/python3 /usr/share/java-utils/pom_editor.py pom_disable_module pom-main-shaded.xml pom-main.xml
+ /usr/bin/python3 /usr/share/java-utils/mvn_alias.py :closure-compiler-unshaded :closure-compiler
+ /usr/bin/python3 /usr/share/java-utils/pom_editor.py pom_xpath_inject 'pom:plugin[pom:artifactId='\''maven-bundle-plugin'\'']' '
${project.groupId}
' pom-main.xml
+ RPM_EC=0
++ jobs -p
+ exit 0
Executing(%build): /bin/sh -e /home/iurt/rpmbuild/tmp/rpm-tmp.Fr9urE
+ umask 022
+ cd /home/iurt/rpmbuild/BUILD
+ cd closure-compiler-maven-release-v20160315
+ '[' 1 -eq 1 ']'
+ '[' 1 -eq 1 ']'
+ /usr/bin/python3 /usr/share/java-utils/mvn_build.py --xmvn-javadoc -f
Executing: xmvn --batch-mode --offline -Dmaven.test.skip=true package org.fedoraproject.xmvn:xmvn-mojo:install org.fedoraproject.xmvn:xmvn-mojo:javadoc org.fedoraproject.xmvn:xmvn-mojo:builddep
['xmvn', '--batch-mode', '--offline', '-Dmaven.test.skip=true', 'package', 'org.fedoraproject.xmvn:xmvn-mojo:install', 'org.fedoraproject.xmvn:xmvn-mojo:javadoc', 'org.fedoraproject.xmvn:xmvn-mojo:builddep']
[INFO] Scanning for projects...
[WARNING] The project com.google.javascript:closure-compiler-parent:pom:v20160315 uses prerequisites which is only intended for maven-plugin projects but not for non maven-plugin projects. For such purposes you should use the maven-enforcer-plugin. See https://maven.apache.org/enforcer/enforcer-rules/requireMavenVersion.html
[INFO] ------------------------------------------------------------------------
[INFO] Reactor Build Order:
[INFO]
[INFO] Closure Compiler Parent [pom]
[INFO] Closure Compiler Externs [jar]
[INFO] Closure Compiler Main [pom]
[INFO] Closure Compiler Unshaded [jar]
[INFO]
[INFO] -----------< com.google.javascript:closure-compiler-parent >------------
[INFO] Building Closure Compiler Parent v20160315 [1/4]
[INFO] --------------------------------[ pom ]---------------------------------
[INFO]
[INFO] -----------< com.google.javascript:closure-compiler-externs >-----------
[INFO] Building Closure Compiler Externs v20160315 [2/4]
[INFO] --------------------------------[ jar ]---------------------------------
[INFO]
[INFO] --- maven-antrun-plugin:1.8:run (default) @ closure-compiler-externs ---
[WARNING] Parameter tasks is deprecated, use target instead
[INFO] Executing tasks
main:
[zip] Building zip: /home/iurt/rpmbuild/BUILD/closure-compiler-maven-release-v20160315/target/classes/externs.zip
[zip] Building zip: /home/iurt/rpmbuild/BUILD/closure-compiler-maven-release-v20160315/externs/target/classes/externs.zip
[INFO] Executed tasks
[INFO]
[INFO] --- maven-resources-plugin:3.2.0:resources (default-resources) @ closure-compiler-externs ---
[INFO] Using 'UTF-8' encoding to copy filtered resources.
[INFO] Using 'UTF-8' encoding to copy filtered properties files.
[INFO] skip non existing resourceDirectory /home/iurt/rpmbuild/BUILD/closure-compiler-maven-release-v20160315/externs/target/generated-resources
[INFO]
[INFO] --- maven-compiler-plugin:3.8.1:compile (default-compile) @ closure-compiler-externs ---
[INFO] No sources to compile
[INFO]
[INFO] --- maven-resources-plugin:3.2.0:testResources (default-testResources) @ closure-compiler-externs ---
[INFO] Not copying test resources
[INFO]
[INFO] --- maven-compiler-plugin:3.8.1:testCompile (default-testCompile) @ closure-compiler-externs ---
[INFO] Not compiling test sources
[INFO]
[INFO] --- maven-surefire-plugin:2.22.0:test (default-test) @ closure-compiler-externs ---
[INFO] Tests are skipped.
[INFO]
[INFO] --- maven-jar-plugin:3.2.0:jar (default-jar) @ closure-compiler-externs ---
[INFO] Building jar: /home/iurt/rpmbuild/BUILD/closure-compiler-maven-release-v20160315/externs/target/closure-compiler-externs-v20160315.jar
[INFO]
[INFO] ------------< com.google.javascript:closure-compiler-main >-------------
[INFO] Building Closure Compiler Main v20160315 [3/4]
[INFO] --------------------------------[ pom ]---------------------------------
[INFO]
[INFO] --- build-helper-maven-plugin:3.2.0:add-source (add-source) @ closure-compiler-main ---
[INFO] Source directory: /home/iurt/rpmbuild/BUILD/closure-compiler-maven-release-v20160315/gen added.
[INFO]
[INFO] --- maven-resources-plugin:3.2.0:copy-resources (rhino_ast-custom) @ closure-compiler-main ---
[INFO] Using 'UTF-8' encoding to copy filtered resources.
[INFO] Using 'UTF-8' encoding to copy filtered properties files.
[INFO] Copying 1 resource to /home/iurt/rpmbuild/BUILD/closure-compiler-maven-release-v20160315/target/classes
[INFO]
[INFO] --- maven-bundle-plugin:4.2.1:manifest (bundle-manifest) @ closure-compiler-main ---
[WARNING] Ignoring project type pom - supportedProjectTypes = [jar, bundle]
[INFO]
[INFO] --- build-helper-maven-plugin:3.2.0:add-test-source (add-test-source) @ closure-compiler-main ---
[INFO] Test Source directory: /home/iurt/rpmbuild/BUILD/closure-compiler-maven-release-v20160315/src/com/google/javascript/rhino/testing added.
[INFO] Test Source directory: /home/iurt/rpmbuild/BUILD/closure-compiler-maven-release-v20160315/src/com/google/javascript/jscomp/testing added.
[INFO] Test Source directory: /home/iurt/rpmbuild/BUILD/closure-compiler-maven-release-v20160315/src/com/google/javascript/refactoring/testing added.
[INFO]
[INFO] ----------< com.google.javascript:closure-compiler-unshaded >-----------
[INFO] Building Closure Compiler Unshaded v20160315 [4/4]
[INFO] --------------------------------[ jar ]---------------------------------
[INFO]
[INFO] --- build-helper-maven-plugin:3.2.0:add-source (add-source) @ closure-compiler-unshaded ---
[INFO] Source directory: /home/iurt/rpmbuild/BUILD/closure-compiler-maven-release-v20160315/gen added.
[INFO]
[INFO] --- maven-resources-plugin:3.2.0:resources (default-resources) @ closure-compiler-unshaded ---
[INFO] Using 'UTF-8' encoding to copy filtered resources.
[INFO] Using 'UTF-8' encoding to copy filtered properties files.
[INFO] Copying 34 resources
[INFO] The encoding used to copy filtered properties files have not been set. This means that the same encoding will be used to copy filtered properties files as when copying other filtered resources. This might not be what you want! Run your build with --debug to see which files might be affected. Read more at https://maven.apache.org/plugins/maven-resources-plugin/examples/filtering-properties-files.html
[INFO]
[INFO] --- maven-resources-plugin:3.2.0:copy-resources (rhino_ast-custom) @ closure-compiler-unshaded ---
[INFO] Using 'UTF-8' encoding to copy filtered resources.
[INFO] Using 'UTF-8' encoding to copy filtered properties files.
[INFO] Copying 1 resource to /home/iurt/rpmbuild/BUILD/closure-compiler-maven-release-v20160315/target/classes
[INFO]
[INFO] --- maven-compiler-plugin:3.8.1:compile (default-compile) @ closure-compiler-unshaded ---
[INFO] Changes detected - recompiling the module!
[INFO] Compiling 653 source files to /home/iurt/rpmbuild/BUILD/closure-compiler-maven-release-v20160315/target/classes
[WARNING] [options] bootstrap class path not set in conjunction with -source 7
[WARNING] /home/iurt/rpmbuild/BUILD/closure-compiler-maven-release-v20160315/src/com/google/javascript/jscomp/ReferenceCollectingCallback.java:[115,17] [deprecation] traverseRoots(AbstractCompiler,Callback,Node,Node) in NodeTraversal has been deprecated
[WARNING] /home/iurt/rpmbuild/BUILD/closure-compiler-maven-release-v20160315/gen/com/google/debugging/sourcemap/proto/Mapping.java:[1792,50] [deprecation] InternalDescriptorAssigner in FileDescriptor has been deprecated
[WARNING] /home/iurt/rpmbuild/BUILD/closure-compiler-maven-release-v20160315/gen/com/google/debugging/sourcemap/proto/Mapping.java:[1793,56] [deprecation] InternalDescriptorAssigner in FileDescriptor has been deprecated
[WARNING] /home/iurt/rpmbuild/BUILD/closure-compiler-maven-release-v20160315/gen/com/google/debugging/sourcemap/proto/Mapping.java:[1813,6] [deprecation] internalBuildGeneratedFileFrom(String[],FileDescriptor[],InternalDescriptorAssigner) in FileDescriptor has been deprecated
[WARNING] /home/iurt/rpmbuild/BUILD/closure-compiler-maven-release-v20160315/src/com/google/javascript/rhino/jstype/JSTypeRegistry.java:[964,16] [unchecked] getType(String) in JSTypeRegistry implements getType(String) in TypeIRegistry
return type requires unchecked conversion from JSType to T
where T is a type-variable:
T extends TypeI declared in method getType(String)
[WARNING] /home/iurt/rpmbuild/BUILD/closure-compiler-maven-release-v20160315/src/com/google/javascript/rhino/jstype/JSTypeRegistry.java:[975,16] [unchecked] getNativeType(JSTypeNative) in JSTypeRegistry implements getNativeType(JSTypeNative) in TypeIRegistry
return type requires unchecked conversion from JSType to T
where T is a type-variable:
T extends TypeI declared in method getNativeType(JSTypeNative)
[WARNING] /home/iurt/rpmbuild/BUILD/closure-compiler-maven-release-v20160315/src/com/google/javascript/rhino/jstype/JSTypeRegistry.java:[980,20] [unchecked] getNativeObjectType(JSTypeNative) in JSTypeRegistry implements getNativeObjectType(JSTypeNative) in TypeIRegistry
return type requires unchecked conversion from ObjectType to T
where T is a type-variable:
T extends ObjectTypeI declared in method getNativeObjectType(JSTypeNative)
[WARNING] /home/iurt/rpmbuild/BUILD/closure-compiler-maven-release-v20160315/src/com/google/javascript/rhino/jstype/JSTypeRegistry.java:[985,22] [unchecked] getNativeFunctionType(JSTypeNative) in JSTypeRegistry implements getNativeFunctionType(JSTypeNative) in TypeIRegistry
return type requires unchecked conversion from FunctionType to T
where T is a type-variable:
T extends FunctionTypeI declared in method getNativeFunctionType(JSTypeNative)
[WARNING] /home/iurt/rpmbuild/BUILD/closure-compiler-maven-release-v20160315/src/com/google/javascript/rhino/jstype/JSTypeRegistry.java:[1508,81] [unchecked] unchecked cast
required: StaticTypedScope
found: StaticTypedScope
where CAP#1 is a fresh type-variable:
CAP#1 extends TypeI from capture of ? extends TypeI
[WARNING] /home/iurt/rpmbuild/BUILD/closure-compiler-maven-release-v20160315/src/com/google/javascript/jscomp/JSModuleGraph.java:[187,18] [deprecation] propagate(Throwable) in Throwables has been deprecated
[WARNING] /home/iurt/rpmbuild/BUILD/closure-compiler-maven-release-v20160315/src/com/google/javascript/jscomp/TypedScope.java:[216,28] [unchecked] getVars() in TypedScope overrides getVars() in Scope
return type requires unchecked conversion from Iterator to Iterator
where T is a type-variable:
T extends Var declared in method getVars()
[WARNING] /home/iurt/rpmbuild/BUILD/closure-compiler-maven-release-v20160315/src/com/google/javascript/jscomp/GlobalTypeInfo.java:[727,12] [fallthrough] possible fall-through into case
[WARNING] /home/iurt/rpmbuild/BUILD/closure-compiler-maven-release-v20160315/src/com/google/javascript/jscomp/CheckEventfulObjectDisposal.java:[1264,66] [unchecked] unchecked cast
required: Set
found: Set
where CAP#1 is a fresh type-variable:
CAP#1 extends Var from capture of ? extends Var
[WARNING] /home/iurt/rpmbuild/BUILD/closure-compiler-maven-release-v20160315/src/com/google/javascript/jscomp/newtypes/RawNominalType.java:[509,14] [deprecation] finalize() in Object has been deprecated
[WARNING] /home/iurt/rpmbuild/BUILD/closure-compiler-maven-release-v20160315/src/com/google/javascript/jscomp/Compiler.java:[1221,17] [deprecation] traverse(AbstractCompiler,Node,Callback) in NodeTraversal has been deprecated
[WARNING] /home/iurt/rpmbuild/BUILD/closure-compiler-maven-release-v20160315/src/com/google/javascript/jscomp/Compiler.java:[1380,23] [deprecation] traverse(AbstractCompiler,Node,Callback) in NodeTraversal has been deprecated
[WARNING] /home/iurt/rpmbuild/BUILD/closure-compiler-maven-release-v20160315/gen/com/google/javascript/jscomp/FunctionInformationMap.java:[2102,12] [deprecation] writeGroup(int,MessageLite) in CodedOutputStream has been deprecated
[WARNING] /home/iurt/rpmbuild/BUILD/closure-compiler-maven-release-v20160315/gen/com/google/javascript/jscomp/FunctionInformationMap.java:[2105,12] [deprecation] writeGroup(int,MessageLite) in CodedOutputStream has been deprecated
[WARNING] /home/iurt/rpmbuild/BUILD/closure-compiler-maven-release-v20160315/gen/com/google/javascript/jscomp/FunctionInformationMap.java:[2118,8] [deprecation] computeGroupSize(int,MessageLite) in CodedOutputStream has been deprecated
[WARNING] /home/iurt/rpmbuild/BUILD/closure-compiler-maven-release-v20160315/gen/com/google/javascript/jscomp/FunctionInformationMap.java:[2122,8] [deprecation] computeGroupSize(int,MessageLite) in CodedOutputStream has been deprecated
[WARNING] /home/iurt/rpmbuild/BUILD/closure-compiler-maven-release-v20160315/src/com/google/javascript/jscomp/CompilerExecutor.java:[114,24] [deprecation] propagate(Throwable) in Throwables has been deprecated
[WARNING] /home/iurt/rpmbuild/BUILD/closure-compiler-maven-release-v20160315/src/com/google/javascript/jscomp/CompilerExecutor.java:[128,16] [deprecation] propagate(Throwable) in Throwables has been deprecated
[WARNING] /home/iurt/rpmbuild/BUILD/closure-compiler-maven-release-v20160315/src/com/google/javascript/jscomp/MemoizedScopeCreator.java:[82,20] [unchecked] createScope(Node,Scope) in MemoizedScopeCreator implements createScope(Node,T) in ScopeCreator
return type requires unchecked conversion from TypedScope to T
where T is a type-variable:
T extends Scope declared in method createScope(Node,T)
[WARNING] /home/iurt/rpmbuild/BUILD/closure-compiler-maven-release-v20160315/src/com/google/javascript/jscomp/DefaultPassConfig.java:[1086,17] [deprecation] brokenClosureRequiresLevel in CompilerOptions has been deprecated
[WARNING] /home/iurt/rpmbuild/BUILD/closure-compiler-maven-release-v20160315/src/com/google/javascript/jscomp/SymbolTable.java:[475,17] [deprecation] traverseRoots(AbstractCompiler,Callback,Node,Node) in NodeTraversal has been deprecated
[WARNING] /home/iurt/rpmbuild/BUILD/closure-compiler-maven-release-v20160315/src/com/google/javascript/jscomp/SymbolTable.java:[855,17] [deprecation] traverseRoots(AbstractCompiler,Callback,Node,Node) in NodeTraversal has been deprecated
[WARNING] /home/iurt/rpmbuild/BUILD/closure-compiler-maven-release-v20160315/src/com/google/javascript/jscomp/SymbolTable.java:[914,17] [deprecation] traverseRoots(AbstractCompiler,Callback,Node,Node) in NodeTraversal has been deprecated
[WARNING] /home/iurt/rpmbuild/BUILD/closure-compiler-maven-release-v20160315/src/com/google/javascript/jscomp/SymbolTable.java:[1307,19] [deprecation] traverseRoots(AbstractCompiler,Callback,Node,Node) in NodeTraversal has been deprecated
[WARNING] /home/iurt/rpmbuild/BUILD/closure-compiler-maven-release-v20160315/src/com/google/javascript/jscomp/SymbolTable.java:[1436,19] [deprecation] traverseRoots(AbstractCompiler,Callback,Node,Node) in NodeTraversal has been deprecated
[WARNING] /home/iurt/rpmbuild/BUILD/closure-compiler-maven-release-v20160315/src/com/google/javascript/jscomp/SymbolTable.java:[1750,40] [unchecked] unchecked cast
required: StaticTypedSlot
found: StaticSlot
[WARNING] /home/iurt/rpmbuild/BUILD/closure-compiler-maven-release-v20160315/src/com/google/javascript/jscomp/SymbolTable.java:[1757,41] [unchecked] unchecked cast
required: StaticTypedScope
found: StaticScope
[WARNING] /home/iurt/rpmbuild/BUILD/closure-compiler-maven-release-v20160315/src/com/google/javascript/jscomp/SymbolTable.java:[1764,40] [unchecked] unchecked cast
required: StaticTypedSlot
found: StaticSlot
[WARNING] /home/iurt/rpmbuild/BUILD/closure-compiler-maven-release-v20160315/src/com/google/javascript/jscomp/TypeCheck.java:[717,6] [fallthrough] possible fall-through into case
[WARNING] /home/iurt/rpmbuild/BUILD/closure-compiler-maven-release-v20160315/src/com/google/javascript/jscomp/TypedScopeCreator.java:[219,20] [unchecked] createScope(Node,Scope) in TypedScopeCreator implements createScope(Node,T) in ScopeCreator
return type requires unchecked conversion from TypedScope to T
where T is a type-variable:
T extends Scope declared in method createScope(Node,T)
[WARNING] /home/iurt/rpmbuild/BUILD/closure-compiler-maven-release-v20160315/src/com/google/javascript/jscomp/parsing/parser/Scanner.java:[862,8] [fallthrough] possible fall-through into case
[WARNING] /home/iurt/rpmbuild/BUILD/closure-compiler-maven-release-v20160315/src/com/google/javascript/jscomp/NodeUtil.java:[2288,6] [fallthrough] possible fall-through into case
[WARNING] /home/iurt/rpmbuild/BUILD/closure-compiler-maven-release-v20160315/src/com/google/javascript/jscomp/VarCheck.java:[304,10] [fallthrough] possible fall-through into case
[WARNING] /home/iurt/rpmbuild/BUILD/closure-compiler-maven-release-v20160315/src/com/google/javascript/jscomp/DartSuperAccessorsPass.java:[141,17] [deprecation] traverse(AbstractCompiler,Node,Callback) in NodeTraversal has been deprecated
[WARNING] /home/iurt/rpmbuild/BUILD/closure-compiler-maven-release-v20160315/src/com/google/javascript/jscomp/DartSuperAccessorsPass.java:[187,17] [deprecation] traverse(AbstractCompiler,Node,Callback) in NodeTraversal has been deprecated
[WARNING] /home/iurt/rpmbuild/BUILD/closure-compiler-maven-release-v20160315/src/com/google/javascript/jscomp/DartSuperAccessorsPass.java:[188,17] [deprecation] traverse(AbstractCompiler,Node,Callback) in NodeTraversal has been deprecated
[WARNING] /home/iurt/rpmbuild/BUILD/closure-compiler-maven-release-v20160315/src/com/google/javascript/jscomp/DartSuperAccessorsPass.java:[193,17] [deprecation] traverse(AbstractCompiler,Node,Callback) in NodeTraversal has been deprecated
[WARNING] /home/iurt/rpmbuild/BUILD/closure-compiler-maven-release-v20160315/src/com/google/javascript/jscomp/CheckConformance.java:[255,18] [deprecation] printToString(MessageOrBuilder) in TextFormat has been deprecated
[WARNING] /home/iurt/rpmbuild/BUILD/closure-compiler-maven-release-v20160315/src/com/google/javascript/jscomp/ConformanceRules.java:[1014,24] [deprecation] propagate(Throwable) in Throwables has been deprecated
[WARNING] /home/iurt/rpmbuild/BUILD/closure-compiler-maven-release-v20160315/src/com/google/javascript/jscomp/ExpressionDecomposer.java:[682,8] [fallthrough] possible fall-through into case
[WARNING] /home/iurt/rpmbuild/BUILD/closure-compiler-maven-release-v20160315/gen/com/google/javascript/jscomp/InstrumentationTemplate.java:[33,50] [deprecation] InternalDescriptorAssigner in FileDescriptor has been deprecated
[WARNING] /home/iurt/rpmbuild/BUILD/closure-compiler-maven-release-v20160315/gen/com/google/javascript/jscomp/InstrumentationTemplate.java:[34,56] [deprecation] InternalDescriptorAssigner in FileDescriptor has been deprecated
[WARNING] /home/iurt/rpmbuild/BUILD/closure-compiler-maven-release-v20160315/gen/com/google/javascript/jscomp/InstrumentationTemplate.java:[48,6] [deprecation] internalBuildGeneratedFileFrom(String[],FileDescriptor[],InternalDescriptorAssigner) in FileDescriptor has been deprecated
[WARNING] /home/iurt/rpmbuild/BUILD/closure-compiler-maven-release-v20160315/src/com/google/javascript/jscomp/AmbiguateProperties.java:[437,22] [unchecked] getAnnotation() in AmbiguateProperties.PropertyGraphNode implements getAnnotation() in Annotatable
return type requires unchecked conversion from Annotation to A
where A is a type-variable:
A extends Annotation declared in method getAnnotation()
[WARNING] /home/iurt/rpmbuild/BUILD/closure-compiler-maven-release-v20160315/src/com/google/javascript/jscomp/ShadowVariables.java:[117,17] [deprecation] traverse(AbstractCompiler,Node,Callback) in NodeTraversal has been deprecated
[WARNING] /home/iurt/rpmbuild/BUILD/closure-compiler-maven-release-v20160315/src/com/google/javascript/jscomp/ShadowVariables.java:[118,17] [deprecation] traverse(AbstractCompiler,Node,Callback) in NodeTraversal has been deprecated
[WARNING] /home/iurt/rpmbuild/BUILD/closure-compiler-maven-release-v20160315/src/com/google/javascript/jscomp/CoalesceVariableNames.java:[88,17] [deprecation] traverse(AbstractCompiler,Node,Callback) in NodeTraversal has been deprecated
[WARNING] /home/iurt/rpmbuild/BUILD/closure-compiler-maven-release-v20160315/src/com/google/javascript/jscomp/CoalesceVariableNames.java:[124,56] [unchecked] unchecked cast
required: Set
found: Set
where CAP#1 is a fresh type-variable:
CAP#1 extends Var from capture of ? extends Var
[WARNING] /home/iurt/rpmbuild/BUILD/closure-compiler-maven-release-v20160315/src/com/google/javascript/jscomp/CoalesceVariableNames.java:[289,23] [deprecation] traverse(AbstractCompiler,Node,Callback) in NodeTraversal has been deprecated
[WARNING] /home/iurt/rpmbuild/BUILD/closure-compiler-maven-release-v20160315/src/com/google/debugging/sourcemap/SourceMapConsumerFactory.java:[29,43] [deprecation] JsonParser() in JsonParser has been deprecated
[WARNING] /home/iurt/rpmbuild/BUILD/closure-compiler-maven-release-v20160315/src/com/google/debugging/sourcemap/SourceMapConsumerFactory.java:[59,40] [deprecation] parse(String) in JsonParser has been deprecated
[WARNING] /home/iurt/rpmbuild/BUILD/closure-compiler-maven-release-v20160315/src/com/google/javascript/jscomp/parsing/parser/util/format/SimpleFormat.java:[437,8] [fallthrough] possible fall-through into case
[WARNING] /home/iurt/rpmbuild/BUILD/closure-compiler-maven-release-v20160315/gen/com/google/javascript/jscomp/Conformance.java:[47,50] [deprecation] InternalDescriptorAssigner in FileDescriptor has been deprecated
[WARNING] /home/iurt/rpmbuild/BUILD/closure-compiler-maven-release-v20160315/gen/com/google/javascript/jscomp/Conformance.java:[48,56] [deprecation] InternalDescriptorAssigner in FileDescriptor has been deprecated
[WARNING] /home/iurt/rpmbuild/BUILD/closure-compiler-maven-release-v20160315/gen/com/google/javascript/jscomp/Conformance.java:[68,6] [deprecation] internalBuildGeneratedFileFrom(String[],FileDescriptor[],InternalDescriptorAssigner) in FileDescriptor has been deprecated
[WARNING] /home/iurt/rpmbuild/BUILD/closure-compiler-maven-release-v20160315/src/com/google/javascript/jscomp/CommandLineRunner.java:[678,14] [deprecation] CmdLineException(CmdLineParser,String) in CmdLineException has been deprecated
[WARNING] /home/iurt/rpmbuild/BUILD/closure-compiler-maven-release-v20160315/src/com/google/javascript/jscomp/CommandLineRunner.java:[723,14] [deprecation] CmdLineException(CmdLineParser,String) in CmdLineException has been deprecated
[WARNING] /home/iurt/rpmbuild/BUILD/closure-compiler-maven-release-v20160315/src/com/google/javascript/jscomp/CommandLineRunner.java:[754,14] [deprecation] CmdLineException(CmdLineParser,String) in CmdLineException has been deprecated
[WARNING] /home/iurt/rpmbuild/BUILD/closure-compiler-maven-release-v20160315/src/com/google/javascript/jscomp/CommandLineRunner.java:[784,16] [deprecation] CmdLineException(CmdLineParser,String) in CmdLineException has been deprecated
[WARNING] /home/iurt/rpmbuild/BUILD/closure-compiler-maven-release-v20160315/src/com/google/javascript/jscomp/CommandLineRunner.java:[1475,22] [deprecation] propagate(Throwable) in Throwables has been deprecated
[WARNING] /home/iurt/rpmbuild/BUILD/closure-compiler-maven-release-v20160315/src/com/google/javascript/jscomp/WarningLevel.java:[58,11] [deprecation] setCheckProvides(CheckLevel) in CompilerOptions has been deprecated
[WARNING] /home/iurt/rpmbuild/BUILD/closure-compiler-maven-release-v20160315/src/com/google/javascript/refactoring/RefasterJsScanner.java:[90,18] [deprecation] propagate(Throwable) in Throwables has been deprecated
[WARNING] /home/iurt/rpmbuild/BUILD/closure-compiler-maven-release-v20160315/src/com/google/javascript/jscomp/Es6SyntacticScopeCreator.java:[57,15] [unchecked] createScope(Node,Scope) in Es6SyntacticScopeCreator implements createScope(Node,T) in ScopeCreator
return type requires unchecked conversion from Scope to T
where T is a type-variable:
T extends Scope declared in method createScope(Node,T)
[WARNING] /home/iurt/rpmbuild/BUILD/closure-compiler-maven-release-v20160315/gen/com/google/javascript/jscomp/FunctionInfo.java:[47,50] [deprecation] InternalDescriptorAssigner in FileDescriptor has been deprecated
[WARNING] /home/iurt/rpmbuild/BUILD/closure-compiler-maven-release-v20160315/gen/com/google/javascript/jscomp/FunctionInfo.java:[48,56] [deprecation] InternalDescriptorAssigner in FileDescriptor has been deprecated
[WARNING] /home/iurt/rpmbuild/BUILD/closure-compiler-maven-release-v20160315/gen/com/google/javascript/jscomp/FunctionInfo.java:[74,6] [deprecation] internalBuildGeneratedFileFrom(String[],FileDescriptor[],InternalDescriptorAssigner) in FileDescriptor has been deprecated
[INFO]
[INFO] --- maven-bundle-plugin:4.2.1:manifest (bundle-manifest) @ closure-compiler-unshaded ---
[INFO]
[INFO] --- build-helper-maven-plugin:3.2.0:add-test-source (add-test-source) @ closure-compiler-unshaded ---
[INFO] Test Source directory: /home/iurt/rpmbuild/BUILD/closure-compiler-maven-release-v20160315/src/com/google/javascript/rhino/testing added.
[INFO] Test Source directory: /home/iurt/rpmbuild/BUILD/closure-compiler-maven-release-v20160315/src/com/google/javascript/jscomp/testing added.
[INFO] Test Source directory: /home/iurt/rpmbuild/BUILD/closure-compiler-maven-release-v20160315/src/com/google/javascript/refactoring/testing added.
[INFO]
[INFO] --- maven-resources-plugin:3.2.0:testResources (default-testResources) @ closure-compiler-unshaded ---
[INFO] Not copying test resources
[INFO]
[INFO] --- maven-compiler-plugin:3.8.1:testCompile (default-testCompile) @ closure-compiler-unshaded ---
[INFO] Not compiling test sources
[INFO]
[INFO] --- maven-surefire-plugin:2.22.0:test (default-test) @ closure-compiler-unshaded ---
[INFO] Tests are skipped.
[INFO]
[INFO] --- maven-jar-plugin:3.2.0:jar (default-jar) @ closure-compiler-unshaded ---
[INFO] Building jar: /home/iurt/rpmbuild/BUILD/closure-compiler-maven-release-v20160315/target/closure-compiler-unshaded-v20160315.jar
[INFO]
[INFO] -----------< com.google.javascript:closure-compiler-parent >------------
[INFO] Building Closure Compiler Parent v20160315 [5/4]
[INFO] --------------------------------[ pom ]---------------------------------
[INFO]
[INFO] --- xmvn-mojo:3.1.0:install (default-cli) @ closure-compiler-parent ---
[INFO]
[INFO] --- xmvn-mojo:3.1.0:javadoc (default-cli) @ closure-compiler-parent ---
/home/iurt/rpmbuild/BUILD/closure-compiler-maven-release-v20160315/src/com/google/javascript/jscomp/gwt/super/java/net/URI.java:17: error: package exists in another module: java.base
package java.net;
^
/home/iurt/rpmbuild/BUILD/closure-compiler-maven-release-v20160315/src/com/google/javascript/jscomp/gwt/super/java/util/ArrayDeque.java:17: error: package exists in another module: java.base
package java.util;
^
/home/iurt/rpmbuild/BUILD/closure-compiler-maven-release-v20160315/src/com/google/javascript/jscomp/gwt/super/java/util/BitSet.java:17: error: package exists in another module: java.base
package java.util;
^
/home/iurt/rpmbuild/BUILD/closure-compiler-maven-release-v20160315/src/com/google/javascript/jscomp/gwt/super/java/util/ResourceBundle.java:17: error: package exists in another module: java.base
package java.util;
^
/home/iurt/rpmbuild/BUILD/closure-compiler-maven-release-v20160315/src/com/google/javascript/jscomp/gwt/super/java/util/regex/Matcher.java:17: error: package exists in another module: java.base
package java.util.regex;
^
/home/iurt/rpmbuild/BUILD/closure-compiler-maven-release-v20160315/src/com/google/javascript/jscomp/gwt/super/java/util/regex/Pattern.java:17: error: package exists in another module: java.base
package java.util.regex;
^
/home/iurt/rpmbuild/BUILD/closure-compiler-maven-release-v20160315/src/com/google/javascript/jscomp/gwt/super/java/text/MessageFormat.java:17: error: package exists in another module: java.base
package java.text;
^
/home/iurt/rpmbuild/BUILD/closure-compiler-maven-release-v20160315/src/com/google/javascript/jscomp/gwt/super/java/io/File.java:17: error: package exists in another module: java.base
package java.io;
^
/home/iurt/rpmbuild/BUILD/closure-compiler-maven-release-v20160315/src/com/google/javascript/jscomp/gwt/super/java/nio/file/FileSystem.java:17: error: package exists in another module: java.base
package java.nio.file;
^
/home/iurt/rpmbuild/BUILD/closure-compiler-maven-release-v20160315/src/com/google/javascript/jscomp/gwt/super/java/nio/file/FileSystems.java:17: error: package exists in another module: java.base
package java.nio.file;
^
/home/iurt/rpmbuild/BUILD/closure-compiler-maven-release-v20160315/src/com/google/javascript/jscomp/gwt/super/java/nio/file/Path.java:17: error: package exists in another module: java.base
package java.nio.file;
^
/home/iurt/rpmbuild/BUILD/closure-compiler-maven-release-v20160315/src/com/google/javascript/jscomp/gwt/super/java/lang/StackOverflowError.java:17: error: package exists in another module: java.base
package java.lang;
^
/home/iurt/rpmbuild/BUILD/closure-compiler-maven-release-v20160315/src/com/google/javascript/jscomp/gwt/super/java/lang/Runtime.java:17: error: package exists in another module: java.base
package java.lang;
^
/home/iurt/rpmbuild/BUILD/closure-compiler-maven-release-v20160315/src/com/google/javascript/refactoring/testing/SuggestedFixes.java:18: error: package com.google.common.truth does not exist
import static com.google.common.truth.Truth.assertThat;
^
/home/iurt/rpmbuild/BUILD/closure-compiler-maven-release-v20160315/src/com/google/javascript/refactoring/testing/SuggestedFixes.java:18: error: static import only from classes and interfaces
import static com.google.common.truth.Truth.assertThat;
^
/home/iurt/rpmbuild/BUILD/closure-compiler-maven-release-v20160315/src/com/google/javascript/refactoring/testing/SuggestedFixes.java:19: error: package org.junit does not exist
import static org.junit.Assert.assertEquals;
^
/home/iurt/rpmbuild/BUILD/closure-compiler-maven-release-v20160315/src/com/google/javascript/refactoring/testing/SuggestedFixes.java:19: error: static import only from classes and interfaces
import static org.junit.Assert.assertEquals;
^
/home/iurt/rpmbuild/BUILD/closure-compiler-maven-release-v20160315/src/com/google/javascript/refactoring/testing/RefasterJsTestUtils.java:18: error: package com.google.common.truth does not exist
import static com.google.common.truth.Truth.assertThat;
^
/home/iurt/rpmbuild/BUILD/closure-compiler-maven-release-v20160315/src/com/google/javascript/refactoring/testing/RefasterJsTestUtils.java:18: error: static import only from classes and interfaces
import static com.google.common.truth.Truth.assertThat;
^
/home/iurt/rpmbuild/BUILD/closure-compiler-maven-release-v20160315/src/com/google/javascript/rhino/testing/Asserts.java:42: error: package com.google.common.truth does not exist
import static com.google.common.truth.Truth.assertThat;
^
/home/iurt/rpmbuild/BUILD/closure-compiler-maven-release-v20160315/src/com/google/javascript/rhino/testing/Asserts.java:42: error: static import only from classes and interfaces
import static com.google.common.truth.Truth.assertThat;
^
/home/iurt/rpmbuild/BUILD/closure-compiler-maven-release-v20160315/src/com/google/javascript/rhino/testing/Asserts.java:43: error: package org.junit does not exist
import static org.junit.Assert.assertEquals;
^
/home/iurt/rpmbuild/BUILD/closure-compiler-maven-release-v20160315/src/com/google/javascript/rhino/testing/Asserts.java:43: error: static import only from classes and interfaces
import static org.junit.Assert.assertEquals;
^
/home/iurt/rpmbuild/BUILD/closure-compiler-maven-release-v20160315/src/com/google/javascript/rhino/testing/Asserts.java:50: error: package org.junit does not exist
import org.junit.Assert;
^
/home/iurt/rpmbuild/BUILD/closure-compiler-maven-release-v20160315/src/com/google/javascript/rhino/testing/BaseJSTypeTestCase.java:55: error: package junit.framework does not exist
import junit.framework.TestCase;
^
/home/iurt/rpmbuild/BUILD/closure-compiler-maven-release-v20160315/src/com/google/javascript/rhino/testing/BaseJSTypeTestCase.java:57: error: cannot find symbol
public abstract class BaseJSTypeTestCase extends TestCase {
^
symbol: class TestCase
/home/iurt/rpmbuild/BUILD/closure-compiler-maven-release-v20160315/src/com/google/javascript/rhino/testing/TestErrorReporter.java:42: error: package com.google.common.truth does not exist
import static com.google.common.truth.Truth.assertThat;
^
/home/iurt/rpmbuild/BUILD/closure-compiler-maven-release-v20160315/src/com/google/javascript/rhino/testing/TestErrorReporter.java:42: error: static import only from classes and interfaces
import static com.google.common.truth.Truth.assertThat;
^
/home/iurt/rpmbuild/BUILD/closure-compiler-maven-release-v20160315/src/com/google/javascript/rhino/testing/TestErrorReporter.java:46: error: package org.junit does not exist
import org.junit.Assert;
^
/home/iurt/rpmbuild/BUILD/closure-compiler-maven-release-v20160315/src/com/google/javascript/jscomp/testing/TestErrorManager.java:18: error: package org.junit does not exist
import static org.junit.Assert.assertEquals;
^
/home/iurt/rpmbuild/BUILD/closure-compiler-maven-release-v20160315/src/com/google/javascript/jscomp/testing/TestErrorManager.java:18: error: static import only from classes and interfaces
import static org.junit.Assert.assertEquals;
^
/home/iurt/rpmbuild/BUILD/closure-compiler-maven-release-v20160315/src/com/google/javascript/jscomp/testing/JSErrorSubject.java:18: error: package com.google.common.truth does not exist
import static com.google.common.truth.Truth.THROW_ASSERTION_ERROR;
^
/home/iurt/rpmbuild/BUILD/closure-compiler-maven-release-v20160315/src/com/google/javascript/jscomp/testing/JSErrorSubject.java:18: error: static import only from classes and interfaces
import static com.google.common.truth.Truth.THROW_ASSERTION_ERROR;
^
/home/iurt/rpmbuild/BUILD/closure-compiler-maven-release-v20160315/src/com/google/javascript/jscomp/testing/JSErrorSubject.java:19: error: package org.junit does not exist
import static org.junit.Assert.assertEquals;
^
/home/iurt/rpmbuild/BUILD/closure-compiler-maven-release-v20160315/src/com/google/javascript/jscomp/testing/JSErrorSubject.java:19: error: static import only from classes and interfaces
import static org.junit.Assert.assertEquals;
^
/home/iurt/rpmbuild/BUILD/closure-compiler-maven-release-v20160315/src/com/google/javascript/jscomp/testing/JSErrorSubject.java:21: error: package com.google.common.truth does not exist
import com.google.common.truth.FailureStrategy;
^
/home/iurt/rpmbuild/BUILD/closure-compiler-maven-release-v20160315/src/com/google/javascript/jscomp/testing/JSErrorSubject.java:22: error: package com.google.common.truth does not exist
import com.google.common.truth.Subject;
^
/home/iurt/rpmbuild/BUILD/closure-compiler-maven-release-v20160315/src/com/google/javascript/jscomp/testing/JSErrorSubject.java:35: error: cannot find symbol
public final class JSErrorSubject extends Subject {
^
symbol: class Subject
/home/iurt/rpmbuild/BUILD/closure-compiler-maven-release-v20160315/src/com/google/javascript/jscomp/testing/JSErrorSubject.java:40: error: cannot find symbol
public JSErrorSubject(FailureStrategy fs, JSError error) {
^
symbol: class FailureStrategy
location: class JSErrorSubject
/home/iurt/rpmbuild/BUILD/closure-compiler-maven-release-v20160315/src/com/google/javascript/jscomp/testing/NodeSubject.java:18: error: package com.google.common.truth does not exist
import static com.google.common.truth.Truth.THROW_ASSERTION_ERROR;
^
/home/iurt/rpmbuild/BUILD/closure-compiler-maven-release-v20160315/src/com/google/javascript/jscomp/testing/NodeSubject.java:18: error: static import only from classes and interfaces
import static com.google.common.truth.Truth.THROW_ASSERTION_ERROR;
^
/home/iurt/rpmbuild/BUILD/closure-compiler-maven-release-v20160315/src/com/google/javascript/jscomp/testing/NodeSubject.java:19: error: package org.junit does not exist
import static org.junit.Assert.assertEquals;
^
/home/iurt/rpmbuild/BUILD/closure-compiler-maven-release-v20160315/src/com/google/javascript/jscomp/testing/NodeSubject.java:19: error: static import only from classes and interfaces
import static org.junit.Assert.assertEquals;
^
/home/iurt/rpmbuild/BUILD/closure-compiler-maven-release-v20160315/src/com/google/javascript/jscomp/testing/NodeSubject.java:21: error: package com.google.common.truth does not exist
import com.google.common.truth.FailureStrategy;
^
/home/iurt/rpmbuild/BUILD/closure-compiler-maven-release-v20160315/src/com/google/javascript/jscomp/testing/NodeSubject.java:22: error: package com.google.common.truth does not exist
import com.google.common.truth.Subject;
^
/home/iurt/rpmbuild/BUILD/closure-compiler-maven-release-v20160315/src/com/google/javascript/jscomp/testing/NodeSubject.java:35: error: cannot find symbol
public final class NodeSubject extends Subject {
^
symbol: class Subject
/home/iurt/rpmbuild/BUILD/closure-compiler-maven-release-v20160315/src/com/google/javascript/jscomp/testing/NodeSubject.java:40: error: cannot find symbol
public NodeSubject(FailureStrategy fs, Node node) {
^
symbol: class FailureStrategy
location: class NodeSubject
/home/iurt/rpmbuild/BUILD/closure-compiler-maven-release-v20160315/src/com/google/javascript/jscomp/gwt/client/GwtRunner.java:21: error: package com.google.gwt.core.client does not exist
import com.google.gwt.core.client.EntryPoint;
^
/home/iurt/rpmbuild/BUILD/closure-compiler-maven-release-v20160315/src/com/google/javascript/jscomp/gwt/client/GwtRunner.java:29: error: package jsinterop.annotations does not exist
import jsinterop.annotations.JsPackage;
^
/home/iurt/rpmbuild/BUILD/closure-compiler-maven-release-v20160315/src/com/google/javascript/jscomp/gwt/client/GwtRunner.java:30: error: package jsinterop.annotations does not exist
import jsinterop.annotations.JsProperty;
^
/home/iurt/rpmbuild/BUILD/closure-compiler-maven-release-v20160315/src/com/google/javascript/jscomp/gwt/client/GwtRunner.java:31: error: package jsinterop.annotations does not exist
import jsinterop.annotations.JsType;
^
/home/iurt/rpmbuild/BUILD/closure-compiler-maven-release-v20160315/src/com/google/javascript/jscomp/gwt/client/GwtRunner.java:41: error: cannot find symbol
public final class GwtRunner implements EntryPoint {
^
symbol: class EntryPoint
/home/iurt/rpmbuild/BUILD/closure-compiler-maven-release-v20160315/src/com/google/javascript/jscomp/gwt/client/GwtRunner.java:40: error: cannot find symbol
@JsType(namespace = JsPackage.GLOBAL, name = "JSCompiler")
^
symbol: class JsType
/home/iurt/rpmbuild/BUILD/closure-compiler-maven-release-v20160315/src/com/google/javascript/jscomp/gwt/client/GwtRunner.java:72: error: cannot find symbol
@JsType(namespace = JsPackage.GLOBAL, name = "Object", isNative = true)
^
symbol: class JsType
location: class GwtRunner
/home/iurt/rpmbuild/BUILD/closure-compiler-maven-release-v20160315/src/com/google/javascript/jscomp/gwt/super/java/util/ArrayDeque.java:28: error: cannot find symbol
public class ArrayDeque extends AbstractCollection implements
^
symbol: class AbstractCollection
/home/iurt/rpmbuild/BUILD/closure-compiler-maven-release-v20160315/src/com/google/javascript/jscomp/gwt/super/java/util/ArrayDeque.java:29: error: cannot find symbol
Cloneable, Deque, Serializable {
^
symbol: class Deque
/home/iurt/rpmbuild/BUILD/closure-compiler-maven-release-v20160315/src/com/google/javascript/jscomp/gwt/super/java/util/ArrayDeque.java:30: error: cannot find symbol
private final LinkedList delegate;
^
symbol: class LinkedList
location: class ArrayDeque
where E is a type-variable:
E extends Object declared in class ArrayDeque
/home/iurt/rpmbuild/BUILD/closure-compiler-maven-release-v20160315/src/com/google/javascript/jscomp/gwt/super/java/util/ArrayDeque.java:36: error: cannot find symbol
public ArrayDeque(Collection extends E> c) {
^
symbol: class Collection
location: class ArrayDeque
where E is a type-variable:
E extends Object declared in class ArrayDeque
/home/iurt/rpmbuild/BUILD/closure-compiler-maven-release-v20160315/src/com/google/javascript/jscomp/gwt/super/java/util/ArrayDeque.java:100: error: cannot find symbol
public boolean addAll(Collection extends E> c) {
^
symbol: class Collection
location: class ArrayDeque
where E is a type-variable:
E extends Object declared in class ArrayDeque
/home/iurt/rpmbuild/BUILD/closure-compiler-maven-release-v20160315/src/com/google/javascript/jscomp/gwt/super/java/util/ArrayDeque.java:132: error: cannot find symbol
public Iterator iterator() {
^
symbol: class Iterator
location: class ArrayDeque
where E is a type-variable:
E extends Object declared in class ArrayDeque
/home/iurt/rpmbuild/BUILD/closure-compiler-maven-release-v20160315/src/com/google/javascript/jscomp/gwt/super/java/util/ArrayDeque.java:136: error: cannot find symbol
public Iterator descendingIterator() {
^
symbol: class Iterator
location: class ArrayDeque
where E is a type-variable:
E extends Object declared in class ArrayDeque
/home/iurt/rpmbuild/BUILD/closure-compiler-maven-release-v20160315/src/com/google/javascript/jscomp/gwt/super/java/util/BitSet.java:19: error: package com.google.gwt.core.client does not exist
import com.google.gwt.core.client.JavaScriptObject;
^
/home/iurt/rpmbuild/BUILD/closure-compiler-maven-release-v20160315/src/com/google/javascript/jscomp/gwt/super/java/util/BitSet.java:20: error: package com.google.gwt.core.client does not exist
import com.google.gwt.core.client.JsArrayInteger;
^
/home/iurt/rpmbuild/BUILD/closure-compiler-maven-release-v20160315/src/com/google/javascript/jscomp/gwt/super/java/util/BitSet.java:93: error: cannot find symbol
private static void clear(JsArrayInteger array, int bitIndex) {
^
symbol: class JsArrayInteger
location: class BitSet
/home/iurt/rpmbuild/BUILD/closure-compiler-maven-release-v20160315/src/com/google/javascript/jscomp/gwt/super/java/util/BitSet.java:103: error: cannot find symbol
private static native JsArrayInteger clone(JsArrayInteger array) /*-{
^
symbol: class JsArrayInteger
location: class BitSet
/home/iurt/rpmbuild/BUILD/closure-compiler-maven-release-v20160315/src/com/google/javascript/jscomp/gwt/super/java/util/BitSet.java:103: error: cannot find symbol
private static native JsArrayInteger clone(JsArrayInteger array) /*-{
^
symbol: class JsArrayInteger
location: class BitSet
/home/iurt/rpmbuild/BUILD/closure-compiler-maven-release-v20160315/src/com/google/javascript/jscomp/gwt/super/java/util/BitSet.java:108: error: cannot find symbol
private static void flip(JsArrayInteger array, int bitIndex) {
^
symbol: class JsArrayInteger
location: class BitSet
/home/iurt/rpmbuild/BUILD/closure-compiler-maven-release-v20160315/src/com/google/javascript/jscomp/gwt/super/java/util/BitSet.java:125: error: cannot find symbol
private static boolean get(JsArrayInteger array, int bitIndex) {
^
symbol: class JsArrayInteger
location: class BitSet
/home/iurt/rpmbuild/BUILD/closure-compiler-maven-release-v20160315/src/com/google/javascript/jscomp/gwt/super/java/util/BitSet.java:134: error: cannot find symbol
private static void set(JsArrayInteger array, int bitIndex) {
^
symbol: class JsArrayInteger
location: class BitSet
/home/iurt/rpmbuild/BUILD/closure-compiler-maven-release-v20160315/src/com/google/javascript/jscomp/gwt/super/java/util/BitSet.java:140: error: cannot find symbol
private static void set(JsArrayInteger array, int fromIndex, int toIndex) {
^
symbol: class JsArrayInteger
location: class BitSet
/home/iurt/rpmbuild/BUILD/closure-compiler-maven-release-v20160315/src/com/google/javascript/jscomp/gwt/super/java/util/BitSet.java:171: error: cannot find symbol
private static native JsArrayInteger slice(JsArrayInteger array,
^
symbol: class JsArrayInteger
location: class BitSet
/home/iurt/rpmbuild/BUILD/closure-compiler-maven-release-v20160315/src/com/google/javascript/jscomp/gwt/super/java/util/BitSet.java:171: error: cannot find symbol
private static native JsArrayInteger slice(JsArrayInteger array,
^
symbol: class JsArrayInteger
location: class BitSet
/home/iurt/rpmbuild/BUILD/closure-compiler-maven-release-v20160315/src/com/google/javascript/jscomp/gwt/super/java/util/BitSet.java:178: error: cannot find symbol
private static native int trimToSize(JsArrayInteger array) /*-{
^
symbol: class JsArrayInteger
location: class BitSet
/home/iurt/rpmbuild/BUILD/closure-compiler-maven-release-v20160315/src/com/google/javascript/jscomp/gwt/super/java/util/BitSet.java:220: error: cannot find symbol
private static native void deleteWord(JsArrayInteger array, int index) /*-{
^
symbol: class JsArrayInteger
location: class BitSet
/home/iurt/rpmbuild/BUILD/closure-compiler-maven-release-v20160315/src/com/google/javascript/jscomp/gwt/super/java/util/BitSet.java:225: error: cannot find symbol
private static void flipWord(JsArrayInteger array, int index) {
^
symbol: class JsArrayInteger
location: class BitSet
/home/iurt/rpmbuild/BUILD/closure-compiler-maven-release-v20160315/src/com/google/javascript/jscomp/gwt/super/java/util/BitSet.java:236: error: cannot find symbol
private static void flipMaskedWord(JsArrayInteger array, int index,
^
symbol: class JsArrayInteger
location: class BitSet
/home/iurt/rpmbuild/BUILD/closure-compiler-maven-release-v20160315/src/com/google/javascript/jscomp/gwt/super/java/util/BitSet.java:251: error: cannot find symbol
private static native int getWord(JsArrayInteger array, int index) /*-{
^
symbol: class JsArrayInteger
location: class BitSet
/home/iurt/rpmbuild/BUILD/closure-compiler-maven-release-v20160315/src/com/google/javascript/jscomp/gwt/super/java/util/BitSet.java:257: error: cannot find symbol
private static void maskInWord(JsArrayInteger array, int index,
^
symbol: class JsArrayInteger
location: class BitSet
/home/iurt/rpmbuild/BUILD/closure-compiler-maven-release-v20160315/src/com/google/javascript/jscomp/gwt/super/java/util/BitSet.java:272: error: cannot find symbol
private static void maskOutWord(JsArrayInteger array, int index,
^
symbol: class JsArrayInteger
location: class BitSet
/home/iurt/rpmbuild/BUILD/closure-compiler-maven-release-v20160315/src/com/google/javascript/jscomp/gwt/super/java/util/BitSet.java:295: error: cannot find symbol
private static native int nextSetWord(JsArrayInteger array, int index) /*-{
^
symbol: class JsArrayInteger
location: class BitSet
/home/iurt/rpmbuild/BUILD/closure-compiler-maven-release-v20160315/src/com/google/javascript/jscomp/gwt/super/java/util/BitSet.java:327: error: cannot find symbol
private static void setWord(JsArrayInteger array, int index, int value) {
^
symbol: class JsArrayInteger
location: class BitSet
/home/iurt/rpmbuild/BUILD/closure-compiler-maven-release-v20160315/src/com/google/javascript/jscomp/gwt/super/java/util/BitSet.java:337: error: cannot find symbol
private static native void setLengthWords(JsArrayInteger array, int length) /*-{
^
symbol: class JsArrayInteger
location: class BitSet
/home/iurt/rpmbuild/BUILD/closure-compiler-maven-release-v20160315/src/com/google/javascript/jscomp/gwt/super/java/util/BitSet.java:342: error: cannot find symbol
private JsArrayInteger array;
^
symbol: class JsArrayInteger
location: class BitSet
/home/iurt/rpmbuild/BUILD/closure-compiler-maven-release-v20160315/src/com/google/javascript/jscomp/gwt/super/java/util/BitSet.java:365: error: cannot find symbol
private BitSet(JsArrayInteger array) {
^
symbol: class JsArrayInteger
location: class BitSet
/home/iurt/rpmbuild/BUILD/closure-compiler-maven-release-v20160315/src/com/google/javascript/jscomp/gwt/super/java/util/ResourceBundle.java:33: error: cannot find symbol
public static ResourceBundle getBundle(String baseName, Locale locale) {
^
symbol: class Locale
location: class ResourceBundle
/home/iurt/rpmbuild/BUILD/closure-compiler-maven-release-v20160315/src/com/google/javascript/jscomp/gwt/super/java/util/ResourceBundle.java:37: error: cannot find symbol
public String getString(String key) throws MissingResourceException {
^
symbol: class MissingResourceException
location: class ResourceBundle
/home/iurt/rpmbuild/BUILD/closure-compiler-maven-release-v20160315/src/com/google/javascript/jscomp/gwt/super/java/util/regex/Matcher.java:19: error: package com.google.gwt.regexp.shared does not exist
import com.google.gwt.regexp.shared.MatchResult;
^
/home/iurt/rpmbuild/BUILD/closure-compiler-maven-release-v20160315/src/com/google/javascript/jscomp/gwt/super/java/util/regex/Matcher.java:20: error: package com.google.gwt.regexp.shared does not exist
import com.google.gwt.regexp.shared.RegExp;
^
/home/iurt/rpmbuild/BUILD/closure-compiler-maven-release-v20160315/src/com/google/javascript/jscomp/gwt/super/java/util/regex/Matcher.java:28: error: cannot find symbol
private final RegExp regExp;
^
symbol: class RegExp
location: class Matcher
/home/iurt/rpmbuild/BUILD/closure-compiler-maven-release-v20160315/src/com/google/javascript/jscomp/gwt/super/java/util/regex/Matcher.java:30: error: cannot find symbol
private MatchResult result;
^
symbol: class MatchResult
location: class Matcher
/home/iurt/rpmbuild/BUILD/closure-compiler-maven-release-v20160315/src/com/google/javascript/jscomp/gwt/super/java/util/regex/Matcher.java:34: error: cannot find symbol
Matcher(RegExp regExp, String input) {
^
symbol: class RegExp
location: class Matcher
/home/iurt/rpmbuild/BUILD/closure-compiler-maven-release-v20160315/src/com/google/javascript/jscomp/gwt/super/java/util/regex/Pattern.java:19: error: package com.google.gwt.regexp.shared does not exist
import com.google.gwt.regexp.shared.RegExp;
^
/home/iurt/rpmbuild/BUILD/closure-compiler-maven-release-v20160315/src/com/google/javascript/jscomp/gwt/super/java/util/regex/Pattern.java:27: error: cannot find symbol
private RegExp regExp;
^
symbol: class RegExp
location: class Pattern
/home/iurt/rpmbuild/BUILD/closure-compiler-maven-release-v20160315/src/com/google/javascript/jscomp/ConformanceRules.java:31: error: cannot find symbol
import com.google.javascript.jscomp.Requirement.Type;
^
symbol: class Type
location: class Requirement
/home/iurt/rpmbuild/BUILD/closure-compiler-maven-release-v20160315/src/com/google/javascript/jscomp/ConformanceRules.java:437: error: cannot find symbol
private final Requirement.Type requirementType;
^
symbol: class Type
location: class Requirement
/home/iurt/rpmbuild/BUILD/closure-compiler-maven-release-v20160315/src/com/google/javascript/jscomp/debugger/DebuggerGwtMain.java:21: error: package com.google.gwt.core.client does not exist
import com.google.gwt.core.client.EntryPoint;
^
/home/iurt/rpmbuild/BUILD/closure-compiler-maven-release-v20160315/src/com/google/javascript/jscomp/debugger/DebuggerGwtMain.java:22: error: package com.google.gwt.event.dom.client does not exist
import com.google.gwt.event.dom.client.ClickEvent;
^
/home/iurt/rpmbuild/BUILD/closure-compiler-maven-release-v20160315/src/com/google/javascript/jscomp/debugger/DebuggerGwtMain.java:23: error: package com.google.gwt.event.dom.client does not exist
import com.google.gwt.event.dom.client.ClickHandler;
^
/home/iurt/rpmbuild/BUILD/closure-compiler-maven-release-v20160315/src/com/google/javascript/jscomp/debugger/DebuggerGwtMain.java:24: error: package com.google.gwt.event.dom.client does not exist
import com.google.gwt.event.dom.client.KeyUpEvent;
^
/home/iurt/rpmbuild/BUILD/closure-compiler-maven-release-v20160315/src/com/google/javascript/jscomp/debugger/DebuggerGwtMain.java:25: error: package com.google.gwt.event.dom.client does not exist
import com.google.gwt.event.dom.client.KeyUpHandler;
^
[INFO] ------------------------------------------------------------------------
[INFO] Reactor Summary for Closure Compiler Parent v20160315:
[INFO]
[INFO] Closure Compiler Parent ............................ FAILURE [ 4.188 s]
[INFO] Closure Compiler Externs ........................... SUCCESS [ 1.726 s]
[INFO] Closure Compiler Main .............................. SUCCESS [ 0.626 s]
[INFO] Closure Compiler Unshaded .......................... SUCCESS [ 12.286 s]
[INFO] ------------------------------------------------------------------------
[INFO] BUILD FAILURE
[INFO] ------------------------------------------------------------------------
[INFO] Total time: 19.472 s
[INFO] Finished at: 2020-11-08T20:33:15Z
[INFO] ------------------------------------------------------------------------
[ERROR] Failed to execute goal org.fedoraproject.xmvn:xmvn-mojo:3.1.0:javadoc (default-cli) on project closure-compiler-parent: Javadoc failed with exit code 1 -> [Help 1]
[ERROR]
[ERROR] To see the full stack trace of the errors, re-run Maven with the -e switch.
[ERROR] Re-run Maven using the -X switch to enable full debug logging.
[ERROR]
[ERROR] For more information about the errors and possible solutions, please read the following articles:
[ERROR] [Help 1] http://cwiki.apache.org/confluence/display/MAVEN/MojoExecutionException
error: Bad exit status from /home/iurt/rpmbuild/tmp/rpm-tmp.Fr9urE (%build)
RPM build errors:
Bad exit status from /home/iurt/rpmbuild/tmp/rpm-tmp.Fr9urE (%build)
I: [iurt_root_command] ERROR: chroot