D: [iurt_root_command] chroot Installing /home/iurt/rpmbuild/SRPMS/tanukiwrapper-3.5.43-3.mga8.src.rpm Building target platforms: aarch64 Building for target aarch64 Executing(%prep): /bin/sh -e /home/iurt/rpmbuild/tmp/rpm-tmp.dBT8yi + umask 022 + cd /home/iurt/rpmbuild/BUILD + '[' 1 -eq 1 ']' + '[' 1 -eq 1 ']' + '[' 1 -eq 1 ']' + cd /home/iurt/rpmbuild/BUILD + rm -rf wrapper_3.5.43_src + /usr/bin/gzip -dc /home/iurt/rpmbuild/SOURCES/wrapper_3.5.43_src.tar.gz + /usr/bin/tar -xof - + STATUS=0 + '[' 0 -ne 0 ']' + cd wrapper_3.5.43_src + /usr/bin/chmod -Rf a+rX,u+w,g-w,o-w . + /usr/bin/cat /home/iurt/rpmbuild/SOURCES/tanukiwrapper-3.5.30-build.patch + /usr/bin/patch -p1 -s --fuzz=0 --no-backup-if-mismatch + /usr/bin/cat /home/iurt/rpmbuild/SOURCES/tanukiwrapper-3.5.43-Makefiles.patch + /usr/bin/patch -p1 -s --fuzz=0 --no-backup-if-mismatch + /usr/bin/patch -p1 -s --fuzz=0 --no-backup-if-mismatch + /usr/bin/cat /home/iurt/rpmbuild/SOURCES/tanukiwrapper-arm.patch + /usr/bin/cat /home/iurt/rpmbuild/SOURCES/tanukiwrapper-3.5.43-java10.patch + /usr/bin/patch -p1 -s --fuzz=0 --no-backup-if-mismatch + cp /home/iurt/rpmbuild/SOURCES/tanukiwrapper-template.pom ./tanukiwrapper.pom + sed -i 's|@VERSION@|3.5.43|' tanukiwrapper.pom + find . -name '*.jar' -exec /usr/bin/rm -f '{}' ';' + /usr/bin/perl -p -i -e 's/\r//' doc/AUTHORS Can't open doc/AUTHORS: No such file or directory. + /usr/bin/perl -p -i -e 's|-O3|-O2 -g -pipe -Wformat -Werror=format-security -Wp,-D_FORTIFY_SOURCE=2 -fstack-protector --param=ssp-buffer-size=4 -fasynchronous-unwind-tables|' src/c/Makefile-aix-ppc-32.make src/c/Makefile-aix-ppc-64.make src/c/Makefile-freebsd-x86-32.gmake src/c/Makefile-freebsd-x86-64.gmake src/c/Makefile-hpux-ia-32.make src/c/Makefile-hpux-ia-64.make src/c/Makefile-hpux-parisc-32.make src/c/Makefile-hpux-parisc-64.make src/c/Makefile-linux-aarch64-64.make src/c/Makefile-linux-armel-32.make src/c/Makefile-linux-armhf-32.make src/c/Makefile-linux-armhf-64.make src/c/Makefile-linux-ia-64.make src/c/Makefile-linux-ppcbe-32.make src/c/Makefile-linux-ppcbe-64.make src/c/Makefile-linux-ppcle-64.make src/c/Makefile-linux-s390-32.make src/c/Makefile-linux-s390x-64.make src/c/Makefile-linux-x86-32.make src/c/Makefile-linux-x86-64.make src/c/Makefile-macosx-universal-32.make src/c/Makefile-macosx-universal-64.make src/c/Makefile-solaris-sparc-32.gmake src/c/Makefile-solaris-sparc-64.gmake src/c/Makefile-solaris-x86-32.gmake src/c/Makefile-solaris-x86-64.gmake src/c/Makefile-windows-x86-32.nmake + /usr/bin/perl -p -e 's|=\.\./lib/wrapper\.jar$|=/usr/lib/java/tanukiwrapper.jar| ; s|=\.\./lib$|=/usr/lib64|' src/conf/wrapper.conf.in + /usr/bin/perl -p -e 's|"\./wrapper"|"/usr/sbin/tanukiwrapper"| ; s|"\.\./conf/wrapper\.conf"|"/path/to/wrapper.conf"|' src/bin/sh.script.in Can't open src/bin/sh.script.in: No such file or directory. + /usr/bin/python3 /usr/share/java-utils/mvn_file.py : tanukiwrapper tanukiwrapper + RPM_EC=0 ++ jobs -p + exit 0 Executing(%build): /bin/sh -e /home/iurt/rpmbuild/tmp/rpm-tmp.5JeFDh + umask 022 + cd /home/iurt/rpmbuild/BUILD + cd wrapper_3.5.43_src + '[' 1 -eq 1 ']' + '[' 1 -eq 1 ']' + export JAVA_HOME=/usr/lib/jvm/java + JAVA_HOME=/usr/lib/jvm/java ++ build-classpath junit xerces-j2 xml-commons-apis ant + export CLASSPATH=/usr/share/java/junit.jar:/usr/share/java/xerces-j2.jar:/usr/share/java/xml-commons-apis.jar:/usr/share/java/ant.jar + CLASSPATH=/usr/share/java/junit.jar:/usr/share/java/xerces-j2.jar:/usr/share/java/xml-commons-apis.jar:/usr/share/java/ant.jar + bits=64 + JAVA_HOME=/usr/lib/jvm/java-11-openjdk + ant -Djavac.target.version=8 -Dbuild.sysclasspath=first -Djdk.api=/usr/share/javadoc/java -Dbits=64 main jdoc Buildfile: /home/iurt/rpmbuild/BUILD/wrapper_3.5.43_src/build.xml init-setup: init-windows: init-unix: init-bits-check: init-bits-mismatch-check: init: init:msg: [echo] ********************************************************************** [echo] * About to build a 64-bit version of Java Service Wrapper Community 3.5.43. [echo] * The OS Name is "linux", resolved from "Linux". [echo] * The Architecture is "aarch64", resolved from "aarch64". [echo] * The distribution name will be: wrapper-linux-aarch64-64-3.5.43 [echo] ********************************************************************** init:java-missing: convert: update-info: [copy] Copying 1 file to /home/iurt/rpmbuild/BUILD/wrapper_3.5.43_src/src/java/org/tanukisoftware/wrapper compile-java-warn: [echo] ********************************************************************** [echo] * WARNING [echo] * The jar is being built for Java version 8. This will not be [echo] * compatible with older JVMs. [echo] ********************************************************************** compile-java:core: [mkdir] Created dir: /home/iurt/rpmbuild/BUILD/wrapper_3.5.43_src/build/classes [mkdir] Created dir: /home/iurt/rpmbuild/BUILD/wrapper_3.5.43_src/build/testclasses [mkdir] Created dir: /home/iurt/rpmbuild/BUILD/wrapper_3.5.43_src/lib [javac] Compiling 108 source files to /home/iurt/rpmbuild/BUILD/wrapper_3.5.43_src/build/classes [javac] warning: [options] bootstrap class path not set in conjunction with -source 8 [javac] /home/iurt/rpmbuild/BUILD/wrapper_3.5.43_src/src/java/org/tanukisoftware/wrapper/WrapperActionServer.java:208: warning: [deprecation] Integer(int) in Integer has been deprecated [javac] action = (Runnable)m_actions.get( new Integer( command ) ); [javac] ^ [javac] /home/iurt/rpmbuild/BUILD/wrapper_3.5.43_src/src/java/org/tanukisoftware/wrapper/WrapperActionServer.java:349: warning: [deprecation] Integer(int) in Integer has been deprecated [javac] m_actions.put( new Integer( command ), action ); [javac] ^ [javac] /home/iurt/rpmbuild/BUILD/wrapper_3.5.43_src/src/java/org/tanukisoftware/wrapper/WrapperActionServer.java:363: warning: [deprecation] Integer(int) in Integer has been deprecated [javac] m_actions.remove( new Integer( command ) ); [javac] ^ [javac] /home/iurt/rpmbuild/BUILD/wrapper_3.5.43_src/src/java/org/tanukisoftware/wrapper/WrapperJarApp.java:308: warning: [deprecation] Integer(int) in Integer has been deprecated [javac] m_outDebug.println( WrapperManager.getRes().getString(" Classpath[{0}]=", new Integer( i ) ) + classURLs[i] ); [javac] ^ [javac] /home/iurt/rpmbuild/BUILD/wrapper_3.5.43_src/src/java/org/tanukisoftware/wrapper/WrapperJarApp.java:525: warning: [deprecation] Integer(int) in Integer has been deprecated [javac] m_mainExitCode = new Integer( 1 ); [javac] ^ [javac] /home/iurt/rpmbuild/BUILD/wrapper_3.5.43_src/src/java/org/tanukisoftware/wrapper/WrapperJarApp.java:562: warning: [deprecation] Integer(int) in Integer has been deprecated [javac] return new Integer( 1 ); [javac] ^ [javac] /home/iurt/rpmbuild/BUILD/wrapper_3.5.43_src/src/java/org/tanukisoftware/wrapper/WrapperJarApp.java:591: warning: [deprecation] Integer(int) in Integer has been deprecated [javac] "start(args) Will wait up to {0} seconds for the main method to complete.", new Integer( maxLoops ) ) ); [javac] ^ [javac] /home/iurt/rpmbuild/BUILD/wrapper_3.5.43_src/src/java/org/tanukisoftware/wrapper/WrapperJarApp.java:653: warning: [deprecation] Boolean(boolean) in Boolean has been deprecated [javac] new Boolean( m_mainComplete ), m_mainExitCode ) ); [javac] ^ [javac] /home/iurt/rpmbuild/BUILD/wrapper_3.5.43_src/src/java/org/tanukisoftware/wrapper/WrapperJarApp.java:695: warning: [deprecation] Integer(int) in Integer has been deprecated [javac] "controlEvent({0}) Stopping", new Integer( event ) ) ); [javac] ^ [javac] /home/iurt/rpmbuild/BUILD/wrapper_3.5.43_src/src/java/org/tanukisoftware/wrapper/WrapperManager.java:563: warning: [deprecation] Integer(int) in Integer has been deprecated [javac] m_outDebug.println( getRes().getString( " Size: {0}", new Integer( jarSize ) ) ); [javac] ^ [javac] /home/iurt/rpmbuild/BUILD/wrapper_3.5.43_src/src/java/org/tanukisoftware/wrapper/WrapperManager.java:994: warning: [deprecation] Integer(int) in Integer has been deprecated [javac] new Integer( offsetDiff * TICK_MS ) ) ); [javac] ^ [javac] /home/iurt/rpmbuild/BUILD/wrapper_3.5.43_src/src/java/org/tanukisoftware/wrapper/WrapperManager.java:999: warning: [deprecation] Integer(int) in Integer has been deprecated [javac] new Integer( -1 * offsetDiff * TICK_MS ) ) ); [javac] ^ [javac] /home/iurt/rpmbuild/BUILD/wrapper_3.5.43_src/src/java/org/tanukisoftware/wrapper/WrapperManager.java:1026: warning: [deprecation] Long(long) in Long has been deprecated [javac] new Long( age / 1000 ) ) ); [javac] ^ [javac] /home/iurt/rpmbuild/BUILD/wrapper_3.5.43_src/src/java/org/tanukisoftware/wrapper/WrapperManager.java:1169: warning: [deprecation] finalize() in Object has been deprecated [javac] protected void finalize() [javac] ^ [javac] /home/iurt/rpmbuild/BUILD/wrapper_3.5.43_src/src/java/org/tanukisoftware/wrapper/WrapperManager.java:1182: warning: [deprecation] finalize() in Object has been deprecated [javac] super.finalize(); [javac] ^ [javac] /home/iurt/rpmbuild/BUILD/wrapper_3.5.43_src/src/java/org/tanukisoftware/wrapper/WrapperManager.java:2359: warning: [deprecation] Integer(int) in Integer has been deprecated [javac] new Integer( i) ) ); [javac] ^ [javac] /home/iurt/rpmbuild/BUILD/wrapper_3.5.43_src/src/java/org/tanukisoftware/wrapper/WrapperManager.java:2902: warning: [deprecation] Integer(int) in Integer has been deprecated [javac] m_outInfo.println( getRes().getString( "WARNING: Making JVM appear to be slow using a delay of {0} seconds...", new Integer( slowSeconds ) ) ); [javac] ^ [javac] /home/iurt/rpmbuild/BUILD/wrapper_3.5.43_src/src/java/org/tanukisoftware/wrapper/WrapperManager.java:3255: warning: [deprecation] Integer(int) in Integer has been deprecated [javac] m_outDebug.println( getRes().getString( "Initial thread: {0} Priority: {1}", thisThread.getName(), new Integer( thisThread.getPriority() ) ) ); [javac] ^ [javac] /home/iurt/rpmbuild/BUILD/wrapper_3.5.43_src/src/java/org/tanukisoftware/wrapper/WrapperManager.java:3336: warning: [deprecation] Integer(int) in Integer has been deprecated [javac] thisThread.getName(), new Integer( lock.m_count ), new Integer( m_shutdownLocks ) ) ); [javac] ^ [javac] /home/iurt/rpmbuild/BUILD/wrapper_3.5.43_src/src/java/org/tanukisoftware/wrapper/WrapperManager.java:3336: warning: [deprecation] Integer(int) in Integer has been deprecated [javac] thisThread.getName(), new Integer( lock.m_count ), new Integer( m_shutdownLocks ) ) ); [javac] ^ [javac] /home/iurt/rpmbuild/BUILD/wrapper_3.5.43_src/src/java/org/tanukisoftware/wrapper/WrapperManager.java:3366: warning: [deprecation] Integer(int) in Integer has been deprecated [javac] thisThread.getName(), new Integer( lock.m_count ), new Integer( m_shutdownLocks ) ) ); [javac] ^ [javac] /home/iurt/rpmbuild/BUILD/wrapper_3.5.43_src/src/java/org/tanukisoftware/wrapper/WrapperManager.java:3366: warning: [deprecation] Integer(int) in Integer has been deprecated [javac] thisThread.getName(), new Integer( lock.m_count ), new Integer( m_shutdownLocks ) ) ); [javac] ^ [javac] /home/iurt/rpmbuild/BUILD/wrapper_3.5.43_src/src/java/org/tanukisoftware/wrapper/WrapperManager.java:3388: warning: [deprecation] Integer(int) in Integer has been deprecated [javac] "wait for {0} shutdown locks to be released.", new Integer(m_shutdownLocks ) ) ); [javac] ^ [javac] /home/iurt/rpmbuild/BUILD/wrapper_3.5.43_src/src/java/org/tanukisoftware/wrapper/WrapperManager.java:3405: warning: [deprecation] Integer(int) in Integer has been deprecated [javac] "Waiting for {0} shutdown locks to be released..." , new Integer(m_shutdownLocks ) ) ); [javac] ^ [javac] /home/iurt/rpmbuild/BUILD/wrapper_3.5.43_src/src/java/org/tanukisoftware/wrapper/WrapperManager.java:4380: warning: [deprecation] Integer(int) in Integer has been deprecated [javac] m_outDebug.println( getRes().getString( "Pausing for {0}ms to allow a clean shutdown...", new Integer( delay ) ) ); [javac] ^ [javac] /home/iurt/rpmbuild/BUILD/wrapper_3.5.43_src/src/java/org/tanukisoftware/wrapper/WrapperManager.java:4505: warning: [deprecation] Integer(int) in Integer has been deprecated [javac] m_outDebug.println( getRes().getString( "Application start main thread: {0} Priority: {1}", thisThread.getName(), new Integer( thisThread.getPriority() ) ) ); [javac] ^ [javac] /home/iurt/rpmbuild/BUILD/wrapper_3.5.43_src/src/java/org/tanukisoftware/wrapper/WrapperManager.java:4549: warning: [deprecation] Integer(int) in Integer has been deprecated [javac] new Integer( exitCode ) ) ); [javac] ^ [javac] /home/iurt/rpmbuild/BUILD/wrapper_3.5.43_src/src/java/org/tanukisoftware/wrapper/WrapperManager.java:4601: warning: [deprecation] Integer(int) in Integer has been deprecated [javac] new Integer( exitCode ), Thread.currentThread().getName() ) ); [javac] ^ [javac] /home/iurt/rpmbuild/BUILD/wrapper_3.5.43_src/src/java/org/tanukisoftware/wrapper/WrapperManager.java:4626: warning: [deprecation] Integer(int) in Integer has been deprecated [javac] new Integer( exitCode ) ) ); [javac] ^ [javac] /home/iurt/rpmbuild/BUILD/wrapper_3.5.43_src/src/java/org/tanukisoftware/wrapper/WrapperManager.java:4655: warning: [deprecation] Integer(int) in Integer has been deprecated [javac] new Integer( exitCode ), e.toString() ) ); [javac] ^ [javac] /home/iurt/rpmbuild/BUILD/wrapper_3.5.43_src/src/java/org/tanukisoftware/wrapper/WrapperManager.java:4658: warning: [deprecation] Integer(int) in Integer has been deprecated [javac] new Integer( exitCode ) ) ); [javac] ^ [javac] /home/iurt/rpmbuild/BUILD/wrapper_3.5.43_src/src/java/org/tanukisoftware/wrapper/WrapperManager.java:4828: warning: [deprecation] Integer(int) in Integer has been deprecated [javac] final Integer[] codeF = new Integer[] {new Integer(code)}; [javac] ^ [javac] /home/iurt/rpmbuild/BUILD/wrapper_3.5.43_src/src/java/org/tanukisoftware/wrapper/WrapperManager.java:4847: warning: [deprecation] Integer(int) in Integer has been deprecated [javac] m_outDebug.println( getRes().getString( "Application stop main thread: {0} Priority: {1}", thisThread.getName(), new Integer( thisThread.getPriority() ) ) ); [javac] ^ [javac] /home/iurt/rpmbuild/BUILD/wrapper_3.5.43_src/src/java/org/tanukisoftware/wrapper/WrapperManager.java:4855: warning: [deprecation] Integer(int) in Integer has been deprecated [javac] codeF[0] = new Integer( m_listener.stop( codeF[0].intValue() ) ); [javac] ^ [javac] /home/iurt/rpmbuild/BUILD/wrapper_3.5.43_src/src/java/org/tanukisoftware/wrapper/WrapperManager.java:4915: warning: [deprecation] Integer(int) in Integer has been deprecated [javac] new Integer( code ) ) ); [javac] ^ [javac] /home/iurt/rpmbuild/BUILD/wrapper_3.5.43_src/src/java/org/tanukisoftware/wrapper/WrapperManager.java:4974: warning: [deprecation] Integer(int) in Integer has been deprecated [javac] eventName = getRes().getString( "Unexpected event: {0}", new Integer( event ) ); [javac] ^ [javac] /home/iurt/rpmbuild/BUILD/wrapper_3.5.43_src/src/java/org/tanukisoftware/wrapper/WrapperManager.java:5182: warning: [deprecation] Integer(int) in Integer has been deprecated [javac] new Integer( tryPort ), e.toString() ) ); [javac] ^ [javac] /home/iurt/rpmbuild/BUILD/wrapper_3.5.43_src/src/java/org/tanukisoftware/wrapper/WrapperManager.java:5202: warning: [deprecation] Integer(int) in Integer has been deprecated [javac] new Integer( tryPort ), new Integer( m_port ) ) ); [javac] ^ [javac] /home/iurt/rpmbuild/BUILD/wrapper_3.5.43_src/src/java/org/tanukisoftware/wrapper/WrapperManager.java:5202: warning: [deprecation] Integer(int) in Integer has been deprecated [javac] new Integer( tryPort ), new Integer( m_port ) ) ); [javac] ^ [javac] /home/iurt/rpmbuild/BUILD/wrapper_3.5.43_src/src/java/org/tanukisoftware/wrapper/WrapperManager.java:5215: warning: [deprecation] Integer(int) in Integer has been deprecated [javac] new Integer( m_port ), e ) ); [javac] ^ [javac] /home/iurt/rpmbuild/BUILD/wrapper_3.5.43_src/src/java/org/tanukisoftware/wrapper/WrapperManager.java:5238: warning: [deprecation] Integer(int) in Integer has been deprecated [javac] new Integer( tryPort ) ) ); [javac] ^ [javac] /home/iurt/rpmbuild/BUILD/wrapper_3.5.43_src/src/java/org/tanukisoftware/wrapper/WrapperManager.java:5269: warning: [deprecation] Integer(int) in Integer has been deprecated [javac] new Integer( tryPort ), Integer.toString( portStatus ) ) ); [javac] ^ [javac] /home/iurt/rpmbuild/BUILD/wrapper_3.5.43_src/src/java/org/tanukisoftware/wrapper/WrapperManager.java:5292: warning: [deprecation] Integer(int) in Integer has been deprecated [javac] new Integer( m_jvmPort ), new Integer( tryPort ) ) ); [javac] ^ [javac] /home/iurt/rpmbuild/BUILD/wrapper_3.5.43_src/src/java/org/tanukisoftware/wrapper/WrapperManager.java:5292: warning: [deprecation] Integer(int) in Integer has been deprecated [javac] new Integer( m_jvmPort ), new Integer( tryPort ) ) ); [javac] ^ [javac] /home/iurt/rpmbuild/BUILD/wrapper_3.5.43_src/src/java/org/tanukisoftware/wrapper/WrapperManager.java:5310: warning: [deprecation] Integer(int) in Integer has been deprecated [javac] new Integer( m_port ), new Integer( m_jvmPortMin ), new Integer( m_jvmPortMax ), causeMessage ) ); [javac] ^ [javac] /home/iurt/rpmbuild/BUILD/wrapper_3.5.43_src/src/java/org/tanukisoftware/wrapper/WrapperManager.java:5310: warning: [deprecation] Integer(int) in Integer has been deprecated [javac] new Integer( m_port ), new Integer( m_jvmPortMin ), new Integer( m_jvmPortMax ), causeMessage ) ); [javac] ^ [javac] /home/iurt/rpmbuild/BUILD/wrapper_3.5.43_src/src/java/org/tanukisoftware/wrapper/WrapperManager.java:5310: warning: [deprecation] Integer(int) in Integer has been deprecated [javac] new Integer( m_port ), new Integer( m_jvmPortMin ), new Integer( m_jvmPortMax ), causeMessage ) ); [javac] ^ [javac] /home/iurt/rpmbuild/BUILD/wrapper_3.5.43_src/src/java/org/tanukisoftware/wrapper/WrapperManager.java:5316: warning: [deprecation] Integer(int) in Integer has been deprecated [javac] new Integer( m_port ), new Integer( m_jvmPortMin ), causeMessage ) ); [javac] ^ [javac] /home/iurt/rpmbuild/BUILD/wrapper_3.5.43_src/src/java/org/tanukisoftware/wrapper/WrapperManager.java:5316: warning: [deprecation] Integer(int) in Integer has been deprecated [javac] new Integer( m_port ), new Integer( m_jvmPortMin ), causeMessage ) ); [javac] ^ [javac] /home/iurt/rpmbuild/BUILD/wrapper_3.5.43_src/src/java/org/tanukisoftware/wrapper/WrapperManager.java:5335: warning: [deprecation] Integer(int) in Integer has been deprecated [javac] new Integer( m_soTimeout ), new Integer( m_backendSocket.getSoTimeout() ) ) ); [javac] ^ [javac] /home/iurt/rpmbuild/BUILD/wrapper_3.5.43_src/src/java/org/tanukisoftware/wrapper/WrapperManager.java:5335: warning: [deprecation] Integer(int) in Integer has been deprecated [javac] new Integer( m_soTimeout ), new Integer( m_backendSocket.getSoTimeout() ) ) ); [javac] ^ [javac] /home/iurt/rpmbuild/BUILD/wrapper_3.5.43_src/src/java/org/tanukisoftware/wrapper/WrapperManager.java:5436: warning: [deprecation] Integer(int) in Integer has been deprecated [javac] m_outDebug.println( getRes().getString( "Waiting for {0} threads to finish launching child processes...", new Integer( m_runningExecs ) ) ); [javac] ^ [javac] /home/iurt/rpmbuild/BUILD/wrapper_3.5.43_src/src/java/org/tanukisoftware/wrapper/WrapperManager.java:5447: warning: [deprecation] Integer(int) in Integer has been deprecated [javac] m_outError.println( getRes().getString( "Timed out waiting for {0} threads to finish launching child processes.", new Integer( m_runningExecs ) ) ); [javac] ^ [javac] /home/iurt/rpmbuild/BUILD/wrapper_3.5.43_src/src/java/org/tanukisoftware/wrapper/WrapperManager.java:5901: warning: [deprecation] Integer(int) in Integer has been deprecated [javac] m_outDebug.println( getRes().getString( " Delay packet processing by {0} seconds.", new Integer( m_slowSeconds ) ) ); [javac] ^ [javac] /home/iurt/rpmbuild/BUILD/wrapper_3.5.43_src/src/java/org/tanukisoftware/wrapper/WrapperManager.java:5972: warning: [deprecation] Integer(int) in Integer has been deprecated [javac] new Integer( m_lowLogLevel ) ) ); [javac] ^ [javac] /home/iurt/rpmbuild/BUILD/wrapper_3.5.43_src/src/java/org/tanukisoftware/wrapper/WrapperManager.java:5994: warning: [deprecation] Integer(int) in Integer has been deprecated [javac] new Integer( serviceControlCode ) ) ); [javac] ^ [javac] /home/iurt/rpmbuild/BUILD/wrapper_3.5.43_src/src/java/org/tanukisoftware/wrapper/WrapperManager.java:6095: warning: [deprecation] Integer(int) in Integer has been deprecated [javac] "Wrapper code received an unknown packet type: {0}", new Integer( code ) ) ); [javac] ^ [javac] /home/iurt/rpmbuild/BUILD/wrapper_3.5.43_src/src/java/org/tanukisoftware/wrapper/WrapperManager.java:6105: warning: [deprecation] Integer(int) in Integer has been deprecated [javac] new Integer( m_backendSocket.getSoTimeout() ) ) ); [javac] ^ [javac] /home/iurt/rpmbuild/BUILD/wrapper_3.5.43_src/src/java/org/tanukisoftware/wrapper/WrapperResources.java:96: warning: [deprecation] finalize() in Object has been deprecated [javac] protected void finalize() [javac] ^ [javac] /home/iurt/rpmbuild/BUILD/wrapper_3.5.43_src/src/java/org/tanukisoftware/wrapper/WrapperResources.java:118: warning: [deprecation] finalize() in Object has been deprecated [javac] super.finalize(); [javac] ^ [javac] /home/iurt/rpmbuild/BUILD/wrapper_3.5.43_src/src/java/org/tanukisoftware/wrapper/WrapperProcessConfig.java:336: warning: [deprecation] Integer(int) in Integer has been deprecated [javac] new Integer ( softShutdownTimeout ) ) ); [javac] ^ [javac] /home/iurt/rpmbuild/BUILD/wrapper_3.5.43_src/src/java/org/tanukisoftware/wrapper/WrapperProcessConfig.java:366: warning: [deprecation] Integer(int) in Integer has been deprecated [javac] new Integer( startType ) ) ); [javac] ^ [javac] /home/iurt/rpmbuild/BUILD/wrapper_3.5.43_src/src/java/org/tanukisoftware/wrapper/WrapperProcess.java:62: warning: [deprecation] finalize() in Object has been deprecated [javac] protected void finalize() [javac] ^ [javac] /home/iurt/rpmbuild/BUILD/wrapper_3.5.43_src/src/java/org/tanukisoftware/wrapper/WrapperProcess.java:74: warning: [deprecation] finalize() in Object has been deprecated [javac] super.finalize(); [javac] ^ [javac] /home/iurt/rpmbuild/BUILD/wrapper_3.5.43_src/src/java/org/tanukisoftware/wrapper/WrapperSimpleApp.java:428: warning: [deprecation] Integer(int) in Integer has been deprecated [javac] m_mainExitCode = new Integer( 1 ); [javac] ^ [javac] /home/iurt/rpmbuild/BUILD/wrapper_3.5.43_src/src/java/org/tanukisoftware/wrapper/WrapperSimpleApp.java:467: warning: [deprecation] Integer(int) in Integer has been deprecated [javac] return new Integer( 1 ); [javac] ^ [javac] /home/iurt/rpmbuild/BUILD/wrapper_3.5.43_src/src/java/org/tanukisoftware/wrapper/WrapperSimpleApp.java:497: warning: [deprecation] Integer(int) in Integer has been deprecated [javac] new Integer(maxLoops) ) ); [javac] ^ [javac] /home/iurt/rpmbuild/BUILD/wrapper_3.5.43_src/src/java/org/tanukisoftware/wrapper/WrapperSimpleApp.java:559: warning: [deprecation] Boolean(boolean) in Boolean has been deprecated [javac] new Boolean( m_mainComplete ), m_mainExitCode ) ); [javac] ^ [javac] /home/iurt/rpmbuild/BUILD/wrapper_3.5.43_src/src/java/org/tanukisoftware/wrapper/WrapperSimpleApp.java:573: warning: [deprecation] Integer(int) in Integer has been deprecated [javac] "stop({0})", new Integer ( exitCode ) ) ); [javac] ^ [javac] /home/iurt/rpmbuild/BUILD/wrapper_3.5.43_src/src/java/org/tanukisoftware/wrapper/WrapperSimpleApp.java:602: warning: [deprecation] Integer(int) in Integer has been deprecated [javac] "controlEvent({0}) Stopping", new Integer( event ) ) ); [javac] ^ [javac] /home/iurt/rpmbuild/BUILD/wrapper_3.5.43_src/src/java/org/tanukisoftware/wrapper/WrapperStartStopApp.java:509: warning: [deprecation] Integer(int) in Integer has been deprecated [javac] m_mainExitCode = new Integer( 1 ); [javac] ^ [javac] /home/iurt/rpmbuild/BUILD/wrapper_3.5.43_src/src/java/org/tanukisoftware/wrapper/WrapperStartStopApp.java:546: warning: [deprecation] Integer(int) in Integer has been deprecated [javac] return new Integer( 1 ); [javac] ^ [javac] /home/iurt/rpmbuild/BUILD/wrapper_3.5.43_src/src/java/org/tanukisoftware/wrapper/WrapperStartStopApp.java:576: warning: [deprecation] Integer(int) in Integer has been deprecated [javac] new Integer(maxLoops) ) ); [javac] ^ [javac] /home/iurt/rpmbuild/BUILD/wrapper_3.5.43_src/src/java/org/tanukisoftware/wrapper/WrapperStartStopApp.java:638: warning: [deprecation] Boolean(boolean) in Boolean has been deprecated [javac] new Boolean( m_mainComplete ), m_mainExitCode ) ); [javac] ^ [javac] /home/iurt/rpmbuild/BUILD/wrapper_3.5.43_src/src/java/org/tanukisoftware/wrapper/WrapperStartStopApp.java:651: warning: [deprecation] Integer(int) in Integer has been deprecated [javac] m_outDebug.println(WrapperManager.getRes().getString( "stop({0})", new Integer( exitCode ) ) ); [javac] ^ [javac] /home/iurt/rpmbuild/BUILD/wrapper_3.5.43_src/src/java/org/tanukisoftware/wrapper/WrapperStartStopApp.java:695: warning: [deprecation] Integer(int) in Integer has been deprecated [javac] new Integer( threadCnt - systemThreadCount ) ) ); [javac] ^ [javac] /home/iurt/rpmbuild/BUILD/wrapper_3.5.43_src/src/java/org/tanukisoftware/wrapper/WrapperStartStopApp.java:756: warning: [deprecation] Integer(int) in Integer has been deprecated [javac] "controlEvent({0}) Stopping", new Integer( event ) ) ); [javac] ^ [javac] /home/iurt/rpmbuild/BUILD/wrapper_3.5.43_src/src/java/org/tanukisoftware/wrapper/WrapperStartStopApp.java:925: warning: [deprecation] Integer(int) in Integer has been deprecated [javac] m_initError = WrapperManager.getRes().getString( "Not enough arguments. Argument count of {0} was specified.", new Integer( argCount) ); [javac] ^ [javac] /home/iurt/rpmbuild/BUILD/wrapper_3.5.43_src/src/java/org/tanukisoftware/wrapper/demo/DeadLock.java:30: warning: [deprecation] Integer(int) in Integer has been deprecated [javac] System.out.println( DemoApp.getRes().getString( "Locker-{0}: Started", new Integer( m_id ) ) ); [javac] ^ [javac] /home/iurt/rpmbuild/BUILD/wrapper_3.5.43_src/src/java/org/tanukisoftware/wrapper/demo/DeadLock.java:42: warning: [deprecation] Integer(int) in Integer has been deprecated [javac] System.out.println( DemoApp.getRes().getString( "Locker-{0}: Complete", new Integer( m_id ) ) ); [javac] ^ [javac] /home/iurt/rpmbuild/BUILD/wrapper_3.5.43_src/src/java/org/tanukisoftware/wrapper/demo/DeadLock.java:53: warning: [deprecation] Integer(int) in Integer has been deprecated [javac] System.out.println( DemoApp.getRes().getString( "Locker-{0}: Try locking {1}...", new Integer( m_id ), m_obj2.toString() ) ); [javac] ^ [javac] /home/iurt/rpmbuild/BUILD/wrapper_3.5.43_src/src/java/org/tanukisoftware/wrapper/demo/DeadLock.java:56: warning: [deprecation] Integer(int) in Integer has been deprecated [javac] System.out.println( DemoApp.getRes().getString( "Locker-{0}: Oops! Locked {1}", new Integer( m_id ), m_obj2.toString() ) ); [javac] ^ [javac] /home/iurt/rpmbuild/BUILD/wrapper_3.5.43_src/src/java/org/tanukisoftware/wrapper/demo/DeadLock.java:82: warning: [deprecation] Integer(int) in Integer has been deprecated [javac] System.out.println( DemoApp.getRes().getString( "Locker-{0}: Locking {1}...", new Integer( m_id ), m_obj1.toString() ) ); [javac] ^ [javac] /home/iurt/rpmbuild/BUILD/wrapper_3.5.43_src/src/java/org/tanukisoftware/wrapper/demo/DeadLock.java:85: warning: [deprecation] Integer(int) in Integer has been deprecated [javac] System.out.println( DemoApp.getRes().getString( "Locker-{0}: Locked {1}", new Integer( m_id ), m_obj1.toString() ) ); [javac] ^ [javac] /home/iurt/rpmbuild/BUILD/wrapper_3.5.43_src/src/java/org/tanukisoftware/wrapper/demo/DemoApp.java:148: warning: [deprecation] Integer(int) in Integer has been deprecated [javac] System.out.println( getRes().getString( "TestWrapper: controlEvent({0})", new Integer( event ) ) ); [javac] ^ [javac] /home/iurt/rpmbuild/BUILD/wrapper_3.5.43_src/src/java/org/tanukisoftware/wrapper/event/WrapperServiceActionEvent.java:135: warning: [deprecation] Integer(int) in Integer has been deprecated [javac] return WrapperManager.getRes().getString( "Unknown Code {0}", new Integer( actionSourceCode ) ); [javac] ^ [javac] /home/iurt/rpmbuild/BUILD/wrapper_3.5.43_src/src/java/org/tanukisoftware/wrapper/security/WrapperUserEventPermission.java:223: warning: [deprecation] Integer(int) in Integer has been deprecated [javac] throw new AccessControlException( WrapperManager.getRes().getString( "Value {0} is out of bounds.", new Integer( lastValue ) ) ); [javac] ^ [javac] /home/iurt/rpmbuild/BUILD/wrapper_3.5.43_src/src/java/org/tanukisoftware/wrapper/security/WrapperUserEventPermission.java:233: warning: [deprecation] Integer(int) in Integer has been deprecated [javac] throw new AccessControlException( WrapperManager.getRes().getString( "Value {0} is out of bounds.", new Integer( lastValue ) ) ); [javac] ^ [javac] /home/iurt/rpmbuild/BUILD/wrapper_3.5.43_src/src/java/org/tanukisoftware/wrapper/security/WrapperUserEventPermission.java:237: warning: [deprecation] Integer(int) in Integer has been deprecated [javac] throw new AccessControlException( WrapperManager.getRes().getString( "Value {0} is not sorted.", new Integer( currentValue ) ) ); [javac] ^ [javac] /home/iurt/rpmbuild/BUILD/wrapper_3.5.43_src/src/java/org/tanukisoftware/wrapper/security/WrapperUserEventPermission.java:251: warning: [deprecation] Integer(int) in Integer has been deprecated [javac] throw new AccessControlException( WrapperManager.getRes().getString( "Value {0} is out of bounds.", new Integer( lastValue ) ) ); [javac] ^ [javac] /home/iurt/rpmbuild/BUILD/wrapper_3.5.43_src/src/java/org/tanukisoftware/wrapper/security/WrapperUserEventPermission.java:255: warning: [deprecation] Integer(int) in Integer has been deprecated [javac] throw new AccessControlException( WrapperManager.getRes().getString( "Value {0} is not sorted.", new Integer( currentValue ) ) ); [javac] ^ [javac] /home/iurt/rpmbuild/BUILD/wrapper_3.5.43_src/src/java/org/tanukisoftware/wrapper/security/WrapperUserEventPermission.java:261: warning: [deprecation] Integer(int) in Integer has been deprecated [javac] throw new AccessControlException( WrapperManager.getRes().getString( "Value {0} is out of bounds.", new Integer( lastValue ) ) ); [javac] ^ [javac] /home/iurt/rpmbuild/BUILD/wrapper_3.5.43_src/src/java/org/tanukisoftware/wrapper/security/WrapperUserEventPermission.java:265: warning: [deprecation] Integer(int) in Integer has been deprecated [javac] throw new AccessControlException( WrapperManager.getRes().getString( "Value {0} is not sorted.", new Integer( currentValue ) ) ); [javac] ^ [javac] /home/iurt/rpmbuild/BUILD/wrapper_3.5.43_src/src/java/org/tanukisoftware/wrapper/security/WrapperUserEventPermission.java:276: warning: [deprecation] Integer(int) in Integer has been deprecated [javac] throw new java.security.AccessControlException( WrapperManager.getRes().getString( "Value {0} is not sorted.", new Integer( currentValue ) ) ); [javac] ^ [javac] /home/iurt/rpmbuild/BUILD/wrapper_3.5.43_src/src/java/org/tanukisoftware/wrapper/test/AbstractActionApp.java:643: warning: [deprecation] Integer(int) in Integer has been deprecated [javac] System.out.println( Main.getRes().getString( "Service after user code {0} : {1}", new Integer( i ), service ) ); [javac] ^ [javac] /home/iurt/rpmbuild/BUILD/wrapper_3.5.43_src/src/java/org/tanukisoftware/wrapper/test/DeadLockBase.java:43: warning: [deprecation] Integer(int) in Integer has been deprecated [javac] m_id = new Integer( id ); [javac] ^ [javac] /home/iurt/rpmbuild/BUILD/wrapper_3.5.43_src/src/java/org/tanukisoftware/wrapper/test/DeadLockBase.java:96: warning: non-varargs call of varargs method with inexact argument type for last parameter; [javac] rentrantLockClass.getMethod( "lock", null ).invoke( lock2, [javac] ^ [javac] cast to Class for a varargs call [javac] cast to Class[] for a non-varargs call and to suppress this warning [javac] /home/iurt/rpmbuild/BUILD/wrapper_3.5.43_src/src/java/org/tanukisoftware/wrapper/test/DeadLockBase.java:104: warning: non-varargs call of varargs method with inexact argument type for last parameter; [javac] rentrantLockClass.getMethod( "unlock", null ).invoke( lock2, [javac] ^ [javac] cast to Class for a varargs call [javac] cast to Class[] for a non-varargs call and to suppress this warning [javac] /home/iurt/rpmbuild/BUILD/wrapper_3.5.43_src/src/java/org/tanukisoftware/wrapper/test/DeadLockBase.java:162: warning: non-varargs call of varargs method with inexact argument type for last parameter; [javac] rentrantLockClass.getMethod( "lock", null ).invoke( lock1, [javac] ^ [javac] cast to Class for a varargs call [javac] cast to Class[] for a non-varargs call and to suppress this warning [javac] Note: Some input files additionally use or override a deprecated API. [javac] Note: Some input files use unchecked or unsafe operations. [javac] Note: Recompile with -Xlint:unchecked for details. [javac] 100 warnings [copy] Copying 18 files to /home/iurt/rpmbuild/BUILD/wrapper_3.5.43_src/build/classes check:junit: compile-java:junit: [javac] Compiling 1 source file to /home/iurt/rpmbuild/BUILD/wrapper_3.5.43_src/build/testclasses [javac] warning: [options] bootstrap class path not set in conjunction with -source 8 [javac] 1 warning compile-java: update-info-c: [copy] Copying 1 file to /home/iurt/rpmbuild/BUILD/wrapper_3.5.43_src/src/c msvc-missing: compile-c-windows-vcvars: compile-c-windows-check: compile-c-windows-check2: compile-c-unix-check: compile-c-unix: [mkdir] Created dir: /home/iurt/rpmbuild/BUILD/wrapper_3.5.43_src/bin [mkdir] Created dir: /home/iurt/rpmbuild/BUILD/wrapper_3.5.43_src/test [echo] Build native components using 'make' and Makefile: Makefile-linux-aarch64-64.make [exec] if test ! -d .deps; then mkdir .deps; fi [exec] gcc -O2 -g -pipe -Wformat -Werror=format-security -Wp,-D_FORTIFY_SOURCE=2 -fstack-protector --param=ssp-buffer-size=4 -fasynchronous-unwind-tables -fPIC -Wall --pedantic -DLINUX -D_FORTIFY_SOURCE=2 -DJSW64 -D_FILE_OFFSET_BITS=64 -fpic -D_GNU_SOURCE -DUNICODE -D_UNICODE -Wl,-z,relro,-z,now -pthread wrapper.c wrapperinfo.c wrappereventloop.c wrapper_unix.c property.c logger.c logger_file.c wrapper_file.c wrapper_i18n.c wrapper_hashmap.c wrapper_ulimit.c wrapper_encoding.c wrapper_jvminfo.c -o ../../bin/wrapper -lm [exec] gcc -O2 -g -pipe -Wformat -Werror=format-security -Wp,-D_FORTIFY_SOURCE=2 -fstack-protector --param=ssp-buffer-size=4 -fasynchronous-unwind-tables -fPIC -Wall --pedantic -DLINUX -D_FORTIFY_SOURCE=2 -DJSW64 -D_FILE_OFFSET_BITS=64 -fpic -D_GNU_SOURCE -DUNICODE -D_UNICODE -c wrapper_i18n.c [exec] gcc -O2 -g -pipe -Wformat -Werror=format-security -Wp,-D_FORTIFY_SOURCE=2 -fstack-protector --param=ssp-buffer-size=4 -fasynchronous-unwind-tables -fPIC -Wall --pedantic -DLINUX -D_FORTIFY_SOURCE=2 -DJSW64 -D_FILE_OFFSET_BITS=64 -fpic -D_GNU_SOURCE -DUNICODE -D_UNICODE -c wrapperjni_unix.c [exec] gcc -O2 -g -pipe -Wformat -Werror=format-security -Wp,-D_FORTIFY_SOURCE=2 -fstack-protector --param=ssp-buffer-size=4 -fasynchronous-unwind-tables -fPIC -Wall --pedantic -DLINUX -D_FORTIFY_SOURCE=2 -DJSW64 -D_FILE_OFFSET_BITS=64 -fpic -D_GNU_SOURCE -DUNICODE -D_UNICODE -c wrapperinfo.c [exec] gcc -O2 -g -pipe -Wformat -Werror=format-security -Wp,-D_FORTIFY_SOURCE=2 -fstack-protector --param=ssp-buffer-size=4 -fasynchronous-unwind-tables -fPIC -Wall --pedantic -DLINUX -D_FORTIFY_SOURCE=2 -DJSW64 -D_FILE_OFFSET_BITS=64 -fpic -D_GNU_SOURCE -DUNICODE -D_UNICODE -c wrapperjni.c [exec] In file included from /usr/include/string.h:519, [exec] from wrapperjni.c:31: [exec] In function 'strncpy', [exec] inlined from 'getSystemProperty' at wrapperjni.c:443:33: [exec] /usr/include/bits/string_fortified.h:91:10: warning: '__builtin_strncpy' specified bound depends on the length of the source argument [-Wstringop-overflow=] [exec] 91 | return __builtin___strncpy_chk (__dest, __src, __len, __bos (__dest)); [exec] | ^~~~~~~~~~~~~~~~~~~~~~~~~~~~~~~~~~~~~~~~~~~~~~~~~~~~~~~~~~~~~~ [exec] wrapperjni.c: In function 'getSystemProperty': [exec] wrapperjni.c:443:81: note: length computed here [exec] 443 | strncpy((char*)*propertyValue, (char*)keyChars, strlen((char*)keyChars) + 1); [exec] | ^~~~~~~~~~~~~~~~~~~~~~~ [exec] gcc -O2 -g -pipe -Wformat -Werror=format-security -Wp,-D_FORTIFY_SOURCE=2 -fstack-protector --param=ssp-buffer-size=4 -fasynchronous-unwind-tables -fPIC -Wall --pedantic -DLINUX -D_FORTIFY_SOURCE=2 -DJSW64 -D_FILE_OFFSET_BITS=64 -fpic -D_GNU_SOURCE -DUNICODE -D_UNICODE -c loggerjni.c [exec] gcc -O2 -g -pipe -Wformat -Werror=format-security -Wp,-D_FORTIFY_SOURCE=2 -fstack-protector --param=ssp-buffer-size=4 -fasynchronous-unwind-tables -fPIC -Wall --pedantic -DLINUX -D_FORTIFY_SOURCE=2 -DJSW64 -D_FILE_OFFSET_BITS=64 -fpic -D_GNU_SOURCE -DUNICODE -D_UNICODE -shared wrapper_i18n.o wrapperjni_unix.o wrapperinfo.o wrapperjni.o loggerjni.o -o ../../lib/libwrapper.so compile-c: compile: [mkdir] Created dir: /home/iurt/rpmbuild/BUILD/wrapper_3.5.43_src/logs jar:jar: [jar] Building jar: /home/iurt/rpmbuild/BUILD/wrapper_3.5.43_src/lib/wrapper.jar [jar] Building jar: /home/iurt/rpmbuild/BUILD/wrapper_3.5.43_src/lib/wrappertest.jar [jar] Building jar: /home/iurt/rpmbuild/BUILD/wrapper_3.5.43_src/lib/wrapperdemo.jar [jar] Building jar: /home/iurt/rpmbuild/BUILD/wrapper_3.5.43_src/lib/wrappertest2.jar jar: test: [mkdir] Created dir: /home/iurt/rpmbuild/BUILD/wrapper_3.5.43_src/build/tests [junit] WARNING: multiple versions of ant detected in path for junit [junit] jar:file:/usr/share/java/ant.jar!/org/apache/tools/ant/Project.class [junit] and jar:file:/usr/share/ant/lib/ant.jar!/org/apache/tools/ant/Project.class [junit] Running org.tanukisoftware.wrapper.WrapperManagerSystemTimeTestCase [junit] Testsuite: org.tanukisoftware.wrapper.WrapperManagerSystemTimeTestCase [junit] Tests run: 2, Failures: 0, Errors: 0, Skipped: 0, Time elapsed: 0.041 sec [junit] Tests run: 2, Failures: 0, Errors: 0, Skipped: 0, Time elapsed: 0.041 sec [junit] [junit] Testcase: testOverflow took 0.003 sec [junit] Testcase: testSimple took 0.001 sec bin-bat: bin-sh: [copy] Copying 1 file to /home/iurt/rpmbuild/BUILD/wrapper_3.5.43_src/bin [copy] Copying 1 file to /home/iurt/rpmbuild/BUILD/wrapper_3.5.43_src/bin bin: conf: [mkdir] Created dir: /home/iurt/rpmbuild/BUILD/wrapper_3.5.43_src/conf [copy] Copying 1 file to /home/iurt/rpmbuild/BUILD/wrapper_3.5.43_src/conf [copy] Copying 1 file to /home/iurt/rpmbuild/BUILD/wrapper_3.5.43_src/conf test-setup: check-libs-exist.scriptLibs: check-script-tests-setup-common: script-tests-setup-common-not-ok: [echo] ******************************************************************* [echo] * WARNING [echo] * The tests are being built with Java version 11 which doesn't [echo] * include the Scripting API. [echo] * Apache Commons Logging, Apache Commons BSF and Rhino are required [echo] * when using a Java version older than 6 but these libraries could [echo] * not be found in '/home/iurt/rpmbuild/BUILD/wrapper_3.5.43_src/external/test/scriptLibs/'. [echo] * The tests using the Scripting API will not be built. [echo] ******************************************************************** init-windows-nt: init-windows-2000: init-windows-xp: init-windows-2003: init-windows-2008-r2: init-windows-vista: init-windows-7: init-windows-8: init-windows-8-1: init-windows-10: init-windows: init-linux: init-solaris: init-aix: init-hpux: init-macosx: init-freebsd: init: test-setup-common-init: [copy] Copying 1 file to /home/iurt/rpmbuild/BUILD/wrapper_3.5.43_src/test general-tests-setup-common: [copy] Copying 1 file to /home/iurt/rpmbuild/BUILD/wrapper_3.5.43_src/test [copy] Copying 1 file to /home/iurt/rpmbuild/BUILD/wrapper_3.5.43_src/test [copy] Copying 1 file to /home/iurt/rpmbuild/BUILD/wrapper_3.5.43_src/test [copy] Copying 1 file to /home/iurt/rpmbuild/BUILD/wrapper_3.5.43_src/test [copy] Copying 1 file to /home/iurt/rpmbuild/BUILD/wrapper_3.5.43_src/test [copy] Copying 1 file to /home/iurt/rpmbuild/BUILD/wrapper_3.5.43_src/test [copy] Copying 1 file to /home/iurt/rpmbuild/BUILD/wrapper_3.5.43_src/test [copy] Copying 1 file to /home/iurt/rpmbuild/BUILD/wrapper_3.5.43_src/test [copy] Copying 1 file to /home/iurt/rpmbuild/BUILD/wrapper_3.5.43_src/test [copy] Copying 1 file to /home/iurt/rpmbuild/BUILD/wrapper_3.5.43_src/test [copy] Copying 1 file to /home/iurt/rpmbuild/BUILD/wrapper_3.5.43_src/test [copy] Copying 1 file to /home/iurt/rpmbuild/BUILD/wrapper_3.5.43_src/test [copy] Copying 1 file to /home/iurt/rpmbuild/BUILD/wrapper_3.5.43_src/test [copy] Copying 1 file to /home/iurt/rpmbuild/BUILD/wrapper_3.5.43_src/test [copy] Copying 1 file to /home/iurt/rpmbuild/BUILD/wrapper_3.5.43_src/test [copy] Copying 1 file to /home/iurt/rpmbuild/BUILD/wrapper_3.5.43_src/test [copy] Copying 1 file to /home/iurt/rpmbuild/BUILD/wrapper_3.5.43_src/test [copy] Copying 1 file to /home/iurt/rpmbuild/BUILD/wrapper_3.5.43_src/test [copy] Copying 1 file to /home/iurt/rpmbuild/BUILD/wrapper_3.5.43_src/test [copy] Copying 1 file to /home/iurt/rpmbuild/BUILD/wrapper_3.5.43_src/test [copy] Copying 1 file to /home/iurt/rpmbuild/BUILD/wrapper_3.5.43_src/test [copy] Copying 1 file to /home/iurt/rpmbuild/BUILD/wrapper_3.5.43_src/test [copy] Copying 1 file to /home/iurt/rpmbuild/BUILD/wrapper_3.5.43_src/test [copy] Copying 1 file to /home/iurt/rpmbuild/BUILD/wrapper_3.5.43_src/test [copy] Copying 1 file to /home/iurt/rpmbuild/BUILD/wrapper_3.5.43_src/test [copy] Copying 1 file to /home/iurt/rpmbuild/BUILD/wrapper_3.5.43_src/test [copy] Copying 1 file to /home/iurt/rpmbuild/BUILD/wrapper_3.5.43_src/test [copy] Copying 1 file to /home/iurt/rpmbuild/BUILD/wrapper_3.5.43_src/test [copy] Copying 1 file to /home/iurt/rpmbuild/BUILD/wrapper_3.5.43_src/test [copy] Copying 1 file to /home/iurt/rpmbuild/BUILD/wrapper_3.5.43_src/test [copy] Copying 1 file to /home/iurt/rpmbuild/BUILD/wrapper_3.5.43_src/test [copy] Copying 1 file to /home/iurt/rpmbuild/BUILD/wrapper_3.5.43_src/test [copy] Copying 1 file to /home/iurt/rpmbuild/BUILD/wrapper_3.5.43_src/test [copy] Copying 1 file to /home/iurt/rpmbuild/BUILD/wrapper_3.5.43_src/test [copy] Copying 1 file to /home/iurt/rpmbuild/BUILD/wrapper_3.5.43_src/test [copy] Copying 1 file to /home/iurt/rpmbuild/BUILD/wrapper_3.5.43_src/test [copy] Copying 1 file to /home/iurt/rpmbuild/BUILD/wrapper_3.5.43_src/test [copy] Copying 1 file to /home/iurt/rpmbuild/BUILD/wrapper_3.5.43_src/test [copy] Copying 1 file to /home/iurt/rpmbuild/BUILD/wrapper_3.5.43_src/test [copy] Copying 1 file to /home/iurt/rpmbuild/BUILD/wrapper_3.5.43_src/test [copy] Copying 1 file to /home/iurt/rpmbuild/BUILD/wrapper_3.5.43_src/test [touch] Creating /home/iurt/rpmbuild/BUILD/wrapper_3.5.43_src/test/appparameterfile-01-empty.param [copy] Copying 1 file to /home/iurt/rpmbuild/BUILD/wrapper_3.5.43_src/test [copy] Copying 1 file to /home/iurt/rpmbuild/BUILD/wrapper_3.5.43_src/test [copy] Copying 1 file to /home/iurt/rpmbuild/BUILD/wrapper_3.5.43_src/test [copy] Copying 1 file to /home/iurt/rpmbuild/BUILD/wrapper_3.5.43_src/test [copy] Copying 1 file to /home/iurt/rpmbuild/BUILD/wrapper_3.5.43_src/test [copy] Copying 1 file to /home/iurt/rpmbuild/BUILD/wrapper_3.5.43_src/test [copy] Copying 1 file to /home/iurt/rpmbuild/BUILD/wrapper_3.5.43_src/test [touch] Creating /home/iurt/rpmbuild/BUILD/wrapper_3.5.43_src/test/javaadditionalfile-01-empty.param [copy] Copying 1 file to /home/iurt/rpmbuild/BUILD/wrapper_3.5.43_src/test [copy] Copying 1 file to /home/iurt/rpmbuild/BUILD/wrapper_3.5.43_src/test [copy] Copying 1 file to /home/iurt/rpmbuild/BUILD/wrapper_3.5.43_src/test [copy] Copying 1 file to /home/iurt/rpmbuild/BUILD/wrapper_3.5.43_src/test [copy] Copying 1 file to /home/iurt/rpmbuild/BUILD/wrapper_3.5.43_src/test [copy] Copying 1 file to /home/iurt/rpmbuild/BUILD/wrapper_3.5.43_src/test [copy] Copying 1 file to /home/iurt/rpmbuild/BUILD/wrapper_3.5.43_src/test [copy] Copying 1 file to /home/iurt/rpmbuild/BUILD/wrapper_3.5.43_src/test [copy] Copying 1 file to /home/iurt/rpmbuild/BUILD/wrapper_3.5.43_src/test [copy] Copying 1 file to /home/iurt/rpmbuild/BUILD/wrapper_3.5.43_src/test [copy] Copying 1 file to /home/iurt/rpmbuild/BUILD/wrapper_3.5.43_src/test [copy] Copying 1 file to /home/iurt/rpmbuild/BUILD/wrapper_3.5.43_src/test set-classpath.scriptLibs: default-classpath.scriptLibs: init-classpath.scriptLibs: script-tests-setup-common: test-setup-common: general-tests-setup-bat: check-script-tests-setup-bat: script-tests-setup-bat: test-setup-bat: test-setup-sh: [copy] Copying 1 file to /home/iurt/rpmbuild/BUILD/wrapper_3.5.43_src/test [copy] Copying 1 file to /home/iurt/rpmbuild/BUILD/wrapper_3.5.43_src/test test-setup-unix-init: general-tests-setup-unix: [copy] Copying 1 file to /home/iurt/rpmbuild/BUILD/wrapper_3.5.43_src/test/common [copy] Copying 1 file to /home/iurt/rpmbuild/BUILD/wrapper_3.5.43_src/test/common [copy] Copying 1 file to /home/iurt/rpmbuild/BUILD/wrapper_3.5.43_src/test [copy] Copying 1 file to /home/iurt/rpmbuild/BUILD/wrapper_3.5.43_src/test [copy] Copying 1 file to /home/iurt/rpmbuild/BUILD/wrapper_3.5.43_src/test [copy] Copying 1 file to /home/iurt/rpmbuild/BUILD/wrapper_3.5.43_src/test [copy] Copying 1 file to /home/iurt/rpmbuild/BUILD/wrapper_3.5.43_src/test [copy] Copying 1 file to /home/iurt/rpmbuild/BUILD/wrapper_3.5.43_src/test [copy] Copying 1 file to /home/iurt/rpmbuild/BUILD/wrapper_3.5.43_src/test [copy] Copying 1 file to /home/iurt/rpmbuild/BUILD/wrapper_3.5.43_src/test [copy] Copying 1 file to /home/iurt/rpmbuild/BUILD/wrapper_3.5.43_src/test [copy] Copying 1 file to /home/iurt/rpmbuild/BUILD/wrapper_3.5.43_src/test [copy] Copying 1 file to /home/iurt/rpmbuild/BUILD/wrapper_3.5.43_src/test [copy] Copying 1 file to /home/iurt/rpmbuild/BUILD/wrapper_3.5.43_src/test [copy] Copying 1 file to /home/iurt/rpmbuild/BUILD/wrapper_3.5.43_src/test [copy] Copying 1 file to /home/iurt/rpmbuild/BUILD/wrapper_3.5.43_src/test [copy] Copying 1 file to /home/iurt/rpmbuild/BUILD/wrapper_3.5.43_src/test [copy] Copying 1 file to /home/iurt/rpmbuild/BUILD/wrapper_3.5.43_src/test [copy] Copying 1 file to /home/iurt/rpmbuild/BUILD/wrapper_3.5.43_src/test [copy] Copying 1 file to /home/iurt/rpmbuild/BUILD/wrapper_3.5.43_src/test [copy] Copying 1 file to /home/iurt/rpmbuild/BUILD/wrapper_3.5.43_src/test [copy] Copying 1 file to /home/iurt/rpmbuild/BUILD/wrapper_3.5.43_src/test [copy] Copying 1 file to /home/iurt/rpmbuild/BUILD/wrapper_3.5.43_src/test [copy] Copying 1 file to /home/iurt/rpmbuild/BUILD/wrapper_3.5.43_src/test [copy] Copying 1 file to /home/iurt/rpmbuild/BUILD/wrapper_3.5.43_src/test [copy] Copying 1 file to /home/iurt/rpmbuild/BUILD/wrapper_3.5.43_src/test [copy] Copying 1 file to /home/iurt/rpmbuild/BUILD/wrapper_3.5.43_src/test [copy] Copying 1 file to /home/iurt/rpmbuild/BUILD/wrapper_3.5.43_src/test [copy] Copying 1 file to /home/iurt/rpmbuild/BUILD/wrapper_3.5.43_src/test [copy] Copying 1 file to /home/iurt/rpmbuild/BUILD/wrapper_3.5.43_src/test [copy] Copying 1 file to /home/iurt/rpmbuild/BUILD/wrapper_3.5.43_src/test [copy] Copying 1 file to /home/iurt/rpmbuild/BUILD/wrapper_3.5.43_src/test [copy] Copying 1 file to /home/iurt/rpmbuild/BUILD/wrapper_3.5.43_src/test [copy] Copying 1 file to /home/iurt/rpmbuild/BUILD/wrapper_3.5.43_src/test [copy] Copying 1 file to /home/iurt/rpmbuild/BUILD/wrapper_3.5.43_src/test [copy] Copying 1 file to /home/iurt/rpmbuild/BUILD/wrapper_3.5.43_src/test [copy] Copying 1 file to /home/iurt/rpmbuild/BUILD/wrapper_3.5.43_src/test [copy] Copying 1 file to /home/iurt/rpmbuild/BUILD/wrapper_3.5.43_src/test [copy] Copying 1 file to /home/iurt/rpmbuild/BUILD/wrapper_3.5.43_src/test [copy] Copying 1 file to /home/iurt/rpmbuild/BUILD/wrapper_3.5.43_src/test [copy] Copying 1 file to /home/iurt/rpmbuild/BUILD/wrapper_3.5.43_src/test [copy] Copying 1 file to /home/iurt/rpmbuild/BUILD/wrapper_3.5.43_src/test [copy] Copying 1 file to /home/iurt/rpmbuild/BUILD/wrapper_3.5.43_src/test [copy] Copying 1 file to /home/iurt/rpmbuild/BUILD/wrapper_3.5.43_src/test [copy] Copying 1 file to /home/iurt/rpmbuild/BUILD/wrapper_3.5.43_src/test [copy] Copying 1 file to /home/iurt/rpmbuild/BUILD/wrapper_3.5.43_src/test [copy] Copying 1 file to /home/iurt/rpmbuild/BUILD/wrapper_3.5.43_src/test [copy] Copying 1 file to /home/iurt/rpmbuild/BUILD/wrapper_3.5.43_src/test [copy] Copying 1 file to /home/iurt/rpmbuild/BUILD/wrapper_3.5.43_src/test [copy] Copying 1 file to /home/iurt/rpmbuild/BUILD/wrapper_3.5.43_src/test [copy] Copying 1 file to /home/iurt/rpmbuild/BUILD/wrapper_3.5.43_src/test [copy] Copying 1 file to /home/iurt/rpmbuild/BUILD/wrapper_3.5.43_src/test [copy] Copying 1 file to /home/iurt/rpmbuild/BUILD/wrapper_3.5.43_src/test [copy] Copying 1 file to /home/iurt/rpmbuild/BUILD/wrapper_3.5.43_src/test [copy] Copying 1 file to /home/iurt/rpmbuild/BUILD/wrapper_3.5.43_src/test [copy] Copying 1 file to /home/iurt/rpmbuild/BUILD/wrapper_3.5.43_src/test [copy] Copying 1 file to /home/iurt/rpmbuild/BUILD/wrapper_3.5.43_src/test [copy] Copying 1 file to /home/iurt/rpmbuild/BUILD/wrapper_3.5.43_src/test [copy] Copying 1 file to /home/iurt/rpmbuild/BUILD/wrapper_3.5.43_src/test [copy] Copying 1 file to /home/iurt/rpmbuild/BUILD/wrapper_3.5.43_src/test [copy] Copying 1 file to /home/iurt/rpmbuild/BUILD/wrapper_3.5.43_src/test [touch] Creating /home/iurt/rpmbuild/BUILD/wrapper_3.5.43_src/test/passthrough [copy] Copying 1 file to /home/iurt/rpmbuild/BUILD/wrapper_3.5.43_src/test [copy] Copying 1 file to /home/iurt/rpmbuild/BUILD/wrapper_3.5.43_src/test/common [touch] Creating /home/iurt/rpmbuild/BUILD/wrapper_3.5.43_src/test/resourcelimit_nofile.conf [copy] Copying 1 file to /home/iurt/rpmbuild/BUILD/wrapper_3.5.43_src/test [touch] Creating /home/iurt/rpmbuild/BUILD/wrapper_3.5.43_src/test/resourcelimit_data.conf [copy] Copying 1 file to /home/iurt/rpmbuild/BUILD/wrapper_3.5.43_src/test check-script-tests-setup-unix: script-tests-setup-unix: test-setup-unix: [delete] Deleting: /home/iurt/rpmbuild/BUILD/wrapper_3.5.43_src/test/temp.script.in [delete] Deleting: /home/iurt/rpmbuild/BUILD/wrapper_3.5.43_src/test/action.script.in test-setup: main: jdoc: [mkdir] Created dir: /home/iurt/rpmbuild/BUILD/wrapper_3.5.43_src/jdoc [javadoc] Generating Javadoc [javadoc] Javadoc execution [javadoc] Loading source files for package org.tanukisoftware.wrapper... [javadoc] Loading source files for package org.tanukisoftware.wrapper.demo... [javadoc] Loading source files for package org.tanukisoftware.wrapper.event... [javadoc] Loading source files for package org.tanukisoftware.wrapper.jmx... [javadoc] Loading source files for package org.tanukisoftware.wrapper.security... [javadoc] Loading source files for package org.tanukisoftware.wrapper.test2... [javadoc] Constructing Javadoc information... [javadoc] Standard Doclet version 11.0.10-ea [javadoc] Building tree for all the packages and classes... [javadoc] /home/iurt/rpmbuild/BUILD/wrapper_3.5.43_src/src/java/org/tanukisoftware/wrapper/security/WrapperPermission.java:20: error: attribute not supported in HTML5: cellpadding [javadoc] * [javadoc] ^ [javadoc] /home/iurt/rpmbuild/BUILD/wrapper_3.5.43_src/src/java/org/tanukisoftware/wrapper/security/WrapperServicePermission.java:51: error: attribute not supported in HTML5: cellspacing [javadoc] *
[javadoc] ^ [javadoc] /home/iurt/rpmbuild/BUILD/wrapper_3.5.43_src/src/java/org/tanukisoftware/wrapper/security/WrapperServicePermission.java:51: error: attribute not supported in HTML5: summary [javadoc] *
[javadoc] ^ [javadoc] /home/iurt/rpmbuild/BUILD/wrapper_3.5.43_src/src/java/org/tanukisoftware/wrapper/security/WrapperEventPermission.java:41: error: attribute not supported in HTML5: cellpadding [javadoc] *
[javadoc] ^ [javadoc] /home/iurt/rpmbuild/BUILD/wrapper_3.5.43_src/src/java/org/tanukisoftware/wrapper/security/WrapperEventPermission.java:41: error: attribute not supported in HTML5: cellspacing [javadoc] *
[javadoc] ^ [javadoc] /home/iurt/rpmbuild/BUILD/wrapper_3.5.43_src/src/java/org/tanukisoftware/wrapper/security/WrapperEventPermission.java:41: error: attribute not supported in HTML5: summary [javadoc] *
[javadoc] ^ [javadoc] /home/iurt/rpmbuild/BUILD/wrapper_3.5.43_src/src/java/org/tanukisoftware/wrapper/security/WrapperUserEventPermission.java:42: error: attribute not supported in HTML5: cellpadding [javadoc] *
[javadoc] ^ [javadoc] /home/iurt/rpmbuild/BUILD/wrapper_3.5.43_src/src/java/org/tanukisoftware/wrapper/security/WrapperUserEventPermission.java:42: error: attribute not supported in HTML5: cellspacing [javadoc] *
[javadoc] ^ [javadoc] /home/iurt/rpmbuild/BUILD/wrapper_3.5.43_src/src/java/org/tanukisoftware/wrapper/security/WrapperUserEventPermission.java:42: error: attribute not supported in HTML5: summary [javadoc] *
[javadoc] ^ [javadoc] /home/iurt/rpmbuild/BUILD/wrapper_3.5.43_src/src/java/org/tanukisoftware/wrapper/WrapperManager.java:1513: error: unknown tag: baseName [javadoc] * The format returned will be "---". [javadoc] ^ [javadoc] /home/iurt/rpmbuild/BUILD/wrapper_3.5.43_src/src/java/org/tanukisoftware/wrapper/WrapperManager.java:1513: error: unknown tag: os [javadoc] * The format returned will be "---". [javadoc] ^ [javadoc] /home/iurt/rpmbuild/BUILD/wrapper_3.5.43_src/src/java/org/tanukisoftware/wrapper/WrapperManager.java:1513: error: unknown tag: arch [javadoc] * The format returned will be "---". [javadoc] ^ [javadoc] /home/iurt/rpmbuild/BUILD/wrapper_3.5.43_src/src/java/org/tanukisoftware/wrapper/WrapperManager.java:1513: error: unknown tag: bits [javadoc] * The format returned will be "---". [javadoc] ^ [javadoc] Building index for all the packages and classes... [javadoc] Building index for all classes... [javadoc] Building index for all classes... [javadoc] Generating /home/iurt/rpmbuild/BUILD/wrapper_3.5.43_src/jdoc/help-doc.html... [javadoc] 15 errors BUILD SUCCESSFUL Total time: 1 minute 0 seconds + RPM_EC=0 ++ jobs -p + exit 0 Executing(%install): /bin/sh -e /home/iurt/rpmbuild/tmp/rpm-tmp.zEUmQf + umask 022 + cd /home/iurt/rpmbuild/BUILD + '[' 1 -eq 1 ']' + '[' /home/iurt/rpmbuild/BUILDROOT/tanukiwrapper-3.5.43-3.mga8.aarch64 '!=' / ']' + rm -rf /home/iurt/rpmbuild/BUILDROOT/tanukiwrapper-3.5.43-3.mga8.aarch64 ++ dirname /home/iurt/rpmbuild/BUILDROOT/tanukiwrapper-3.5.43-3.mga8.aarch64 + mkdir -p /home/iurt/rpmbuild/BUILDROOT + mkdir /home/iurt/rpmbuild/BUILDROOT/tanukiwrapper-3.5.43-3.mga8.aarch64 + cd wrapper_3.5.43_src + '[' 1 -eq 1 ']' + /usr/bin/python3 /usr/share/java-utils/mvn_artifact.py tanukiwrapper.pom lib/wrapper.jar + xmvn-install -R .xmvn-reactor -n tanukiwrapper -d /home/iurt/rpmbuild/BUILDROOT/tanukiwrapper-3.5.43-3.mga8.aarch64 [INFO] Installing artifact tanukisoft:wrapper:pom:3.5.43 [INFO] Installing artifact tanukisoft:wrapper:jar:3.5.43 [INFO] Installation successful + jdir=jdoc + /usr/bin/mkdir -p /home/iurt/rpmbuild/BUILDROOT/tanukiwrapper-3.5.43-3.mga8.aarch64/usr/share/licenses + '[' -d jdoc ']' + install -dm755 /home/iurt/rpmbuild/BUILDROOT/tanukiwrapper-3.5.43-3.mga8.aarch64/usr/share/javadoc/tanukiwrapper + cp -pr jdoc/allclasses-index.html jdoc/allclasses.html jdoc/allpackages-index.html jdoc/constant-values.html jdoc/deprecated-list.html jdoc/element-list jdoc/help-doc.html jdoc/index-all.html jdoc/index.html jdoc/jquery jdoc/member-search-index.js jdoc/member-search-index.zip jdoc/org jdoc/overview-summary.html jdoc/overview-tree.html jdoc/package-search-index.js jdoc/package-search-index.zip jdoc/resources jdoc/script.js jdoc/search.js jdoc/serialized-form.html jdoc/stylesheet.css jdoc/type-search-index.js jdoc/type-search-index.zip /home/iurt/rpmbuild/BUILDROOT/tanukiwrapper-3.5.43-3.mga8.aarch64/usr/share/javadoc/tanukiwrapper + echo /usr/share/javadoc/tanukiwrapper + mkdir -p /home/iurt/rpmbuild/BUILDROOT/tanukiwrapper-3.5.43-3.mga8.aarch64/usr/lib64 + install -pm 755 lib/libwrapper.so /home/iurt/rpmbuild/BUILDROOT/tanukiwrapper-3.5.43-3.mga8.aarch64/usr/lib64 + mkdir -p /home/iurt/rpmbuild/BUILDROOT/tanukiwrapper-3.5.43-3.mga8.aarch64/usr/sbin + install -pm 755 bin/wrapper /home/iurt/rpmbuild/BUILDROOT/tanukiwrapper-3.5.43-3.mga8.aarch64/usr/sbin/tanukiwrapper + /usr/lib/rpm/find-debuginfo.sh -j8 --strict-build-id -m -i --build-id-seed 3.5.43-3.mga8 --unique-debug-suffix -3.5.43-3.mga8.aarch64 --unique-debug-src-base tanukiwrapper-3.5.43-3.mga8.aarch64 --run-dwz --dwz-low-mem-die-limit 10000000 --dwz-max-die-limit 50000000 -S debugsourcefiles.list /home/iurt/rpmbuild/BUILD/wrapper_3.5.43_src explicitly decompress any DWARF compressed ELF sections in /home/iurt/rpmbuild/BUILDROOT/tanukiwrapper-3.5.43-3.mga8.aarch64/usr/lib64/libwrapper.so extracting debug info from /home/iurt/rpmbuild/BUILDROOT/tanukiwrapper-3.5.43-3.mga8.aarch64/usr/lib64/libwrapper.so explicitly decompress any DWARF compressed ELF sections in /home/iurt/rpmbuild/BUILDROOT/tanukiwrapper-3.5.43-3.mga8.aarch64/usr/sbin/tanukiwrapper extracting debug info from /home/iurt/rpmbuild/BUILDROOT/tanukiwrapper-3.5.43-3.mga8.aarch64/usr/sbin/tanukiwrapper original debug info size: 1024kB, size after compression: 960kB /usr/lib/rpm/sepdebugcrcfix: Updated 2 CRC32s, 0 CRC32s did match. 2695 blocks + /usr/lib/rpm/check-buildroot + '[' -n '' ']' + /usr/share/spec-helper/clean_files + '[' -n '' ']' + /usr/share/spec-helper/compress_files .xz + '[' -n '' ']' + /usr/share/spec-helper/relink_symlinks + '[' -n '' ']' + /usr/share/spec-helper/clean_perl + '[' -n '' ']' + /usr/share/spec-helper/lib_symlinks + '[' -n '' ']' + /usr/share/spec-helper/gprintify + '[' -n '' ']' + /usr/share/spec-helper/fix_mo + '[' -n '' ']' + /usr/share/spec-helper/fix_pamd + '[' -n '' ']' + /usr/share/spec-helper/remove_info_dir + '[' -n '' ']' + /usr/share/spec-helper/fix_eol + '[' -n '' ']' + /usr/share/spec-helper/check_desktop_files + '[' -n '' ']' + /usr/share/spec-helper/check_elf_files + /usr/lib/rpm/brp-python-bytecompile /usr/bin/python3 1 1 + /usr/lib/rpm/brp-python-hardlink + /usr/lib/rpm/redhat/brp-mangle-shebangs Processing files: tanukiwrapper-3.5.43-3.mga8.aarch64 Executing(%doc): /bin/sh -e /home/iurt/rpmbuild/tmp/rpm-tmp.cig82h + umask 022 + cd /home/iurt/rpmbuild/BUILD + cd wrapper_3.5.43_src + DOCDIR=/home/iurt/rpmbuild/BUILDROOT/tanukiwrapper-3.5.43-3.mga8.aarch64/usr/share/doc/tanukiwrapper + export LC_ALL=C + LC_ALL=C + export DOCDIR + /usr/bin/mkdir -p /home/iurt/rpmbuild/BUILDROOT/tanukiwrapper-3.5.43-3.mga8.aarch64/usr/share/doc/tanukiwrapper + cp -pr doc/wrapper-community-license-1.3.txt /home/iurt/rpmbuild/BUILDROOT/tanukiwrapper-3.5.43-3.mga8.aarch64/usr/share/doc/tanukiwrapper + cp -pr script.sh.sample wrapper.conf.sample /home/iurt/rpmbuild/BUILDROOT/tanukiwrapper-3.5.43-3.mga8.aarch64/usr/share/doc/tanukiwrapper + RPM_EC=0 ++ jobs -p + exit 0 [INFO maven.prov] input: ['/home/iurt/rpmbuild/BUILDROOT/tanukiwrapper-3.5.43-3.mga8.aarch64/usr/share/maven-metadata/tanukiwrapper.xml'] [INFO maven.prov] mvn(tanukisoft:wrapper:pom:) = 3.5.43, mvn(tanukisoft:wrapper) = 3.5.43 [INFO osgi.prov] input: ['/home/iurt/rpmbuild/BUILDROOT/tanukiwrapper-3.5.43-3.mga8.aarch64/usr/lib/java/tanukiwrapper.jar'] [INFO maven.req] input: ['/home/iurt/rpmbuild/BUILDROOT/tanukiwrapper-3.5.43-3.mga8.aarch64/usr/share/maven-metadata/tanukiwrapper.xml'] [INFO maven.req] java-headless, javapackages-filesystem [INFO osgi.req] input: ['/home/iurt/rpmbuild/BUILDROOT/tanukiwrapper-3.5.43-3.mga8.aarch64/usr/lib/java/tanukiwrapper.jar'] Provides: libwrapper.so()(64bit) mvn(tanukisoft:wrapper) = 3.5.43 mvn(tanukisoft:wrapper:pom:) = 3.5.43 tanukiwrapper = 3.5.43-3.mga8 tanukiwrapper(aarch-64) = 3.5.43-3.mga8 Requires(rpmlib): rpmlib(CompressedFileNames) <= 3.0.4-1 rpmlib(FileDigests) <= 4.6.0-1 rpmlib(PayloadFilesHavePrefix) <= 4.0-1 Requires: java-headless javapackages-filesystem ld-linux-aarch64.so.1()(64bit) ld-linux-aarch64.so.1(GLIBC_2.17)(64bit) libc.so.6()(64bit) libc.so.6(GLIBC_2.17)(64bit) libc.so.6(GLIBC_2.27)(64bit) libc.so.6(GLIBC_2.28)(64bit) libc.so.6(GLIBC_2.32)(64bit) libm.so.6()(64bit) libm.so.6(GLIBC_2.17)(64bit) libm.so.6(GLIBC_2.29)(64bit) libpthread.so.0()(64bit) libpthread.so.0(GLIBC_2.17)(64bit) Processing files: tanukiwrapper-javadoc-3.5.43-3.mga8.aarch64 pcregrep: line 13 of file /home/iurt/rpmbuild/BUILDROOT/tanukiwrapper-3.5.43-3.mga8.aarch64/usr/share/javadoc/tanukiwrapper/jquery/jszip/dist/jszip.min.js is too long for the internal buffer pcregrep: check the --buffer-size option pcregrep: line 13 of file /home/iurt/rpmbuild/BUILDROOT/tanukiwrapper-3.5.43-3.mga8.aarch64/usr/share/javadoc/tanukiwrapper/jquery/jszip/dist/jszip.min.js is too long for the internal buffer pcregrep: check the --buffer-size option Provides: tanukiwrapper-javadoc = 3.5.43-3.mga8 tanukiwrapper-javadoc(aarch-64) = 3.5.43-3.mga8 Requires(rpmlib): rpmlib(CompressedFileNames) <= 3.0.4-1 rpmlib(FileDigests) <= 4.6.0-1 rpmlib(PayloadFilesHavePrefix) <= 4.0-1 Requires: javapackages-filesystem Processing files: tanukiwrapper-manual-3.5.43-3.mga8.aarch64 Executing(%doc): /bin/sh -e /home/iurt/rpmbuild/tmp/rpm-tmp.g7eDaj + umask 022 + cd /home/iurt/rpmbuild/BUILD + cd wrapper_3.5.43_src + DOCDIR=/home/iurt/rpmbuild/BUILDROOT/tanukiwrapper-3.5.43-3.mga8.aarch64/usr/share/doc/tanukiwrapper-manual + export LC_ALL=C + LC_ALL=C + export DOCDIR + /usr/bin/mkdir -p /home/iurt/rpmbuild/BUILDROOT/tanukiwrapper-3.5.43-3.mga8.aarch64/usr/share/doc/tanukiwrapper-manual + cp -pr doc/index.html doc/revisions.txt doc/wrapper-community-license-1.3.txt /home/iurt/rpmbuild/BUILDROOT/tanukiwrapper-3.5.43-3.mga8.aarch64/usr/share/doc/tanukiwrapper-manual + RPM_EC=0 ++ jobs -p + exit 0 Provides: tanukiwrapper-manual = 3.5.43-3.mga8 tanukiwrapper-manual(aarch-64) = 3.5.43-3.mga8 Requires(rpmlib): rpmlib(CompressedFileNames) <= 3.0.4-1 rpmlib(FileDigests) <= 4.6.0-1 rpmlib(PayloadFilesHavePrefix) <= 4.0-1 Processing files: tanukiwrapper-debugsource-3.5.43-3.mga8.aarch64 Provides: tanukiwrapper-debugsource = 3.5.43-3.mga8 tanukiwrapper-debugsource(aarch-64) = 3.5.43-3.mga8 Requires(rpmlib): rpmlib(CompressedFileNames) <= 3.0.4-1 rpmlib(FileDigests) <= 4.6.0-1 rpmlib(PayloadFilesHavePrefix) <= 4.0-1 Processing files: tanukiwrapper-debuginfo-3.5.43-3.mga8.aarch64 Provides: debuginfo(build-id) = 2431a1596f21dc28aa08aec4a7345fa32aff3a7e debuginfo(build-id) = aa231b9a1d0e77edeacb694364f9cad5e52087b0 tanukiwrapper-debuginfo = 3.5.43-3.mga8 tanukiwrapper-debuginfo(aarch-64) = 3.5.43-3.mga8 Requires(rpmlib): rpmlib(CompressedFileNames) <= 3.0.4-1 rpmlib(FileDigests) <= 4.6.0-1 rpmlib(PayloadFilesHavePrefix) <= 4.0-1 Recommends: tanukiwrapper-debugsource(aarch-64) = 3.5.43-3.mga8 Checking for unpackaged file(s): /usr/lib/rpm/check-files /home/iurt/rpmbuild/BUILDROOT/tanukiwrapper-3.5.43-3.mga8.aarch64 Wrote: /home/iurt/rpmbuild/RPMS/aarch64/tanukiwrapper-manual-3.5.43-3.mga8.aarch64.rpm Wrote: /home/iurt/rpmbuild/RPMS/aarch64/tanukiwrapper-3.5.43-3.mga8.aarch64.rpm Wrote: /home/iurt/rpmbuild/RPMS/aarch64/tanukiwrapper-debuginfo-3.5.43-3.mga8.aarch64.rpm Wrote: /home/iurt/rpmbuild/RPMS/aarch64/tanukiwrapper-debugsource-3.5.43-3.mga8.aarch64.rpm Wrote: /home/iurt/rpmbuild/RPMS/aarch64/tanukiwrapper-javadoc-3.5.43-3.mga8.aarch64.rpm Executing(%clean): /bin/sh -e /home/iurt/rpmbuild/tmp/rpm-tmp.1hfPHi + umask 022 + cd /home/iurt/rpmbuild/BUILD + cd wrapper_3.5.43_src + /usr/bin/rm -rf /home/iurt/rpmbuild/BUILDROOT/tanukiwrapper-3.5.43-3.mga8.aarch64 + RPM_EC=0 ++ jobs -p + exit 0 Executing(--clean): /bin/sh -e /home/iurt/rpmbuild/tmp/rpm-tmp.zt2Ddg + umask 022 + cd /home/iurt/rpmbuild/BUILD + rm -rf wrapper_3.5.43_src + RPM_EC=0 ++ jobs -p + exit 0 D: [iurt_root_command] Success!