D: [iurt_root_command] chroot
Installing /home/iurt/rpmbuild/SRPMS/cglib-3.2.9-3.mga8.src.rpm
Building target platforms: aarch64
Building for target aarch64
Executing(%prep): /bin/sh -e /home/iurt/rpmbuild/tmp/rpm-tmp.rqwzQG
+ umask 022
+ cd /home/iurt/rpmbuild/BUILD
+ '[' 1 -eq 1 ']'
+ '[' 1 -eq 1 ']'
+ '[' 1 -eq 1 ']'
+ cd /home/iurt/rpmbuild/BUILD
+ rm -rf cglib-RELEASE_3_2_9
+ /usr/bin/gzip -dc /home/iurt/rpmbuild/SOURCES/RELEASE_3_2_9.tar.gz
+ /usr/bin/tar -xof -
+ STATUS=0
+ '[' 0 -ne 0 ']'
+ cd cglib-RELEASE_3_2_9
+ /usr/bin/chmod -Rf a+rX,u+w,g-w,o-w .
+ /usr/bin/python3 /usr/share/java-utils/pom_editor.py pom_remove_parent
+ /usr/bin/python3 /usr/share/java-utils/pom_editor.py pom_disable_module cglib-nodep
+ /usr/bin/python3 /usr/share/java-utils/pom_editor.py pom_disable_module cglib-integration-test
+ /usr/bin/python3 /usr/share/java-utils/pom_editor.py pom_disable_module cglib-jmh
+ /usr/bin/python3 /usr/share/java-utils/pom_editor.py pom_xpath_set pom:packaging bundle cglib
+ /usr/bin/python3 /usr/share/java-utils/pom_editor.py pom_xpath_inject pom:build/pom:plugins '
org.apache.felix
maven-bundle-plugin
1.4.0
true
net.sf.cglib.core
net.*
org.apache.tools.*;resolution:=optional,*
' cglib
+ /usr/bin/python3 /usr/share/java-utils/pom_editor.py pom_remove_plugin org.apache.maven.plugins:maven-gpg-plugin
+ /usr/bin/python3 /usr/share/java-utils/pom_editor.py pom_remove_plugin org.apache.maven.plugins:maven-jarsigner-plugin cglib-sample
+ /usr/bin/python3 /usr/share/java-utils/pom_editor.py pom_remove_plugin -r :maven-javadoc-plugin
+ /usr/bin/python3 /usr/share/java-utils/pom_editor.py pom_xpath_inject 'pom:dependency[pom:artifactId='\''ant'\'']' 'true' cglib
+ /usr/bin/python3 /usr/share/java-utils/mvn_alias.py :cglib net.sf.cglib:cglib cglib:cglib-full cglib:cglib-nodep org.sonatype.sisu.inject:cglib
+ RPM_EC=0
++ jobs -p
+ exit 0
Executing(%build): /bin/sh -e /home/iurt/rpmbuild/tmp/rpm-tmp.BQpujF
+ umask 022
+ cd /home/iurt/rpmbuild/BUILD
+ cd cglib-RELEASE_3_2_9
+ '[' 1 -eq 1 ']'
+ '[' 1 -eq 1 ']'
+ /usr/bin/python3 /usr/share/java-utils/mvn_build.py --xmvn-javadoc -- -Dmaven.test.failure.ignore=true -Dsource=1.8
Executing: xmvn --batch-mode --offline -Dmaven.test.failure.ignore=true -Dsource=1.8 verify org.fedoraproject.xmvn:xmvn-mojo:install org.fedoraproject.xmvn:xmvn-mojo:javadoc org.fedoraproject.xmvn:xmvn-mojo:builddep
['xmvn', '--batch-mode', '--offline', '-Dmaven.test.failure.ignore=true', '-Dsource=1.8', 'verify', 'org.fedoraproject.xmvn:xmvn-mojo:install', 'org.fedoraproject.xmvn:xmvn-mojo:javadoc', 'org.fedoraproject.xmvn:xmvn-mojo:builddep']
[INFO] Scanning for projects...
[INFO] ------------------------------------------------------------------------
[INFO] Reactor Build Order:
[INFO]
[INFO] Code Generation Library [pom]
[INFO] cglib [bundle]
[INFO] cglib-sample [jar]
[INFO]
[INFO] -------------------------< cglib:cglib-parent >-------------------------
[INFO] Building Code Generation Library 3.2.9 [1/3]
[INFO] --------------------------------[ pom ]---------------------------------
[INFO]
[INFO] ----------------------------< cglib:cglib >-----------------------------
[INFO] Building cglib 3.2.9 [2/3]
[INFO] -------------------------------[ bundle ]-------------------------------
[INFO]
[INFO] --- maven-resources-plugin:3.2.0:resources (default-resources) @ cglib ---
[INFO] Using 'UTF-8' encoding to copy filtered resources.
[INFO] Using 'UTF-8' encoding to copy filtered properties files.
[INFO] Copying 1 resource
[INFO] Copying 2 resources to META-INF
[INFO]
[INFO] --- maven-compiler-plugin:3.8.1:compile (default-compile) @ cglib ---
[INFO] Changes detected - recompiling the module!
[INFO] Compiling 130 source files to /home/iurt/rpmbuild/BUILD/cglib-RELEASE_3_2_9/cglib/target/classes
[INFO] /home/iurt/rpmbuild/BUILD/cglib-RELEASE_3_2_9/cglib/src/main/java/net/sf/cglib/core/CodeEmitter.java: Some input files use or override a deprecated API.
[INFO] /home/iurt/rpmbuild/BUILD/cglib-RELEASE_3_2_9/cglib/src/main/java/net/sf/cglib/core/CodeEmitter.java: Recompile with -Xlint:deprecation for details.
[INFO] /home/iurt/rpmbuild/BUILD/cglib-RELEASE_3_2_9/cglib/src/main/java/net/sf/cglib/proxy/CallbackInfo.java: Some input files use unchecked or unsafe operations.
[INFO] /home/iurt/rpmbuild/BUILD/cglib-RELEASE_3_2_9/cglib/src/main/java/net/sf/cglib/proxy/CallbackInfo.java: Recompile with -Xlint:unchecked for details.
[INFO]
[INFO] --- maven-resources-plugin:3.2.0:testResources (default-testResources) @ cglib ---
[INFO] Using 'UTF-8' encoding to copy filtered resources.
[INFO] Using 'UTF-8' encoding to copy filtered properties files.
[INFO] skip non existing resourceDirectory /home/iurt/rpmbuild/BUILD/cglib-RELEASE_3_2_9/cglib/src/test/resources
[INFO]
[INFO] --- maven-compiler-plugin:3.8.1:testCompile (default-testCompile) @ cglib ---
[INFO] Changes detected - recompiling the module!
[INFO] Compiling 73 source files to /home/iurt/rpmbuild/BUILD/cglib-RELEASE_3_2_9/cglib/target/test-classes
[INFO] /home/iurt/rpmbuild/BUILD/cglib-RELEASE_3_2_9/cglib/src/test/java/net/sf/cglib/beans/TestBeanMap.java: Some input files use or override a deprecated API.
[INFO] /home/iurt/rpmbuild/BUILD/cglib-RELEASE_3_2_9/cglib/src/test/java/net/sf/cglib/beans/TestBeanMap.java: Recompile with -Xlint:deprecation for details.
[INFO] /home/iurt/rpmbuild/BUILD/cglib-RELEASE_3_2_9/cglib/src/test/java/net/sf/cglib/transform/impl/TransformDemo.java: Some input files use unchecked or unsafe operations.
[INFO] /home/iurt/rpmbuild/BUILD/cglib-RELEASE_3_2_9/cglib/src/test/java/net/sf/cglib/transform/impl/TransformDemo.java: Recompile with -Xlint:unchecked for details.
[INFO]
[INFO] --- maven-surefire-plugin:2.22.0:test (default-test) @ cglib ---
[INFO]
[INFO] -------------------------------------------------------
[INFO] T E S T S
[INFO] -------------------------------------------------------
[INFO] Running net.sf.cglib.TestAll
-- listing properties --
awt.toolkit=sun.awt.X11.XToolkit
java.specification.version=11
sun.cpu.isalist=
sun.jnu.encoding=ANSI_X3.4-1968
java.class.path=/home/iurt/rpmbuild/BUILD/cglib-RELEA...
source=1.8
java.vm.vendor=Mageia
sun.arch.data.model=64
java.vendor.url=https://www.mageia.org/
user.timezone=
os.name=Linux
java.vm.specification.version=11
sun.java.launcher=SUN_STANDARD
user.country=US
sun.boot.library.path=/usr/lib/jvm/java-11-openjdk-11.0.10....
sun.java.command=/home/iurt/rpmbuild/BUILD/cglib-RELEA...
jdk.debug=release
surefire.test.class.path=/home/iurt/rpmbuild/BUILD/cglib-RELEA...
sun.cpu.endian=little
user.home=/home/iurt
user.language=en
java.specification.vendor=Oracle Corporation
java.version.date=2021-01-19
java.home=/usr/lib/jvm/java-11-openjdk-11.0.10....
file.separator=/
basedir=/home/iurt/rpmbuild/BUILD/cglib-RELEA...
java.vm.compressedOopsMode=Zero based
line.separator=
java.specification.name=Java Platform API Specification
java.vm.specification.vendor=Oracle Corporation
java.awt.graphicsenv=sun.awt.X11GraphicsEnvironment
surefire.real.class.path=/home/iurt/rpmbuild/BUILD/cglib-RELEA...
sun.management.compiler=HotSpot 64-Bit Tiered Compilers
java.runtime.version=11.0.10-ea+1-LTS
user.name=iurt
path.separator=:
os.version=5.7.19-server-3.mga7
java.runtime.name=OpenJDK Runtime Environment
file.encoding=ANSI_X3.4-1968
java.vm.name=OpenJDK 64-Bit Server VM
java.vendor.version=18.9
localRepository=/home/iurt/.m2/repository
java.vendor.url.bug=https://bugs.mageia.org/enter_bug.cgi
java.io.tmpdir=/tmp
net.sf.cglib.test.stressHashCodes=true
java.version=11.0.10-ea
user.dir=/home/iurt/rpmbuild/BUILD/cglib-RELEA...
os.arch=aarch64
java.vm.specification.name=Java Virtual Machine Specification
java.awt.printerjob=sun.print.PSPrinterJob
sun.os.patch.level=unknown
java.library.path=/usr/java/packages/lib:/lib:/usr/lib
java.vm.info=mixed mode, sharing
java.vendor=Mageia
java.vm.version=11.0.10-ea+1-LTS
sun.io.unicode.encoding=UnicodeLittle
java.class.version=55.0
maven.test.failure.ignore=true
[ERROR] Tests run: 1, Failures: 0, Errors: 1, Skipped: 0, Time elapsed: 0.333 s <<< FAILURE! - in net.sf.cglib.TestAll
[ERROR] initializationError(net.sf.cglib.TestAll) Time elapsed: 0.008 s <<< ERROR!
java.lang.IllegalAccessError: Update to static final field net.sf.cglib.transform.AbstractTransformTest.CGLIB$FIELD_NAMES attempted from a different method (CGLIB$STATICHOOK6) than the initializer method
at net.sf.cglib.TestAll.suite(TestAll.java:81)
[INFO] Running net.sf.cglib.beans.TestBulkBean
iteration count: 100000
net.sf.cglib.beans.TestBulkBean$BulkBeanReflectImpl:
136 ms. 0.00136 per iteration
net.sf.cglib.beans.MA$$BulkBeanByCGLIB$$0_5:
43 ms. 4.3E-4 per iteration
factor: 3.1627908
net.sf.cglib.beans.TestBulkBean$BulkBeanPlainImpl:
74 ms. 7.4E-4 per iteration
[INFO] Tests run: 7, Failures: 0, Errors: 0, Skipped: 0, Time elapsed: 0.325 s - in net.sf.cglib.beans.TestBulkBean
[INFO] Running net.sf.cglib.beans.TestBeanCopier
[INFO] Tests run: 3, Failures: 0, Errors: 0, Skipped: 0, Time elapsed: 0.111 s - in net.sf.cglib.beans.TestBeanCopier
[INFO] Running net.sf.cglib.beans.TestBeanMapProxy
[INFO] Tests run: 2, Failures: 0, Errors: 0, Skipped: 0, Time elapsed: 0.003 s - in net.sf.cglib.beans.TestBeanMapProxy
[INFO] Running net.sf.cglib.beans.TestImmutableBean
[INFO] Tests run: 1, Failures: 0, Errors: 0, Skipped: 0, Time elapsed: 0.001 s - in net.sf.cglib.beans.TestImmutableBean
[INFO] Running net.sf.cglib.beans.TestBeanMap
[INFO] Tests run: 6, Failures: 0, Errors: 0, Skipped: 0, Time elapsed: 0.038 s - in net.sf.cglib.beans.TestBeanMap
[INFO] Running net.sf.cglib.beans.TestBeanGenerator
[INFO] Tests run: 2, Failures: 0, Errors: 0, Skipped: 0, Time elapsed: 0.015 s - in net.sf.cglib.beans.TestBeanGenerator
[INFO] Running net.sf.cglib.util.TestXmlParsing
elseif: 355ms
intern: 183ms
switch: 208ms
[INFO] Tests run: 2, Failures: 0, Errors: 0, Skipped: 0, Time elapsed: 1.462 s - in net.sf.cglib.util.TestXmlParsing
[INFO] Running net.sf.cglib.util.TestParallelSorter
[INFO] Tests run: 2, Failures: 0, Errors: 0, Skipped: 0, Time elapsed: 0.006 s - in net.sf.cglib.util.TestParallelSorter
[INFO] Running net.sf.cglib.reflect.TestFastClass
hash=-306117863 size=2
types[0]=int
types[1]=int
[ERROR] Tests run: 12, Failures: 0, Errors: 1, Skipped: 0, Time elapsed: 0.119 s <<< FAILURE! - in net.sf.cglib.reflect.TestFastClass
[ERROR] testPackagePrivateMethod_bootstrapClassLoader(net.sf.cglib.reflect.TestFastClass) Time elapsed: 0.022 s <<< ERROR!
java.lang.NoSuchMethodException: java.lang.String.getChars([C, int)
at net.sf.cglib.reflect.TestFastClass.testPackagePrivateMethod_bootstrapClassLoader(TestFastClass.java:663)
[INFO] Running net.sf.cglib.reflect.TestReflectPerf
iteration count: 1000000
fc = 116
reflect+args = 114
reflect = 72
fm+args = 75
fm = 42
fc w/idx = 43
delegate = 21
raw = 18
[INFO] Tests run: 2, Failures: 0, Errors: 0, Skipped: 0, Time elapsed: 0.394 s - in net.sf.cglib.reflect.TestReflectPerf
[INFO] Running net.sf.cglib.reflect.TestDelegates
[INFO] Tests run: 10, Failures: 0, Errors: 0, Skipped: 0, Time elapsed: 0.032 s - in net.sf.cglib.reflect.TestDelegates
[INFO] Running net.sf.cglib.transform.impl.TestAddClassInit
[INFO] Tests run: 2, Failures: 0, Errors: 0, Skipped: 0, Time elapsed: 0.001 s - in net.sf.cglib.transform.impl.TestAddClassInit
[INFO] Running net.sf.cglib.transform.impl.TestInterceptFieldsSubclass
[INFO] Tests run: 2, Failures: 0, Errors: 0, Skipped: 0, Time elapsed: 0.014 s - in net.sf.cglib.transform.impl.TestInterceptFieldsSubclass
[INFO] Running net.sf.cglib.transform.impl.TestDemo
load : net.sf.cglib.transform.impl.TransformDemo
transforming net.sf.cglib.transform.impl.TransformDemo
load : net.sf.cglib.transform.impl.FieldProvider
load : net.sf.cglib.transform.impl.InterceptFieldEnabled
load : net.sf.cglib.transform.impl.PersistenceCapable
load : java.lang.Object
load : net.sf.cglib.transform.ClassTransformerFactory
load : net.sf.cglib.transform.ClassFilter
load : java.lang.Throwable
load : java.lang.IllegalArgumentException
load : net.sf.cglib.transform.impl.InterceptFieldCallback
load : java.lang.String
load : java.lang.Exception
load : java.lang.Class
load : java.lang.System
load : java.lang.invoke.StringConcatFactory
load : java.io.PrintStream
register class net.sf.cglib.transform.impl.TransformDemo
[ERROR] Tests run: 1, Failures: 0, Errors: 1, Skipped: 0, Time elapsed: 0.015 s <<< FAILURE! - in net.sf.cglib.transform.impl.TestDemo
[ERROR] test(net.sf.cglib.transform.impl.TestDemo) Time elapsed: 0.014 s <<< ERROR!
java.lang.IllegalAccessError: Update to static final field net.sf.cglib.transform.impl.TransformDemo.CGLIB$FIELD_NAMES attempted from a different method (CGLIB$STATICHOOK28) than the initializer method
at net.sf.cglib.transform.impl.TestDemo.test(TestDemo.java:19)
[INFO] Running net.sf.cglib.transform.impl.TestTransformingLoader
Loading net.sf.cglib.transform.impl.Example
Loading java.lang.Object
Loading java.lang.String
Loading net.sf.cglib.transform.impl.Example
Loading net.sf.cglib.transform.impl.InterceptFieldEnabled
Loading java.lang.Object
Loading net.sf.cglib.transform.impl.Example
Loading net.sf.cglib.transform.impl.FieldProvider
Loading java.lang.Object
Loading net.sf.cglib.transform.impl.Example
Loading java.lang.Object
Loading java.lang.Class
Loading net.sf.cglib.transform.impl.TestTransformingLoader
Loading net.sf.cglib.CodeGenTestCase
Loading junit.framework.TestCase
Loading net.sf.cglib.transform.ClassFilter
Loading junit.framework.Test
Loading net.sf.cglib.transform.ClassTransformer
Loading org.objectweb.asm.ClassVisitor
Loading net.sf.cglib.transform.impl.AddPropertyTransformer
Loading net.sf.cglib.transform.ClassEmitterTransformer
Loading net.sf.cglib.core.ClassEmitter
Loading net.sf.cglib.transform.ClassTransformerChain
Loading net.sf.cglib.transform.AbstractClassTransformer
Loading net.sf.cglib.transform.impl.AddStaticInitTransformer
Loading net.sf.cglib.transform.impl.InterceptFieldFilter
Loading net.sf.cglib.transform.impl.InterceptFieldTransformer
Loading net.sf.cglib.transform.impl.FieldProviderTransformer
Loading net.sf.cglib.transform.ClassTransformerFactory
Loading java.lang.System
Loading java.lang.invoke.StringConcatFactory
Loading java.io.PrintStream
INITING: class net.sf.cglib.CodeGenTestCase
INITING: class net.sf.cglib.transform.impl.TestTransformingLoader
Loading net.sf.cglib.transform.impl.TestTransformingLoader$1
INITING: class net.sf.cglib.transform.impl.TestTransformingLoader$1
INITING: class net.sf.cglib.transform.impl.Example
[INFO] Tests run: 5, Failures: 0, Errors: 0, Skipped: 0, Time elapsed: 0.076 s - in net.sf.cglib.transform.impl.TestTransformingLoader
[INFO] Running net.sf.cglib.transform.impl.TestAddDelegate
[INFO] Tests run: 1, Failures: 0, Errors: 0, Skipped: 0, Time elapsed: 0.006 s - in net.sf.cglib.transform.impl.TestAddDelegate
[INFO] Running net.sf.cglib.transform.impl.TestProvideFields
[ERROR] Tests run: 1, Failures: 0, Errors: 1, Skipped: 0, Time elapsed: 0.004 s <<< FAILURE! - in net.sf.cglib.transform.impl.TestProvideFields
[ERROR] initializationError(net.sf.cglib.transform.impl.TestProvideFields) Time elapsed: 0.001 s <<< ERROR!
java.lang.IllegalAccessError: Update to static final field net.sf.cglib.transform.AbstractTransformTest.CGLIB$FIELD_NAMES attempted from a different method (CGLIB$STATICHOOK47) than the initializer method
at net.sf.cglib.transform.impl.TestProvideFields.suite(TestProvideFields.java:69)
[INFO] Running net.sf.cglib.transform.impl.TestInterceptFields
[INFO] Tests run: 1, Failures: 0, Errors: 0, Skipped: 0, Time elapsed: 0.004 s - in net.sf.cglib.transform.impl.TestInterceptFields
[INFO] Running net.sf.cglib.core.TestKeyFactory
[INFO] Tests run: 10, Failures: 0, Errors: 0, Skipped: 0, Time elapsed: 0.035 s - in net.sf.cglib.core.TestKeyFactory
[INFO] Running net.sf.cglib.core.TestTinyBitSet
[INFO] Tests run: 4, Failures: 0, Errors: 0, Skipped: 0, Time elapsed: 0 s - in net.sf.cglib.core.TestTinyBitSet
[INFO] Running net.sf.cglib.core.AsmApiTest
[INFO] Tests run: 2, Failures: 0, Errors: 0, Skipped: 0, Time elapsed: 0.036 s - in net.sf.cglib.core.AsmApiTest
[INFO] Running net.sf.cglib.proxy.TestDispatcher
[INFO] Tests run: 2, Failures: 0, Errors: 0, Skipped: 0, Time elapsed: 0.001 s - in net.sf.cglib.proxy.TestDispatcher
[INFO] Running net.sf.cglib.proxy.TestInterfaceMaker
[INFO] Tests run: 3, Failures: 0, Errors: 0, Skipped: 0, Time elapsed: 0.001 s - in net.sf.cglib.proxy.TestInterfaceMaker
[INFO] Running net.sf.cglib.proxy.TestMixin
[INFO] Tests run: 9, Failures: 0, Errors: 0, Skipped: 0, Time elapsed: 0 s - in net.sf.cglib.proxy.TestMixin
[INFO] Running net.sf.cglib.proxy.TestProxyRefDispatcher
[INFO] Tests run: 2, Failures: 0, Errors: 0, Skipped: 0, Time elapsed: 0.001 s - in net.sf.cglib.proxy.TestProxyRefDispatcher
[INFO] Running net.sf.cglib.proxy.TestNoOp
[INFO] Tests run: 2, Failures: 0, Errors: 0, Skipped: 0, Time elapsed: 0 s - in net.sf.cglib.proxy.TestNoOp
[INFO] Running net.sf.cglib.proxy.TestEnhancer
public java.lang.String java.lang.Object.toString()
public native int java.lang.Object.hashCode()
public java.lang.String java.lang.Object.toString()
public native int java.lang.Object.hashCode()
public int net.sf.cglib.proxy.EA.compareTo(java.lang.Object)
public java.lang.String java.lang.Object.toString()
public native int java.lang.Object.hashCode()
public java.lang.String java.lang.ClassLoader.getName()
public java.lang.String java.lang.Object.toString()
public native int java.lang.Object.hashCode()
public java.lang.Object net.sf.cglib.proxy.TestEnhancer$TestCloneImpl.clone() throws java.lang.CloneNotSupportedException
public int net.sf.cglib.proxy.Source.intType(int)
public long net.sf.cglib.proxy.Source.longType(long)
public float net.sf.cglib.proxy.Source.floatType(float)
public double net.sf.cglib.proxy.Source.doubleType(double)
public java.lang.Object net.sf.cglib.proxy.Source.objectType(java.lang.Object)
public java.lang.String net.sf.cglib.proxy.Source.toString()
public int[] net.sf.cglib.proxy.Source.arrayType(int[])
public java.lang.String net.sf.cglib.proxy.ArgInit.toString()
public java.lang.String net.sf.cglib.proxy.ArgInit.toString()
public abstract void net.sf.cglib.proxy.TestEnhancer$AbstractMethodCallInConstructor.foo()
public abstract void net.sf.cglib.proxy.TestEnhancer$AbstractMethodCallInConstructor.foo()
public abstract int net.sf.cglib.proxy.TestEnhancer$ConflictA.foo()
public abstract java.lang.String net.sf.cglib.proxy.TestEnhancer$ConflictB.foo()
public void net.sf.cglib.proxy.Source.throwIndexOutOfBoundsException()
public void net.sf.cglib.proxy.Source.callAll()
protected void net.sf.cglib.proxy.Source.protectedMethod()
void net.sf.cglib.proxy.Source.packageMethod()
abstract void net.sf.cglib.proxy.Source.abstractMethod()
public synchronized void net.sf.cglib.proxy.Source.synchronizedMethod()
public int net.sf.cglib.proxy.Source.intType(int)
public long net.sf.cglib.proxy.Source.longType(long)
public float net.sf.cglib.proxy.Source.floatType(float)
public double net.sf.cglib.proxy.Source.doubleType(double)
public java.lang.Object net.sf.cglib.proxy.Source.objectType(java.lang.Object)
public void net.sf.cglib.proxy.Source.voidType()
public void net.sf.cglib.proxy.Source.multiArg(int,long,double,float,java.lang.Object,java.lang.Object,java.lang.Object)
public java.lang.String java.lang.Object.toString()
public native int java.lang.Object.hashCode()
public java.lang.String java.lang.Object.toString()
public native int java.lang.Object.hashCode()
public int net.sf.cglib.proxy.TestEnhancer$Signature.interceptor()
[ERROR] Tests run: 51, Failures: 0, Errors: 1, Skipped: 0, Time elapsed: 2.489 s <<< FAILURE! - in net.sf.cglib.proxy.TestEnhancer
[ERROR] testSql(net.sf.cglib.proxy.TestEnhancer) Time elapsed: 0.027 s <<< ERROR!
net.sf.cglib.core.CodeGenerationException: java.lang.reflect.InvocationTargetException-->null
at net.sf.cglib.proxy.TestEnhancer.testSql(TestEnhancer.java:819)
Caused by: java.lang.reflect.InvocationTargetException
at net.sf.cglib.proxy.TestEnhancer.testSql(TestEnhancer.java:819)
Caused by: java.lang.NoClassDefFoundError: net/sf/cglib/proxy/Factory
at net.sf.cglib.proxy.TestEnhancer.testSql(TestEnhancer.java:819)
Caused by: java.lang.ClassNotFoundException: net.sf.cglib.proxy.Factory
at net.sf.cglib.proxy.TestEnhancer.testSql(TestEnhancer.java:819)
[INFO] Running net.sf.cglib.proxy.TestProxy
exception: net.sf.cglib.proxy.UndeclaredThrowableException: java.lang.Exception-->test!
invoking public abstract java.lang.Object java.util.Map.get(java.lang.Object) on {test=test} with [Ljava.lang.Object;@7334aada
done: public abstract java.lang.Object java.util.Map.get(java.lang.Object) on {test=test} with [Ljava.lang.Object;@7334aada, result is test
hello
invoking public abstract java.lang.Object java.util.Map.get(java.lang.Object) on {test=test} with [Ljava.lang.Object;@67d48005
done: public abstract java.lang.Object java.util.Map.get(java.lang.Object) on {test=test} with [Ljava.lang.Object;@67d48005, result is test
[INFO] Tests run: 8, Failures: 0, Errors: 0, Skipped: 0, Time elapsed: 0.07 s - in net.sf.cglib.proxy.TestProxy
[INFO] Running net.sf.cglib.proxy.TestLazyLoader
loading object
[INFO] Tests run: 2, Failures: 0, Errors: 0, Skipped: 0, Time elapsed: 0.004 s - in net.sf.cglib.proxy.TestLazyLoader
[INFO]
[INFO] Results:
[INFO]
[ERROR] Errors:
[ERROR] TestAll.suite:81 ? IllegalAccess Update to static final field net.sf.cglib.tra...
[ERROR] TestEnhancer.testSql:819 ? CodeGeneration java.lang.reflect.InvocationTargetEx...
[ERROR] TestFastClass.testPackagePrivateMethod_bootstrapClassLoader:663 ? NoSuchMethod
[ERROR] TestDemo.test:19 ? IllegalAccess Update to static final field net.sf.cglib.tra...
[ERROR] TestProvideFields.suite:69->AbstractTransformTest.:-1->AbstractTransformTest.CGLIB$STATICHOOK47:-1 ? IllegalAccess
[INFO]
[ERROR] Tests run: 158, Failures: 0, Errors: 5, Skipped: 0
[INFO]
[ERROR] There are test failures.
Please refer to /home/iurt/rpmbuild/BUILD/cglib-RELEASE_3_2_9/cglib/target/surefire-reports for the individual test results.
Please refer to dump files (if any exist) [date]-jvmRun[N].dump, [date].dumpstream and [date]-jvmRun[N].dumpstream.
[INFO]
[INFO] --- maven-bundle-plugin:4.2.1:bundle (default-bundle) @ cglib ---
[INFO]
[INFO] -------------------------< cglib:cglib-sample >-------------------------
[INFO] Building cglib-sample 3.2.9 [3/3]
[INFO] --------------------------------[ jar ]---------------------------------
[INFO]
[INFO] --- maven-resources-plugin:3.2.0:resources (default-resources) @ cglib-sample ---
[INFO] Using 'UTF-8' encoding to copy filtered resources.
[INFO] Using 'UTF-8' encoding to copy filtered properties files.
[INFO] skip non existing resourceDirectory /home/iurt/rpmbuild/BUILD/cglib-RELEASE_3_2_9/cglib-sample/src/main/resources
[INFO] Copying 2 resources to META-INF
[INFO]
[INFO] --- maven-compiler-plugin:3.8.1:compile (default-compile) @ cglib-sample ---
[INFO] Changes detected - recompiling the module!
[INFO] Compiling 5 source files to /home/iurt/rpmbuild/BUILD/cglib-RELEASE_3_2_9/cglib-sample/target/classes
[INFO] /home/iurt/rpmbuild/BUILD/cglib-RELEASE_3_2_9/cglib-sample/src/main/java/net/sf/cglib/samples/Trace.java: /home/iurt/rpmbuild/BUILD/cglib-RELEASE_3_2_9/cglib-sample/src/main/java/net/sf/cglib/samples/Trace.java uses unchecked or unsafe operations.
[INFO] /home/iurt/rpmbuild/BUILD/cglib-RELEASE_3_2_9/cglib-sample/src/main/java/net/sf/cglib/samples/Trace.java: Recompile with -Xlint:unchecked for details.
[INFO]
[INFO] --- maven-resources-plugin:3.2.0:testResources (default-testResources) @ cglib-sample ---
[INFO] Using 'UTF-8' encoding to copy filtered resources.
[INFO] Using 'UTF-8' encoding to copy filtered properties files.
[INFO] skip non existing resourceDirectory /home/iurt/rpmbuild/BUILD/cglib-RELEASE_3_2_9/cglib-sample/src/test/resources
[INFO]
[INFO] --- maven-compiler-plugin:3.8.1:testCompile (default-testCompile) @ cglib-sample ---
[INFO] No sources to compile
[INFO]
[INFO] --- maven-surefire-plugin:2.22.0:test (default-test) @ cglib-sample ---
[INFO] No tests to run.
[INFO]
[INFO] --- maven-jar-plugin:3.2.0:jar (default-jar) @ cglib-sample ---
[INFO] Building jar: /home/iurt/rpmbuild/BUILD/cglib-RELEASE_3_2_9/cglib-sample/target/cglib-sample-3.2.9.jar
[INFO]
[INFO] -------------------------< cglib:cglib-parent >-------------------------
[INFO] Building Code Generation Library 3.2.9 [4/3]
[INFO] --------------------------------[ pom ]---------------------------------
[INFO]
[INFO] --- xmvn-mojo:3.1.0:install (default-cli) @ cglib-parent ---
[INFO]
[INFO] --- xmvn-mojo:3.1.0:javadoc (default-cli) @ cglib-parent ---
/home/iurt/rpmbuild/BUILD/cglib-RELEASE_3_2_9/cglib/src/main/java/net/sf/cglib/core/AbstractClassGenerator.java:218: warning - invalid usage of tag {@see DefaultGeneratorStrategy}
/home/iurt/rpmbuild/BUILD/cglib-RELEASE_3_2_9/cglib/src/main/java/net/sf/cglib/core/CodeEmitter.java:700: warning - invalid usage of tag >
/home/iurt/rpmbuild/BUILD/cglib-RELEASE_3_2_9/cglib/src/main/java/net/sf/cglib/core/CodeEmitter.java:729: warning - invalid usage of tag >
/home/iurt/rpmbuild/BUILD/cglib-RELEASE_3_2_9/cglib/src/main/java/net/sf/cglib/core/CodeEmitter.java:733: warning - @return tag cannot be used in method with void return type.
/home/iurt/rpmbuild/BUILD/cglib-RELEASE_3_2_9/cglib/src/main/java/net/sf/cglib/core/GeneratorStrategy.java:19: warning - invalid usage of tag <
/home/iurt/rpmbuild/BUILD/cglib-RELEASE_3_2_9/cglib/src/main/java/net/sf/cglib/transform/impl/UndeclaredThrowableStrategy.java:28: warning - Tag @link: reference not found: net.sf.cglib.Enhancer
/home/iurt/rpmbuild/BUILD/cglib-RELEASE_3_2_9/cglib/src/main/java/net/sf/cglib/proxy/BridgeMethodResolver.java:51: warning - invalid usage of tag &
/home/iurt/rpmbuild/BUILD/cglib-RELEASE_3_2_9/cglib/src/main/java/net/sf/cglib/proxy/BridgeMethodResolver.java:51: warning - invalid usage of tag &
/home/iurt/rpmbuild/BUILD/cglib-RELEASE_3_2_9/cglib/src/main/java/net/sf/cglib/proxy/InterfaceMaker.java:69: warning - @param argument "class" is not a parameter name.
/home/iurt/rpmbuild/BUILD/cglib-RELEASE_3_2_9/cglib/src/main/java/net/sf/cglib/proxy/InvocationHandler.java:31: warning - Tag @see: reference not found: java.lang.reflect.InvocationHandler#invoke(java.lang.Object, java.lang.reflect.Method, java.lang.Object)
/home/iurt/rpmbuild/BUILD/cglib-RELEASE_3_2_9/cglib/src/main/java/net/sf/cglib/reflect/FastClass.java:173: warning - Tag @see: reference not found: getIndex(name, Class[])
/home/iurt/rpmbuild/BUILD/cglib-RELEASE_3_2_9/cglib/src/main/java/net/sf/cglib/reflect/MethodDelegate.java:68: warning - invalid usage of tag <
/home/iurt/rpmbuild/BUILD/cglib-RELEASE_3_2_9/cglib/src/main/java/net/sf/cglib/transform/AbstractTransformTask.java:49: warning - invalid usage of tag >
/home/iurt/rpmbuild/BUILD/cglib-RELEASE_3_2_9/cglib/src/main/java/net/sf/cglib/util/ParallelSorter.java:63: warning - @param argument "loader" is not a parameter name.
/home/iurt/rpmbuild/BUILD/cglib-RELEASE_3_2_9/cglib/src/main/java/net/sf/cglib/util/ParallelSorter.java:134: warning - @param argument "lo" is not a parameter name.
/home/iurt/rpmbuild/BUILD/cglib-RELEASE_3_2_9/cglib/src/main/java/net/sf/cglib/util/ParallelSorter.java:135: warning - @param argument "hi" is not a parameter name.
/home/iurt/rpmbuild/BUILD/cglib-RELEASE_3_2_9/cglib/src/main/java/net/sf/cglib/util/StringSwitcher.java:25: warning - invalid usage of tag >
/home/iurt/rpmbuild/BUILD/cglib-RELEASE_3_2_9/cglib/src/main/java/net/sf/cglib/core/GeneratorStrategy.java:19: warning - invalid usage of tag <
/home/iurt/rpmbuild/BUILD/cglib-RELEASE_3_2_9/cglib/src/main/java/net/sf/cglib/transform/impl/UndeclaredThrowableStrategy.java:28: warning - Tag @link: reference not found: net.sf.cglib.Enhancer
/home/iurt/rpmbuild/BUILD/cglib-RELEASE_3_2_9/cglib/src/main/java/net/sf/cglib/util/StringSwitcher.java:25: warning - invalid usage of tag >
/home/iurt/rpmbuild/BUILD/cglib-RELEASE_3_2_9/cglib/src/main/java/net/sf/cglib/transform/impl/UndeclaredThrowableStrategy.java:28: warning - Tag @link: reference not found: net.sf.cglib.Enhancer
/home/iurt/rpmbuild/BUILD/cglib-RELEASE_3_2_9/cglib/src/main/java/net/sf/cglib/transform/impl/UndeclaredThrowableStrategy.java:28: warning - Tag @link: reference not found: net.sf.cglib.Enhancer
/home/iurt/rpmbuild/BUILD/cglib-RELEASE_3_2_9/cglib/src/main/java/net/sf/cglib/core/GeneratorStrategy.java:19: warning - invalid usage of tag <
/home/iurt/rpmbuild/BUILD/cglib-RELEASE_3_2_9/cglib/src/main/java/net/sf/cglib/core/GeneratorStrategy.java:19: warning - invalid usage of tag <
/home/iurt/rpmbuild/BUILD/cglib-RELEASE_3_2_9/cglib/src/main/java/net/sf/cglib/core/GeneratorStrategy.java:19: warning - invalid usage of tag <
/home/iurt/rpmbuild/BUILD/cglib-RELEASE_3_2_9/cglib/src/main/java/net/sf/cglib/util/StringSwitcher.java:25: warning - invalid usage of tag >
/home/iurt/rpmbuild/BUILD/cglib-RELEASE_3_2_9/cglib/src/main/java/net/sf/cglib/core/GeneratorStrategy.java:19: warning - invalid usage of tag <
/home/iurt/rpmbuild/BUILD/cglib-RELEASE_3_2_9/cglib/src/main/java/net/sf/cglib/proxy/BridgeMethodResolver.java:51: warning - invalid usage of tag &
/home/iurt/rpmbuild/BUILD/cglib-RELEASE_3_2_9/cglib/src/main/java/net/sf/cglib/util/StringSwitcher.java:25: warning - invalid usage of tag >
/home/iurt/rpmbuild/BUILD/cglib-RELEASE_3_2_9/cglib/src/main/java/net/sf/cglib/transform/impl/UndeclaredThrowableStrategy.java:28: warning - Tag @link: reference not found: net.sf.cglib.Enhancer
/home/iurt/rpmbuild/BUILD/cglib-RELEASE_3_2_9/cglib/src/main/java/net/sf/cglib/core/GeneratorStrategy.java:19: warning - invalid usage of tag <
/home/iurt/rpmbuild/BUILD/cglib-RELEASE_3_2_9/cglib/src/main/java/net/sf/cglib/util/StringSwitcher.java:25: warning - invalid usage of tag >
/home/iurt/rpmbuild/BUILD/cglib-RELEASE_3_2_9/cglib/src/main/java/net/sf/cglib/transform/impl/UndeclaredThrowableStrategy.java:28: warning - Tag @link: reference not found: net.sf.cglib.Enhancer
[INFO]
[INFO] --- xmvn-mojo:3.1.0:builddep (default-cli) @ cglib-parent ---
[INFO] ------------------------------------------------------------------------
[INFO] Reactor Summary for Code Generation Library 3.2.9:
[INFO]
[INFO] Code Generation Library ............................ SUCCESS [ 44.638 s]
[INFO] cglib .............................................. SUCCESS [ 24.204 s]
[INFO] cglib-sample ....................................... SUCCESS [ 2.933 s]
[INFO] ------------------------------------------------------------------------
[INFO] BUILD SUCCESS
[INFO] ------------------------------------------------------------------------
[INFO] Total time: 01:15 min
[INFO] Finished at: 2021-01-20T17:29:40Z
[INFO] ------------------------------------------------------------------------
-----BEGIN MAVEN BUILD DEPENDENCIES-----
H4sIAAAAAAACA6WRPQ+CMBCGd3/FyV5QZz6iTgxOxsS10qPWlCspFPXfC4oRlw463vu8uSeXi7Nb
paFD2yhDSbAMFwEgFUYokklw2LP1fpvnQZbO4jljsHFKCxBYI4m+prABiYSWtyjgdIfjriNgrG9P
O+kM4BPch7EPpDWuzkVqrAx5zYszhiVqdYujN3n1uG1VyYu2DyreIbGTI6GR1dpJRXE04YMn+hb5
vea6CnlTeZRP+o9iPI1T67MM9FfLxZHyLR+5b/1kGv71ABat7vcWAgAA
-----END MAVEN BUILD DEPENDENCIES-----
+ RPM_EC=0
++ jobs -p
+ exit 0
Executing(%install): /bin/sh -e /home/iurt/rpmbuild/tmp/rpm-tmp.eURUNE
+ umask 022
+ cd /home/iurt/rpmbuild/BUILD
+ '[' 1 -eq 1 ']'
+ '[' /home/iurt/rpmbuild/BUILDROOT/cglib-3.2.9-3.mga8.aarch64 '!=' / ']'
+ rm -rf /home/iurt/rpmbuild/BUILDROOT/cglib-3.2.9-3.mga8.aarch64
++ dirname /home/iurt/rpmbuild/BUILDROOT/cglib-3.2.9-3.mga8.aarch64
+ mkdir -p /home/iurt/rpmbuild/BUILDROOT
+ mkdir /home/iurt/rpmbuild/BUILDROOT/cglib-3.2.9-3.mga8.aarch64
+ cd cglib-RELEASE_3_2_9
+ '[' 1 -eq 1 ']'
+ xmvn-install -R .xmvn-reactor -n cglib -d /home/iurt/rpmbuild/BUILDROOT/cglib-3.2.9-3.mga8.aarch64
[INFO] Installing artifact cglib:cglib-parent:pom:3.2.9
[INFO] Installing artifact cglib:cglib:jar:3.2.9
[INFO] Installing artifact cglib:cglib:pom:3.2.9
[INFO] Installing artifact cglib:cglib-sample:jar:3.2.9
[INFO] Installing artifact cglib:cglib-sample:pom:3.2.9
[INFO] Installation successful
+ jdir=target/site/apidocs
+ '[' -d .xmvn/apidocs ']'
+ jdir=.xmvn/apidocs
+ /usr/bin/mkdir -p /home/iurt/rpmbuild/BUILDROOT/cglib-3.2.9-3.mga8.aarch64/usr/share/licenses
+ '[' -d .xmvn/apidocs ']'
+ install -dm755 /home/iurt/rpmbuild/BUILDROOT/cglib-3.2.9-3.mga8.aarch64/usr/share/javadoc/cglib
+ cp -pr .xmvn/apidocs/allclasses-index.html .xmvn/apidocs/allclasses.html .xmvn/apidocs/allpackages-index.html .xmvn/apidocs/args .xmvn/apidocs/constant-values.html .xmvn/apidocs/deprecated-list.html .xmvn/apidocs/element-list .xmvn/apidocs/help-doc.html .xmvn/apidocs/index-all.html .xmvn/apidocs/index.html .xmvn/apidocs/jquery .xmvn/apidocs/member-search-index.js .xmvn/apidocs/member-search-index.zip .xmvn/apidocs/net .xmvn/apidocs/overview-summary.html .xmvn/apidocs/overview-tree.html .xmvn/apidocs/package-search-index.js .xmvn/apidocs/package-search-index.zip .xmvn/apidocs/resources .xmvn/apidocs/script.js .xmvn/apidocs/search.js .xmvn/apidocs/serialized-form.html .xmvn/apidocs/stylesheet.css .xmvn/apidocs/type-search-index.js .xmvn/apidocs/type-search-index.zip /home/iurt/rpmbuild/BUILDROOT/cglib-3.2.9-3.mga8.aarch64/usr/share/javadoc/cglib
+ echo /usr/share/javadoc/cglib
+ /usr/lib/rpm/find-debuginfo.sh -j8 --strict-build-id -m -i --build-id-seed 3.2.9-3.mga8 --unique-debug-suffix -3.2.9-3.mga8.aarch64 --unique-debug-src-base cglib-3.2.9-3.mga8.aarch64 --run-dwz --dwz-low-mem-die-limit 10000000 --dwz-max-die-limit 50000000 -S debugsourcefiles.list /home/iurt/rpmbuild/BUILD/cglib-RELEASE_3_2_9
+ /usr/lib/rpm/check-buildroot
+ '[' -n '' ']'
+ /usr/share/spec-helper/clean_files
+ '[' -n '' ']'
+ /usr/share/spec-helper/compress_files .xz
+ '[' -n '' ']'
+ /usr/share/spec-helper/relink_symlinks
+ '[' -n '' ']'
+ /usr/share/spec-helper/clean_perl
+ '[' -n '' ']'
+ /usr/share/spec-helper/lib_symlinks
+ '[' -n '' ']'
+ /usr/share/spec-helper/gprintify
+ '[' -n '' ']'
+ /usr/share/spec-helper/fix_mo
+ '[' -n '' ']'
+ /usr/share/spec-helper/fix_pamd
+ '[' -n '' ']'
+ /usr/share/spec-helper/remove_info_dir
+ '[' -n '' ']'
+ /usr/share/spec-helper/fix_eol
+ '[' -n '' ']'
+ /usr/share/spec-helper/check_desktop_files
+ '[' -n '' ']'
+ /usr/share/spec-helper/check_elf_files
+ /usr/lib/rpm/brp-python-bytecompile /usr/bin/python3 1 1
+ /usr/lib/rpm/brp-python-hardlink
+ /usr/lib/rpm/redhat/brp-mangle-shebangs
Processing files: cglib-3.2.9-3.mga8.noarch
Executing(%license): /bin/sh -e /home/iurt/rpmbuild/tmp/rpm-tmp.15CVSF
+ umask 022
+ cd /home/iurt/rpmbuild/BUILD
+ cd cglib-RELEASE_3_2_9
+ LICENSEDIR=/home/iurt/rpmbuild/BUILDROOT/cglib-3.2.9-3.mga8.aarch64/usr/share/licenses/cglib
+ export LC_ALL=C
+ LC_ALL=C
+ export LICENSEDIR
+ /usr/bin/mkdir -p /home/iurt/rpmbuild/BUILDROOT/cglib-3.2.9-3.mga8.aarch64/usr/share/licenses/cglib
+ cp -pr LICENSE /home/iurt/rpmbuild/BUILDROOT/cglib-3.2.9-3.mga8.aarch64/usr/share/licenses/cglib
+ cp -pr NOTICE /home/iurt/rpmbuild/BUILDROOT/cglib-3.2.9-3.mga8.aarch64/usr/share/licenses/cglib
+ RPM_EC=0
++ jobs -p
+ exit 0
[INFO maven.prov] input: ['/home/iurt/rpmbuild/BUILDROOT/cglib-3.2.9-3.mga8.aarch64/usr/share/maven-metadata/cglib.xml']
[INFO maven.prov] mvn(cglib:cglib-sample) = 3.2.9, mvn(cglib:cglib-sample:pom:) = 3.2.9, mvn(cglib:cglib) = 3.2.9
mvn(net.sf.cglib:cglib) = 3.2.9
mvn(cglib:cglib-nodep) = 3.2.9
mvn(org.sonatype.sisu.inject:cglib) = 3.2.9
mvn(cglib:cglib-full) = 3.2.9, mvn(cglib:cglib-parent:pom:) = 3.2.9, mvn(cglib:cglib:pom:) = 3.2.9
mvn(net.sf.cglib:cglib:pom:) = 3.2.9
mvn(org.sonatype.sisu.inject:cglib:pom:) = 3.2.9
mvn(cglib:cglib-nodep:pom:) = 3.2.9
mvn(cglib:cglib-full:pom:) = 3.2.9
[INFO osgi.prov] input: ['/home/iurt/rpmbuild/BUILDROOT/cglib-3.2.9-3.mga8.aarch64/usr/share/java/cglib/cglib-sample.jar']
[INFO osgi.prov] input: ['/home/iurt/rpmbuild/BUILDROOT/cglib-3.2.9-3.mga8.aarch64/usr/share/java/cglib/cglib.jar']
[INFO osgi.prov] osgi(net.sf.cglib.core) = 3.2.9
[INFO maven.req] input: ['/home/iurt/rpmbuild/BUILDROOT/cglib-3.2.9-3.mga8.aarch64/usr/share/maven-metadata/cglib.xml']
[INFO maven.req] mvn(org.ow2.asm:asm), java-headless >= 1:1.6, javapackages-filesystem
[INFO osgi.req] input: ['/home/iurt/rpmbuild/BUILDROOT/cglib-3.2.9-3.mga8.aarch64/usr/share/java/cglib/cglib-sample.jar']
[INFO osgi.req] input: ['/home/iurt/rpmbuild/BUILDROOT/cglib-3.2.9-3.mga8.aarch64/usr/share/java/cglib/cglib.jar']
Provides: cglib = 3.2.9-3.mga8 mvn(cglib:cglib) = 3.2.9 mvn(cglib:cglib-full) = 3.2.9 mvn(cglib:cglib-full:pom:) = 3.2.9 mvn(cglib:cglib-nodep) = 3.2.9 mvn(cglib:cglib-nodep:pom:) = 3.2.9 mvn(cglib:cglib-parent:pom:) = 3.2.9 mvn(cglib:cglib-sample) = 3.2.9 mvn(cglib:cglib-sample:pom:) = 3.2.9 mvn(cglib:cglib:pom:) = 3.2.9 mvn(net.sf.cglib:cglib) = 3.2.9 mvn(net.sf.cglib:cglib:pom:) = 3.2.9 mvn(org.sonatype.sisu.inject:cglib) = 3.2.9 mvn(org.sonatype.sisu.inject:cglib:pom:) = 3.2.9 osgi(net.sf.cglib.core) = 3.2.9
Requires(rpmlib): rpmlib(CompressedFileNames) <= 3.0.4-1 rpmlib(FileDigests) <= 4.6.0-1 rpmlib(PayloadFilesHavePrefix) <= 4.0-1
Requires: java-headless >= 1:1.6 javapackages-filesystem mvn(org.ow2.asm:asm)
Processing files: cglib-javadoc-3.2.9-3.mga8.noarch
Executing(%license): /bin/sh -e /home/iurt/rpmbuild/tmp/rpm-tmp.MXTsBG
+ umask 022
+ cd /home/iurt/rpmbuild/BUILD
+ cd cglib-RELEASE_3_2_9
+ LICENSEDIR=/home/iurt/rpmbuild/BUILDROOT/cglib-3.2.9-3.mga8.aarch64/usr/share/licenses/cglib-javadoc
+ export LC_ALL=C
+ LC_ALL=C
+ export LICENSEDIR
+ /usr/bin/mkdir -p /home/iurt/rpmbuild/BUILDROOT/cglib-3.2.9-3.mga8.aarch64/usr/share/licenses/cglib-javadoc
+ cp -pr LICENSE /home/iurt/rpmbuild/BUILDROOT/cglib-3.2.9-3.mga8.aarch64/usr/share/licenses/cglib-javadoc
+ cp -pr NOTICE /home/iurt/rpmbuild/BUILDROOT/cglib-3.2.9-3.mga8.aarch64/usr/share/licenses/cglib-javadoc
+ RPM_EC=0
++ jobs -p
+ exit 0
pcregrep: line 13 of file /home/iurt/rpmbuild/BUILDROOT/cglib-3.2.9-3.mga8.aarch64/usr/share/javadoc/cglib/jquery/jszip/dist/jszip.min.js is too long for the internal buffer
pcregrep: check the --buffer-size option
pcregrep: line 13 of file /home/iurt/rpmbuild/BUILDROOT/cglib-3.2.9-3.mga8.aarch64/usr/share/javadoc/cglib/jquery/jszip/dist/jszip.min.js is too long for the internal buffer
pcregrep: check the --buffer-size option
pcregrep: line 1 of file /home/iurt/rpmbuild/BUILDROOT/cglib-3.2.9-3.mga8.aarch64/usr/share/javadoc/cglib/member-search-index.js is too long for the internal buffer
pcregrep: check the --buffer-size option
pcregrep: line 1 of file /home/iurt/rpmbuild/BUILDROOT/cglib-3.2.9-3.mga8.aarch64/usr/share/javadoc/cglib/member-search-index.js is too long for the internal buffer
pcregrep: check the --buffer-size option
Provides: cglib-javadoc = 3.2.9-3.mga8
Requires(rpmlib): rpmlib(CompressedFileNames) <= 3.0.4-1 rpmlib(FileDigests) <= 4.6.0-1 rpmlib(PayloadFilesHavePrefix) <= 4.0-1
Requires: javapackages-filesystem
Checking for unpackaged file(s): /usr/lib/rpm/check-files /home/iurt/rpmbuild/BUILDROOT/cglib-3.2.9-3.mga8.aarch64
Wrote: /home/iurt/rpmbuild/RPMS/noarch/cglib-3.2.9-3.mga8.noarch.rpm
Wrote: /home/iurt/rpmbuild/RPMS/noarch/cglib-javadoc-3.2.9-3.mga8.noarch.rpm
Executing(%clean): /bin/sh -e /home/iurt/rpmbuild/tmp/rpm-tmp.w6dZGG
+ umask 022
+ cd /home/iurt/rpmbuild/BUILD
+ cd cglib-RELEASE_3_2_9
+ /usr/bin/rm -rf /home/iurt/rpmbuild/BUILDROOT/cglib-3.2.9-3.mga8.aarch64
+ RPM_EC=0
++ jobs -p
+ exit 0
Executing(--clean): /bin/sh -e /home/iurt/rpmbuild/tmp/rpm-tmp.fEVNeF
+ umask 022
+ cd /home/iurt/rpmbuild/BUILD
+ rm -rf cglib-RELEASE_3_2_9
+ RPM_EC=0
++ jobs -p
+ exit 0
D: [iurt_root_command] Success!