D: [iurt_root_command] chroot Installing /home/iurt/rpmbuild/SRPMS/snifflib-1.9.0-11.mga8.src.rpm Building target platforms: aarch64 Building for target aarch64 Executing(%prep): /bin/sh -e /home/iurt/rpmbuild/tmp/rpm-tmp.kE2s59 + umask 022 + cd /home/iurt/rpmbuild/BUILD + '[' 1 -eq 1 ']' + '[' 1 -eq 1 ']' + '[' 1 -eq 1 ']' + cd /home/iurt/rpmbuild/BUILD + rm -rf snifflib-1.9.0 + /usr/bin/bzip2 -dc /home/iurt/rpmbuild/SOURCES/snifflib-1.9.0.tar.bz2 + /usr/bin/tar -xof - + STATUS=0 + '[' 0 -ne 0 ']' + cd snifflib-1.9.0 + /usr/bin/chmod -Rf a+rX,u+w,g-w,o-w . + echo 'Patch #0 (snifflib.classpath.patch):' Patch #0 (snifflib.classpath.patch): + /usr/bin/patch --no-backup-if-mismatch -p1 --fuzz=0 patching file basic_build.xml + echo 'Patch #1 (snifflib.myrtle-image-path.patch):' Patch #1 (snifflib.myrtle-image-path.patch): + /usr/bin/patch --no-backup-if-mismatch -p1 --fuzz=0 patching file src/com/mockturtlesolutions/snifflib/spreadsheets/workbench/ReservedFunctionBrowserFrame.java patching file src/com/mockturtlesolutions/snifflib/spreadsheets/workbench/ReservedFunctionFrame.java + build-jar-repository -s lib groovy mysql-connector-java + RPM_EC=0 ++ jobs -p + exit 0 Executing(%build): /bin/sh -e /home/iurt/rpmbuild/tmp/rpm-tmp.rd0zHb + umask 022 + cd /home/iurt/rpmbuild/BUILD + cd snifflib-1.9.0 + '[' 1 -eq 1 ']' + '[' 1 -eq 1 ']' + ant -buildfile basic_build.xml jarlib nonfatjarmyrtle buildapi Buildfile: /home/iurt/rpmbuild/BUILD/snifflib-1.9.0/basic_build.xml init: [mkdir] Created dir: /home/iurt/rpmbuild/BUILD/snifflib-1.9.0/build [mkdir] Created dir: /home/iurt/rpmbuild/BUILD/snifflib-1.9.0/snifflib_release/forupload/doc unhide: compile: [javac] Compiling 1208 source files to /home/iurt/rpmbuild/BUILD/snifflib-1.9.0/build [javac] warning: [options] bootstrap class path not set in conjunction with -source 1.5 [javac] warning: [options] source value 1.5 is obsolete and will be removed in a future release [javac] warning: [options] target value 1.5 is obsolete and will be removed in a future release [javac] warning: [options] To suppress warnings about obsolete options, use -Xlint:-options. [javac] /home/iurt/rpmbuild/BUILD/snifflib-1.9.0/src/com/mockturtlesolutions/snifflib/spreadsheets/DefaultSpreadsheetTable.java:4300: warning: [deprecation] plainTextFlavor in DataFlavor has been deprecated [javac] flav = DataFlavor.plainTextFlavor; [javac] ^ [javac] Note: Some input files use unchecked or unsafe operations. [javac] Note: Recompile with -Xlint:unchecked for details. [javac] 5 warnings [javac] Creating empty /home/iurt/rpmbuild/BUILD/snifflib-1.9.0/build/com/mockturtlesolutions/snifflib/functions/package-info.class [javac] Creating empty /home/iurt/rpmbuild/BUILD/snifflib-1.9.0/build/com/mockturtlesolutions/snifflib/timertools/graphical/package-info.class [javac] Creating empty /home/iurt/rpmbuild/BUILD/snifflib-1.9.0/build/com/mockturtlesolutions/snifflib/stats/package-info.class [javac] Creating empty /home/iurt/rpmbuild/BUILD/snifflib-1.9.0/build/com/mockturtlesolutions/snifflib/guitools/package-info.class [javac] Creating empty /home/iurt/rpmbuild/BUILD/snifflib-1.9.0/build/com/mockturtlesolutions/snifflib/invprobs/package-info.class [javac] Creating empty /home/iurt/rpmbuild/BUILD/snifflib-1.9.0/build/com/mockturtlesolutions/snifflib/semantics/package-info.class [javac] Creating empty /home/iurt/rpmbuild/BUILD/snifflib-1.9.0/build/com/mockturtlesolutions/snifflib/reposconfig/package-info.class [javac] Creating empty /home/iurt/rpmbuild/BUILD/snifflib-1.9.0/build/com/mockturtlesolutions/snifflib/mcmctools/package-info.class [javac] Creating empty /home/iurt/rpmbuild/BUILD/snifflib-1.9.0/build/com/mockturtlesolutions/snifflib/util/workbench/package-info.class [javac] Creating empty /home/iurt/rpmbuild/BUILD/snifflib-1.9.0/build/com/mockturtlesolutions/snifflib/mcmctools/workbench/package-info.class [javac] Creating empty /home/iurt/rpmbuild/BUILD/snifflib-1.9.0/build/com/mockturtlesolutions/snifflib/sqldig/package-info.class [javac] Creating empty /home/iurt/rpmbuild/BUILD/snifflib-1.9.0/build/com/mockturtlesolutions/snifflib/flatfiletools/database/package-info.class [javac] Creating empty /home/iurt/rpmbuild/BUILD/snifflib-1.9.0/build/com/mockturtlesolutions/snifflib/semantics/database/package-info.class [javac] Creating empty /home/iurt/rpmbuild/BUILD/snifflib-1.9.0/build/com/mockturtlesolutions/snifflib/vistools/workbench/package-info.class [javac] Creating empty /home/iurt/rpmbuild/BUILD/snifflib-1.9.0/build/com/mockturtlesolutions/snifflib/vistools/database/package-info.class [javac] Creating empty /home/iurt/rpmbuild/BUILD/snifflib-1.9.0/build/com/mockturtlesolutions/snifflib/graphics/package-info.class [javac] Creating empty /home/iurt/rpmbuild/BUILD/snifflib-1.9.0/build/com/mockturtlesolutions/snifflib/util/package-info.class [javac] Creating empty /home/iurt/rpmbuild/BUILD/snifflib-1.9.0/build/com/mockturtlesolutions/snifflib/semantics/workbench/package-info.class [javac] Creating empty /home/iurt/rpmbuild/BUILD/snifflib-1.9.0/build/com/mockturtlesolutions/snifflib/spreadsheets/package-info.class [javac] Creating empty /home/iurt/rpmbuild/BUILD/snifflib-1.9.0/build/com/mockturtlesolutions/snifflib/statmodeltools/workbench/package-info.class [javac] Creating empty /home/iurt/rpmbuild/BUILD/snifflib-1.9.0/build/com/mockturtlesolutions/snifflib/timertools/database/package-info.class [javac] Creating empty /home/iurt/rpmbuild/BUILD/snifflib-1.9.0/build/com/mockturtlesolutions/snifflib/groovytools/package-info.class [javac] Creating empty /home/iurt/rpmbuild/BUILD/snifflib-1.9.0/build/com/mockturtlesolutions/snifflib/spreadsheets/database/package-info.class [javac] Creating empty /home/iurt/rpmbuild/BUILD/snifflib-1.9.0/build/com/mockturtlesolutions/snifflib/pde/package-info.class [javac] Creating empty /home/iurt/rpmbuild/BUILD/snifflib-1.9.0/build/com/mockturtlesolutions/snifflib/xppauttools/workbench/package-info.class [javac] Creating empty /home/iurt/rpmbuild/BUILD/snifflib-1.9.0/build/com/mockturtlesolutions/snifflib/flatfiletools/package-info.class [javac] Creating empty /home/iurt/rpmbuild/BUILD/snifflib-1.9.0/build/com/mockturtlesolutions/snifflib/util/database/package-info.class [javac] Creating empty /home/iurt/rpmbuild/BUILD/snifflib-1.9.0/build/com/mockturtlesolutions/snifflib/linalg/package-info.class [javac] Creating empty /home/iurt/rpmbuild/BUILD/snifflib-1.9.0/build/com/mockturtlesolutions/snifflib/integration/package-info.class [javac] Creating empty /home/iurt/rpmbuild/BUILD/snifflib-1.9.0/build/com/mockturtlesolutions/snifflib/statmodeltools/package-info.class [javac] Creating empty /home/iurt/rpmbuild/BUILD/snifflib-1.9.0/build/com/mockturtlesolutions/snifflib/reposconfig/database/package-info.class [javac] Creating empty /home/iurt/rpmbuild/BUILD/snifflib-1.9.0/build/com/mockturtlesolutions/snifflib/datatypes/workbench/package-info.class [javac] Creating empty /home/iurt/rpmbuild/BUILD/snifflib-1.9.0/build/com/mockturtlesolutions/snifflib/sqldig/database/package-info.class [javac] Creating empty /home/iurt/rpmbuild/BUILD/snifflib-1.9.0/build/com/mockturtlesolutions/snifflib/extensions/package-info.class [javac] Creating empty /home/iurt/rpmbuild/BUILD/snifflib-1.9.0/build/com/mockturtlesolutions/snifflib/functions/transcendental/package-info.class [javac] Creating empty /home/iurt/rpmbuild/BUILD/snifflib-1.9.0/build/com/mockturtlesolutions/snifflib/statmodeltools/database/package-info.class [javac] Creating empty /home/iurt/rpmbuild/BUILD/snifflib-1.9.0/build/com/mockturtlesolutions/snifflib/groovytools/workbench/package-info.class [javac] Creating empty /home/iurt/rpmbuild/BUILD/snifflib-1.9.0/build/com/mockturtlesolutions/snifflib/testfun/package-info.class [javac] Creating empty /home/iurt/rpmbuild/BUILD/snifflib-1.9.0/build/com/mockturtlesolutions/snifflib/xppauttools/database/package-info.class [javac] Creating empty /home/iurt/rpmbuild/BUILD/snifflib-1.9.0/build/com/mockturtlesolutions/snifflib/audio/package-info.class [javac] Creating empty /home/iurt/rpmbuild/BUILD/snifflib-1.9.0/build/com/mockturtlesolutions/snifflib/reposconfig/management/package-info.class [javac] Creating empty /home/iurt/rpmbuild/BUILD/snifflib-1.9.0/build/com/mockturtlesolutions/snifflib/flatfiletools/workbench/package-info.class [javac] Creating empty /home/iurt/rpmbuild/BUILD/snifflib-1.9.0/build/com/mockturtlesolutions/snifflib/reposconfig/graphical/package-info.class [javac] Creating empty /home/iurt/rpmbuild/BUILD/snifflib-1.9.0/build/com/mockturtlesolutions/snifflib/spreadsheets/workbench/package-info.class [javac] Creating empty /home/iurt/rpmbuild/BUILD/snifflib-1.9.0/build/com/mockturtlesolutions/snifflib/guitools/components/package-info.class [javac] Creating empty /home/iurt/rpmbuild/BUILD/snifflib-1.9.0/build/com/mockturtlesolutions/snifflib/timertools/package-info.class [javac] Creating empty /home/iurt/rpmbuild/BUILD/snifflib-1.9.0/build/com/mockturtlesolutions/snifflib/xppauttools/package-info.class [javac] Creating empty /home/iurt/rpmbuild/BUILD/snifflib-1.9.0/build/com/mockturtlesolutions/snifflib/datatypes/database/package-info.class [javac] Creating empty /home/iurt/rpmbuild/BUILD/snifflib-1.9.0/build/com/mockturtlesolutions/snifflib/mcmctools/database/package-info.class [javac] Creating empty /home/iurt/rpmbuild/BUILD/snifflib-1.9.0/build/com/mockturtlesolutions/snifflib/datatypes/package-info.class [javac] Creating empty /home/iurt/rpmbuild/BUILD/snifflib-1.9.0/build/com/mockturtlesolutions/snifflib/groovytools/database/package-info.class [javac] Creating empty /home/iurt/rpmbuild/BUILD/snifflib-1.9.0/build/com/mockturtlesolutions/snifflib/vistools/package-info.class [javac] Creating empty /home/iurt/rpmbuild/BUILD/snifflib-1.9.0/build/com/mockturtlesolutions/snifflib/schemadig/package-info.class jarlib: [copy] Copying 173 files to /home/iurt/rpmbuild/BUILD/snifflib-1.9.0/build [copy] Copying 5 files to /home/iurt/rpmbuild/BUILD/snifflib-1.9.0/build [copy] Copying 17 files to /home/iurt/rpmbuild/BUILD/snifflib-1.9.0/build [copy] Copying 2 files to /home/iurt/rpmbuild/BUILD/snifflib-1.9.0/build [copy] Copied 1 empty directory to 1 empty directory under /home/iurt/rpmbuild/BUILD/snifflib-1.9.0/build [jar] Building jar: /home/iurt/rpmbuild/BUILD/snifflib-1.9.0/snifflib_release/snifflib-0.0.0.jar init: unhide: compile: [javac] Compiling 19 source files to /home/iurt/rpmbuild/BUILD/snifflib-1.9.0/build [javac] warning: [options] bootstrap class path not set in conjunction with -source 1.5 [javac] warning: [options] source value 1.5 is obsolete and will be removed in a future release [javac] warning: [options] target value 1.5 is obsolete and will be removed in a future release [javac] warning: [options] To suppress warnings about obsolete options, use -Xlint:-options. [javac] Note: Some input files use unchecked or unsafe operations. [javac] Note: Recompile with -Xlint:unchecked for details. [javac] 4 warnings nonfatjarmyrtle: [jar] Building jar: /home/iurt/rpmbuild/BUILD/snifflib-1.9.0/snifflib_release/Myrtle-0.0.0.jar init: unhide: compile: [javac] Compiling 19 source files to /home/iurt/rpmbuild/BUILD/snifflib-1.9.0/build [javac] warning: [options] bootstrap class path not set in conjunction with -source 1.5 [javac] warning: [options] source value 1.5 is obsolete and will be removed in a future release [javac] warning: [options] target value 1.5 is obsolete and will be removed in a future release [javac] warning: [options] To suppress warnings about obsolete options, use -Xlint:-options. [javac] Note: Some input files use unchecked or unsafe operations. [javac] Note: Recompile with -Xlint:unchecked for details. [javac] 4 warnings jarlib: [jar] Building jar: /home/iurt/rpmbuild/BUILD/snifflib-1.9.0/snifflib_release/snifflib-0.0.0.jar buildapi: [javadoc] Generating Javadoc [javadoc] Javadoc execution [javadoc] Loading source files for package com.mockturtlesolutions.snifflib.audio... [javadoc] Loading source files for package com.mockturtlesolutions.snifflib.datatypes... [javadoc] Loading source files for package com.mockturtlesolutions.snifflib.datatypes.database... [javadoc] Loading source files for package com.mockturtlesolutions.snifflib.datatypes.workbench... [javadoc] Loading source files for package com.mockturtlesolutions.snifflib.extensions... [javadoc] Loading source files for package com.mockturtlesolutions.snifflib.flatfiletools... [javadoc] Loading source files for package com.mockturtlesolutions.snifflib.flatfiletools.database... [javadoc] Loading source files for package com.mockturtlesolutions.snifflib.flatfiletools.workbench... [javadoc] Loading source files for package com.mockturtlesolutions.snifflib.functions... [javadoc] Loading source files for package com.mockturtlesolutions.snifflib.functions.transcendental... [javadoc] Loading source files for package com.mockturtlesolutions.snifflib.graphics... [javadoc] Loading source files for package com.mockturtlesolutions.snifflib.groovytools... [javadoc] Loading source files for package com.mockturtlesolutions.snifflib.groovytools.database... [javadoc] Loading source files for package com.mockturtlesolutions.snifflib.groovytools.workbench... [javadoc] Loading source files for package com.mockturtlesolutions.snifflib.guitools... [javadoc] Loading source files for package com.mockturtlesolutions.snifflib.guitools.components... [javadoc] Loading source files for package com.mockturtlesolutions.snifflib.integration... [javadoc] Loading source files for package com.mockturtlesolutions.snifflib.invprobs... [javadoc] Loading source files for package com.mockturtlesolutions.snifflib.linalg... [javadoc] Loading source files for package com.mockturtlesolutions.snifflib.mcmctools... [javadoc] Loading source files for package com.mockturtlesolutions.snifflib.mcmctools.database... [javadoc] Loading source files for package com.mockturtlesolutions.snifflib.mcmctools.database.wedgescripts... [javadoc] Loading source files for package com.mockturtlesolutions.snifflib.mcmctools.workbench... [javadoc] Loading source files for package com.mockturtlesolutions.snifflib.pde... [javadoc] Loading source files for package com.mockturtlesolutions.snifflib.reposconfig... [javadoc] Loading source files for package com.mockturtlesolutions.snifflib.reposconfig.database... [javadoc] Loading source files for package com.mockturtlesolutions.snifflib.reposconfig.graphical... [javadoc] Loading source files for package com.mockturtlesolutions.snifflib.reposconfig.management... [javadoc] Loading source files for package com.mockturtlesolutions.snifflib.schemadig... [javadoc] Loading source files for package com.mockturtlesolutions.snifflib.semantics... [javadoc] Loading source files for package com.mockturtlesolutions.snifflib.semantics.database... [javadoc] Loading source files for package com.mockturtlesolutions.snifflib.semantics.workbench... [javadoc] Loading source files for package com.mockturtlesolutions.snifflib.spreadsheets... [javadoc] Loading source files for package com.mockturtlesolutions.snifflib.spreadsheets.database... [javadoc] Loading source files for package com.mockturtlesolutions.snifflib.spreadsheets.workbench... [javadoc] Loading source files for package com.mockturtlesolutions.snifflib.sqldig... [javadoc] Loading source files for package com.mockturtlesolutions.snifflib.sqldig.database... [javadoc] Loading source files for package com.mockturtlesolutions.snifflib.statmodeltools... [javadoc] Loading source files for package com.mockturtlesolutions.snifflib.statmodeltools.database... [javadoc] Loading source files for package com.mockturtlesolutions.snifflib.statmodeltools.workbench... [javadoc] Loading source files for package com.mockturtlesolutions.snifflib.stats... [javadoc] Loading source files for package com.mockturtlesolutions.snifflib.testfun... [javadoc] Loading source files for package com.mockturtlesolutions.snifflib.timertools... [javadoc] Loading source files for package com.mockturtlesolutions.snifflib.timertools.database... [javadoc] Loading source files for package com.mockturtlesolutions.snifflib.timertools.graphical... [javadoc] Loading source files for package com.mockturtlesolutions.snifflib.util... [javadoc] Loading source files for package com.mockturtlesolutions.snifflib.util.database... [javadoc] Loading source files for package com.mockturtlesolutions.snifflib.util.workbench... [javadoc] Loading source files for package com.mockturtlesolutions.snifflib.vistools... [javadoc] Loading source files for package com.mockturtlesolutions.snifflib.vistools.database... [javadoc] Loading source files for package com.mockturtlesolutions.snifflib.vistools.workbench... [javadoc] Loading source files for package com.mockturtlesolutions.snifflib.xppauttools... [javadoc] Loading source files for package com.mockturtlesolutions.snifflib.xppauttools.database... [javadoc] Loading source files for package com.mockturtlesolutions.snifflib.xppauttools.workbench... [javadoc] Constructing Javadoc information... [javadoc] javadoc: warning - Multiple sources of package comments found for package "com.mockturtlesolutions.snifflib.invprobs" [javadoc] javadoc: warning - No source files for package com.mockturtlesolutions.snifflib.mcmctools.database.wedgescripts [javadoc] Creating destination directory: "/home/iurt/rpmbuild/BUILD/snifflib-1.9.0/snifflib_release/forupload/doc/api/" [javadoc] Standard Doclet version 1.8.0_242 [javadoc] Building tree for all the packages and classes... [javadoc] /home/iurt/rpmbuild/BUILD/snifflib-1.9.0/src/com/mockturtlesolutions/snifflib/datatypes/BinaryTree.java:28: error: bad use of '>' [javadoc] "InOrder" (LeftNode->Data->RightNode) [javadoc] ^ [javadoc] /home/iurt/rpmbuild/BUILD/snifflib-1.9.0/src/com/mockturtlesolutions/snifflib/datatypes/BinaryTree.java:28: error: bad use of '>' [javadoc] "InOrder" (LeftNode->Data->RightNode) [javadoc] ^ [javadoc] /home/iurt/rpmbuild/BUILD/snifflib-1.9.0/src/com/mockturtlesolutions/snifflib/datatypes/BinaryTree.java:29: error: bad use of '>' [javadoc] "PreOrder" (Data->LeftNode->RightNode) [javadoc] ^ [javadoc] /home/iurt/rpmbuild/BUILD/snifflib-1.9.0/src/com/mockturtlesolutions/snifflib/datatypes/BinaryTree.java:29: error: bad use of '>' [javadoc] "PreOrder" (Data->LeftNode->RightNode) [javadoc] ^ [javadoc] /home/iurt/rpmbuild/BUILD/snifflib-1.9.0/src/com/mockturtlesolutions/snifflib/datatypes/BinaryTree.java:30: error: bad use of '>' [javadoc] "PostOrder" (LeftNode->RightNode->Data) [javadoc] ^ [javadoc] /home/iurt/rpmbuild/BUILD/snifflib-1.9.0/src/com/mockturtlesolutions/snifflib/datatypes/BinaryTree.java:30: error: bad use of '>' [javadoc] "PostOrder" (LeftNode->RightNode->Data) [javadoc] ^ [javadoc] /home/iurt/rpmbuild/BUILD/snifflib-1.9.0/src/com/mockturtlesolutions/snifflib/datatypes/DataSet.java:132: warning: no @param for row [javadoc] public void addRow(int row) [javadoc] ^ [javadoc] /home/iurt/rpmbuild/BUILD/snifflib-1.9.0/src/com/mockturtlesolutions/snifflib/datatypes/DataSet.java:174: warning: no @param for row [javadoc] public void addRows(int row,int n) [javadoc] ^ [javadoc] /home/iurt/rpmbuild/BUILD/snifflib-1.9.0/src/com/mockturtlesolutions/snifflib/datatypes/DataSet.java:174: warning: no @param for n [javadoc] public void addRows(int row,int n) [javadoc] ^ [javadoc] /home/iurt/rpmbuild/BUILD/snifflib-1.9.0/src/com/mockturtlesolutions/snifflib/datatypes/DataSet.java:185: warning: no @param for row [javadoc] public void removeRow(int row) [javadoc] ^ [javadoc] /home/iurt/rpmbuild/BUILD/snifflib-1.9.0/src/com/mockturtlesolutions/snifflib/datatypes/DataSet.java:342: warning: no @param for name [javadoc] public void addColumn(String name,Class c) [javadoc] ^ [javadoc] /home/iurt/rpmbuild/BUILD/snifflib-1.9.0/src/com/mockturtlesolutions/snifflib/datatypes/DataSet.java:342: warning: no @param for c [javadoc] public void addColumn(String name,Class c) [javadoc] ^ [javadoc] /home/iurt/rpmbuild/BUILD/snifflib-1.9.0/src/com/mockturtlesolutions/snifflib/datatypes/DataSet.java:366: warning: no @param for col [javadoc] public void addColumn(int col,String name,Class c) [javadoc] ^ [javadoc] /home/iurt/rpmbuild/BUILD/snifflib-1.9.0/src/com/mockturtlesolutions/snifflib/datatypes/DataSet.java:366: warning: no @param for name [javadoc] public void addColumn(int col,String name,Class c) [javadoc] ^ [javadoc] /home/iurt/rpmbuild/BUILD/snifflib-1.9.0/src/com/mockturtlesolutions/snifflib/datatypes/DataSet.java:366: warning: no @param for c [javadoc] public void addColumn(int col,String name,Class c) [javadoc] ^ [javadoc] /home/iurt/rpmbuild/BUILD/snifflib-1.9.0/src/com/mockturtlesolutions/snifflib/datatypes/DataSet.java:389: warning: no @param for c [javadoc] public void removeColumn(int c) [javadoc] ^ [javadoc] /home/iurt/rpmbuild/BUILD/snifflib-1.9.0/src/com/mockturtlesolutions/snifflib/datatypes/DataSet.java:713: warning: no @param for newheaders [javadoc] public DataSet vars(String[] newheaders) [javadoc] ^ [javadoc] /home/iurt/rpmbuild/BUILD/snifflib-1.9.0/src/com/mockturtlesolutions/snifflib/datatypes/DataSet.java:713: warning: no @return [javadoc] public DataSet vars(String[] newheaders) [javadoc] ^ [javadoc] /home/iurt/rpmbuild/BUILD/snifflib-1.9.0/src/com/mockturtlesolutions/snifflib/datatypes/DataSet.java:744: warning: no @param for vars [javadoc] public DataSet classMatrix(String[] vars) [javadoc] ^ [javadoc] /home/iurt/rpmbuild/BUILD/snifflib-1.9.0/src/com/mockturtlesolutions/snifflib/datatypes/DataSet.java:744: warning: no @return [javadoc] public DataSet classMatrix(String[] vars) [javadoc] ^ [javadoc] /home/iurt/rpmbuild/BUILD/snifflib-1.9.0/src/com/mockturtlesolutions/snifflib/datatypes/DataSet.java:789: warning: no @param for var [javadoc] public DataSet classMatrix(String var) [javadoc] ^ [javadoc] /home/iurt/rpmbuild/BUILD/snifflib-1.9.0/src/com/mockturtlesolutions/snifflib/datatypes/DataSet.java:789: warning: no @return [javadoc] public DataSet classMatrix(String var) [javadoc] ^ [javadoc] /home/iurt/rpmbuild/BUILD/snifflib-1.9.0/src/com/mockturtlesolutions/snifflib/datatypes/DataSet.java:2148: warning: no @param for labels [javadoc] public void updateFromDblMatrix(String[] labels,DblMatrix[] cols) [javadoc] ^ [javadoc] /home/iurt/rpmbuild/BUILD/snifflib-1.9.0/src/com/mockturtlesolutions/snifflib/datatypes/DataSet.java:2148: warning: no @param for cols [javadoc] public void updateFromDblMatrix(String[] labels,DblMatrix[] cols) [javadoc] ^ [javadoc] /home/iurt/rpmbuild/BUILD/snifflib-1.9.0/src/com/mockturtlesolutions/snifflib/datatypes/DataSetAdapter.java:110: warning: no @param for modelvariable [javadoc] public void mapName(String modelvariable,String datasetcolname) [javadoc] ^ [javadoc] /home/iurt/rpmbuild/BUILD/snifflib-1.9.0/src/com/mockturtlesolutions/snifflib/datatypes/DataSetAdapter.java:110: warning: no @param for datasetcolname [javadoc] public void mapName(String modelvariable,String datasetcolname) [javadoc] ^ [javadoc] /home/iurt/rpmbuild/BUILD/snifflib-1.9.0/src/com/mockturtlesolutions/snifflib/datatypes/DataSetAdapter.java:183: warning: no @param for name [javadoc] public String getColumnNameForName(String name) [javadoc] ^ [javadoc] /home/iurt/rpmbuild/BUILD/snifflib-1.9.0/src/com/mockturtlesolutions/snifflib/datatypes/DataSetAdapter.java:183: warning: no @return [javadoc] public String getColumnNameForName(String name) [javadoc] ^ [javadoc] /home/iurt/rpmbuild/BUILD/snifflib-1.9.0/src/com/mockturtlesolutions/snifflib/datatypes/DataSetReader.java:421: warning: no @param for h [javadoc] public void setIgnorePreHeaderLines(int h) [javadoc] ^ [javadoc] /home/iurt/rpmbuild/BUILD/snifflib-1.9.0/src/com/mockturtlesolutions/snifflib/datatypes/DataSetReader.java:429: warning: no @return [javadoc] public int getIgnorePreHeaderLines() [javadoc] ^ [javadoc] /home/iurt/rpmbuild/BUILD/snifflib-1.9.0/src/com/mockturtlesolutions/snifflib/datatypes/DataSetReader.java:437: warning: no @param for h [javadoc] public void setIgnorePostHeaderLines(int h) [javadoc] ^ [javadoc] /home/iurt/rpmbuild/BUILD/snifflib-1.9.0/src/com/mockturtlesolutions/snifflib/datatypes/DataSetReader.java:445: warning: no @return [javadoc] public int getIgnorePostHeaderLines() [javadoc] ^ [javadoc] /home/iurt/rpmbuild/BUILD/snifflib-1.9.0/src/com/mockturtlesolutions/snifflib/datatypes/DataSetReader.java:477: warning: no @param for hdrs [javadoc] public void setHeaders(String[] hdrs) [javadoc] ^ [javadoc] /home/iurt/rpmbuild/BUILD/snifflib-1.9.0/src/com/mockturtlesolutions/snifflib/datatypes/DataSetReader.java:489: warning: no @param for t [javadoc] public void setTypes(Class[] t) [javadoc] ^ [javadoc] /home/iurt/rpmbuild/BUILD/snifflib-1.9.0/src/com/mockturtlesolutions/snifflib/datatypes/DblMatrix.java:548: warning: no @param for N [javadoc] public static DblMatrix[] spanningSetFor(DblMatrix N) [javadoc] ^ [javadoc] /home/iurt/rpmbuild/BUILD/snifflib-1.9.0/src/com/mockturtlesolutions/snifflib/datatypes/DblMatrix.java:548: warning: no @return [javadoc] public static DblMatrix[] spanningSetFor(DblMatrix N) [javadoc] ^ [javadoc] /home/iurt/rpmbuild/BUILD/snifflib-1.9.0/src/com/mockturtlesolutions/snifflib/datatypes/DblMatrix.java:634: warning: no @param for u [javadoc] public static DblMatrix orth(DblMatrix u) [javadoc] ^ [javadoc] /home/iurt/rpmbuild/BUILD/snifflib-1.9.0/src/com/mockturtlesolutions/snifflib/datatypes/DblMatrix.java:634: warning: no @return [javadoc] public static DblMatrix orth(DblMatrix u) [javadoc] ^ [javadoc] /home/iurt/rpmbuild/BUILD/snifflib-1.9.0/src/com/mockturtlesolutions/snifflib/datatypes/DblMatrix.java:685: warning: no @param for u [javadoc] public static DblMatrix orth(DblMatrix[] u) [javadoc] ^ [javadoc] /home/iurt/rpmbuild/BUILD/snifflib-1.9.0/src/com/mockturtlesolutions/snifflib/datatypes/DblMatrix.java:685: warning: no @return [javadoc] public static DblMatrix orth(DblMatrix[] u) [javadoc] ^ [javadoc] /home/iurt/rpmbuild/BUILD/snifflib-1.9.0/src/com/mockturtlesolutions/snifflib/datatypes/DblMatrix.java:731: warning: no @param for u [javadoc] public static DblMatrix comp(DblMatrix u,DblMatrix v) [javadoc] ^ [javadoc] /home/iurt/rpmbuild/BUILD/snifflib-1.9.0/src/com/mockturtlesolutions/snifflib/datatypes/DblMatrix.java:731: warning: no @param for v [javadoc] public static DblMatrix comp(DblMatrix u,DblMatrix v) [javadoc] ^ [javadoc] /home/iurt/rpmbuild/BUILD/snifflib-1.9.0/src/com/mockturtlesolutions/snifflib/datatypes/DblMatrix.java:731: warning: no @return [javadoc] public static DblMatrix comp(DblMatrix u,DblMatrix v) [javadoc] ^ [javadoc] /home/iurt/rpmbuild/BUILD/snifflib-1.9.0/src/com/mockturtlesolutions/snifflib/datatypes/DblMatrix.java:743: warning: no @param for u [javadoc] public static DblMatrix vnorm(DblMatrix u) [javadoc] ^ [javadoc] /home/iurt/rpmbuild/BUILD/snifflib-1.9.0/src/com/mockturtlesolutions/snifflib/datatypes/DblMatrix.java:743: warning: no @return [javadoc] public static DblMatrix vnorm(DblMatrix u) [javadoc] ^ [javadoc] /home/iurt/rpmbuild/BUILD/snifflib-1.9.0/src/com/mockturtlesolutions/snifflib/datatypes/DblMatrix.java:757: warning: no @param for u [javadoc] public static DblMatrix gap(DblMatrix u,DblMatrix v) [javadoc] ^ [javadoc] /home/iurt/rpmbuild/BUILD/snifflib-1.9.0/src/com/mockturtlesolutions/snifflib/datatypes/DblMatrix.java:757: warning: no @param for v [javadoc] public static DblMatrix gap(DblMatrix u,DblMatrix v) [javadoc] ^ [javadoc] /home/iurt/rpmbuild/BUILD/snifflib-1.9.0/src/com/mockturtlesolutions/snifflib/datatypes/DblMatrix.java:757: warning: no @return [javadoc] public static DblMatrix gap(DblMatrix u,DblMatrix v) [javadoc] ^ [javadoc] /home/iurt/rpmbuild/BUILD/snifflib-1.9.0/src/com/mockturtlesolutions/snifflib/datatypes/DblMatrix.java:769: warning: no @param for u [javadoc] public static DblMatrix proj(DblMatrix u,DblMatrix[] v) [javadoc] ^ [javadoc] /home/iurt/rpmbuild/BUILD/snifflib-1.9.0/src/com/mockturtlesolutions/snifflib/datatypes/DblMatrix.java:769: warning: no @param for v [javadoc] public static DblMatrix proj(DblMatrix u,DblMatrix[] v) [javadoc] ^ [javadoc] /home/iurt/rpmbuild/BUILD/snifflib-1.9.0/src/com/mockturtlesolutions/snifflib/datatypes/DblMatrix.java:769: warning: no @return [javadoc] public static DblMatrix proj(DblMatrix u,DblMatrix[] v) [javadoc] ^ [javadoc] /home/iurt/rpmbuild/BUILD/snifflib-1.9.0/src/com/mockturtlesolutions/snifflib/datatypes/DblMatrix.java:785: warning: no @param for u [javadoc] public static DblMatrix proj(DblMatrix u,DblMatrix v) [javadoc] ^ [javadoc] /home/iurt/rpmbuild/BUILD/snifflib-1.9.0/src/com/mockturtlesolutions/snifflib/datatypes/DblMatrix.java:785: warning: no @param for v [javadoc] public static DblMatrix proj(DblMatrix u,DblMatrix v) [javadoc] ^ [javadoc] /home/iurt/rpmbuild/BUILD/snifflib-1.9.0/src/com/mockturtlesolutions/snifflib/datatypes/DblMatrix.java:785: warning: no @return [javadoc] public static DblMatrix proj(DblMatrix u,DblMatrix v) [javadoc] ^ [javadoc] /home/iurt/rpmbuild/BUILD/snifflib-1.9.0/src/com/mockturtlesolutions/snifflib/datatypes/DblMatrix.java:975: warning: no @param for dim [javadoc] public DblMatrix cumProd(int dim) [javadoc] ^ [javadoc] /home/iurt/rpmbuild/BUILD/snifflib-1.9.0/src/com/mockturtlesolutions/snifflib/datatypes/DblMatrix.java:975: warning: no @return [javadoc] public DblMatrix cumProd(int dim) [javadoc] ^ [javadoc] /home/iurt/rpmbuild/BUILD/snifflib-1.9.0/src/com/mockturtlesolutions/snifflib/datatypes/DblMatrix.java:996: warning: no @param for dim [javadoc] public DblMatrix cumSum(int dim) [javadoc] ^ [javadoc] /home/iurt/rpmbuild/BUILD/snifflib-1.9.0/src/com/mockturtlesolutions/snifflib/datatypes/DblMatrix.java:996: warning: no @return [javadoc] public DblMatrix cumSum(int dim) [javadoc] ^ [javadoc] /home/iurt/rpmbuild/BUILD/snifflib-1.9.0/src/com/mockturtlesolutions/snifflib/datatypes/DblMatrix.java:1018: warning: no @param for k [javadoc] public Double getDoubleAt(int k) [javadoc] ^ [javadoc] /home/iurt/rpmbuild/BUILD/snifflib-1.9.0/src/com/mockturtlesolutions/snifflib/datatypes/DblMatrix.java:1018: warning: no @return [javadoc] public Double getDoubleAt(int k) [javadoc] ^ [javadoc] /home/iurt/rpmbuild/BUILD/snifflib-1.9.0/src/com/mockturtlesolutions/snifflib/datatypes/DblMatrix.java:1039: warning: no @param for k [javadoc] public DblMatrix getDblAt(int k) [javadoc] ^ [javadoc] /home/iurt/rpmbuild/BUILD/snifflib-1.9.0/src/com/mockturtlesolutions/snifflib/datatypes/DblMatrix.java:1039: warning: no @return [javadoc] public DblMatrix getDblAt(int k) [javadoc] ^ [javadoc] /home/iurt/rpmbuild/BUILD/snifflib-1.9.0/src/com/mockturtlesolutions/snifflib/datatypes/DblMatrix.java:1061: warning: no @param for VALUE [javadoc] public void setDblAt(DblMatrix VALUE,int k) [javadoc] ^ [javadoc] /home/iurt/rpmbuild/BUILD/snifflib-1.9.0/src/com/mockturtlesolutions/snifflib/datatypes/DblMatrix.java:1061: warning: no @param for k [javadoc] public void setDblAt(DblMatrix VALUE,int k) [javadoc] ^ [javadoc] /home/iurt/rpmbuild/BUILD/snifflib-1.9.0/src/com/mockturtlesolutions/snifflib/datatypes/DblMatrix.java:1091: warning: no @param for VALUE [javadoc] public void setDoubleAt(Double VALUE,int k) [javadoc] ^ [javadoc] /home/iurt/rpmbuild/BUILD/snifflib-1.9.0/src/com/mockturtlesolutions/snifflib/datatypes/DblMatrix.java:1091: warning: no @param for k [javadoc] public void setDoubleAt(Double VALUE,int k) [javadoc] ^ [javadoc] /home/iurt/rpmbuild/BUILD/snifflib-1.9.0/src/com/mockturtlesolutions/snifflib/datatypes/DblMatrix.java:1113: warning: no @param for VALUE [javadoc] public void setDoubleAt(Integer VALUE,int k) [javadoc] ^ [javadoc] /home/iurt/rpmbuild/BUILD/snifflib-1.9.0/src/com/mockturtlesolutions/snifflib/datatypes/DblMatrix.java:1113: warning: no @param for k [javadoc] public void setDoubleAt(Integer VALUE,int k) [javadoc] ^ [javadoc] /home/iurt/rpmbuild/BUILD/snifflib-1.9.0/src/com/mockturtlesolutions/snifflib/datatypes/DblMatrix.java:1134: warning: no @param for VALUE [javadoc] public void setDoubleAt(double VALUE,int k) [javadoc] ^ [javadoc] /home/iurt/rpmbuild/BUILD/snifflib-1.9.0/src/com/mockturtlesolutions/snifflib/datatypes/DblMatrix.java:1134: warning: no @param for k [javadoc] public void setDoubleAt(double VALUE,int k) [javadoc] ^ [javadoc] /home/iurt/rpmbuild/BUILD/snifflib-1.9.0/src/com/mockturtlesolutions/snifflib/datatypes/DblMatrix.java:1778: warning: no @return [javadoc] protected DblMatrix cccopy() [javadoc] ^ [javadoc] /home/iurt/rpmbuild/BUILD/snifflib-1.9.0/src/com/mockturtlesolutions/snifflib/datatypes/DblMatrix.java:1796: warning: no @return [javadoc] public DblMatrix copy() [javadoc] ^ [javadoc] /home/iurt/rpmbuild/BUILD/snifflib-1.9.0/src/com/mockturtlesolutions/snifflib/datatypes/DblMatrix.java:1903: warning: no @param for X [javadoc] public static DblMatrix isScalar(DblMatrix X) [javadoc] ^ [javadoc] /home/iurt/rpmbuild/BUILD/snifflib-1.9.0/src/com/mockturtlesolutions/snifflib/datatypes/DblMatrix.java:1903: warning: no @return [javadoc] public static DblMatrix isScalar(DblMatrix X) [javadoc] ^ [javadoc] /home/iurt/rpmbuild/BUILD/snifflib-1.9.0/src/com/mockturtlesolutions/snifflib/datatypes/DblMatrix.java:1946: warning: no @param for X [javadoc] public static boolean test(DblMatrix X) [javadoc] ^ [javadoc] /home/iurt/rpmbuild/BUILD/snifflib-1.9.0/src/com/mockturtlesolutions/snifflib/datatypes/DblMatrix.java:1946: warning: no @return [javadoc] public static boolean test(DblMatrix X) [javadoc] ^ [javadoc] /home/iurt/rpmbuild/BUILD/snifflib-1.9.0/src/com/mockturtlesolutions/snifflib/datatypes/DblMatrix.java:1969: warning: no @param for Z [javadoc] public static DblMatrix or(DblMatrix Z,DblMatrix X) [javadoc] ^ [javadoc] /home/iurt/rpmbuild/BUILD/snifflib-1.9.0/src/com/mockturtlesolutions/snifflib/datatypes/DblMatrix.java:1969: warning: no @param for X [javadoc] public static DblMatrix or(DblMatrix Z,DblMatrix X) [javadoc] ^ [javadoc] /home/iurt/rpmbuild/BUILD/snifflib-1.9.0/src/com/mockturtlesolutions/snifflib/datatypes/DblMatrix.java:1969: warning: no @return [javadoc] public static DblMatrix or(DblMatrix Z,DblMatrix X) [javadoc] ^ [javadoc] /home/iurt/rpmbuild/BUILD/snifflib-1.9.0/src/com/mockturtlesolutions/snifflib/datatypes/DblMatrix.java:2057: warning: no @param for X [javadoc] public static DblMatrix or(int X,DblMatrix Z) [javadoc] ^ [javadoc] /home/iurt/rpmbuild/BUILD/snifflib-1.9.0/src/com/mockturtlesolutions/snifflib/datatypes/DblMatrix.java:2057: warning: no @param for Z [javadoc] public static DblMatrix or(int X,DblMatrix Z) [javadoc] ^ [javadoc] /home/iurt/rpmbuild/BUILD/snifflib-1.9.0/src/com/mockturtlesolutions/snifflib/datatypes/DblMatrix.java:2057: warning: no @return [javadoc] public static DblMatrix or(int X,DblMatrix Z) [javadoc] ^ [javadoc] /home/iurt/rpmbuild/BUILD/snifflib-1.9.0/src/com/mockturtlesolutions/snifflib/datatypes/DblMatrix.java:2065: warning: no @param for X [javadoc] public static DblMatrix or(double X,DblMatrix Z) [javadoc] ^ [javadoc] /home/iurt/rpmbuild/BUILD/snifflib-1.9.0/src/com/mockturtlesolutions/snifflib/datatypes/DblMatrix.java:2065: warning: no @param for Z [javadoc] public static DblMatrix or(double X,DblMatrix Z) [javadoc] ^ [javadoc] /home/iurt/rpmbuild/BUILD/snifflib-1.9.0/src/com/mockturtlesolutions/snifflib/datatypes/DblMatrix.java:2065: warning: no @return [javadoc] public static DblMatrix or(double X,DblMatrix Z) [javadoc] ^ [javadoc] /home/iurt/rpmbuild/BUILD/snifflib-1.9.0/src/com/mockturtlesolutions/snifflib/datatypes/DblMatrix.java:2072: warning: no @param for Z [javadoc] public static DblMatrix or(DblMatrix Z,int X) [javadoc] ^ [javadoc] /home/iurt/rpmbuild/BUILD/snifflib-1.9.0/src/com/mockturtlesolutions/snifflib/datatypes/DblMatrix.java:2072: warning: no @param for X [javadoc] public static DblMatrix or(DblMatrix Z,int X) [javadoc] ^ [javadoc] /home/iurt/rpmbuild/BUILD/snifflib-1.9.0/src/com/mockturtlesolutions/snifflib/datatypes/DblMatrix.java:2072: warning: no @return [javadoc] public static DblMatrix or(DblMatrix Z,int X) [javadoc] ^ [javadoc] /home/iurt/rpmbuild/BUILD/snifflib-1.9.0/src/com/mockturtlesolutions/snifflib/datatypes/DblMatrix.java:2098: warning: no @param for Z [javadoc] public DblMatrix or(DblMatrix Z) [javadoc] ^ [javadoc] /home/iurt/rpmbuild/BUILD/snifflib-1.9.0/src/com/mockturtlesolutions/snifflib/datatypes/DblMatrix.java:2098: warning: no @return [javadoc] public DblMatrix or(DblMatrix Z) [javadoc] ^ [javadoc] /home/iurt/rpmbuild/BUILD/snifflib-1.9.0/src/com/mockturtlesolutions/snifflib/datatypes/DblMatrix.java:2126: warning: no @param for Z [javadoc] public static DblMatrix or(DblMatrix Z,double X) [javadoc] ^ [javadoc] /home/iurt/rpmbuild/BUILD/snifflib-1.9.0/src/com/mockturtlesolutions/snifflib/datatypes/DblMatrix.java:2126: warning: no @param for X [javadoc] public static DblMatrix or(DblMatrix Z,double X) [javadoc] ^ [javadoc] /home/iurt/rpmbuild/BUILD/snifflib-1.9.0/src/com/mockturtlesolutions/snifflib/datatypes/DblMatrix.java:2126: warning: no @return [javadoc] public static DblMatrix or(DblMatrix Z,double X) [javadoc] ^ [javadoc] /home/iurt/rpmbuild/BUILD/snifflib-1.9.0/src/com/mockturtlesolutions/snifflib/datatypes/DblMatrix.java:2150: warning: no @param for Z [javadoc] public static DblMatrix and(DblMatrix Z,DblMatrix X) [javadoc] ^ [javadoc] /home/iurt/rpmbuild/BUILD/snifflib-1.9.0/src/com/mockturtlesolutions/snifflib/datatypes/DblMatrix.java:2150: warning: no @param for X [javadoc] public static DblMatrix and(DblMatrix Z,DblMatrix X) [javadoc] ^ [javadoc] /home/iurt/rpmbuild/BUILD/snifflib-1.9.0/src/com/mockturtlesolutions/snifflib/datatypes/DblMatrix.java:2150: warning: no @return [javadoc] public static DblMatrix and(DblMatrix Z,DblMatrix X) [javadoc] ^ [javadoc] /home/iurt/rpmbuild/BUILD/snifflib-1.9.0/src/com/mockturtlesolutions/snifflib/datatypes/DblMatrix.java:2238: warning: no @param for X [javadoc] public static DblMatrix and(int X,DblMatrix Z) [javadoc] ^ [javadoc] /home/iurt/rpmbuild/BUILD/snifflib-1.9.0/src/com/mockturtlesolutions/snifflib/datatypes/DblMatrix.java:2238: warning: no @param for Z [javadoc] public static DblMatrix and(int X,DblMatrix Z) [javadoc] ^ [javadoc] /home/iurt/rpmbuild/BUILD/snifflib-1.9.0/src/com/mockturtlesolutions/snifflib/datatypes/DblMatrix.java:2238: warning: no @return [javadoc] public static DblMatrix and(int X,DblMatrix Z) [javadoc] ^ [javadoc] /home/iurt/rpmbuild/BUILD/snifflib-1.9.0/src/com/mockturtlesolutions/snifflib/datatypes/DblMatrix.java:2246: warning: no @param for X [javadoc] public static DblMatrix and(double X,DblMatrix Z) [javadoc] ^ [javadoc] /home/iurt/rpmbuild/BUILD/snifflib-1.9.0/src/com/mockturtlesolutions/snifflib/datatypes/DblMatrix.java:2246: warning: no @param for Z [javadoc] public static DblMatrix and(double X,DblMatrix Z) [javadoc] ^ [javadoc] /home/iurt/rpmbuild/BUILD/snifflib-1.9.0/src/com/mockturtlesolutions/snifflib/datatypes/DblMatrix.java:2246: warning: no @return [javadoc] public static DblMatrix and(double X,DblMatrix Z) [javadoc] ^ [javadoc] /home/iurt/rpmbuild/BUILD/snifflib-1.9.0/src/com/mockturtlesolutions/snifflib/datatypes/DblMatrix.java:2254: warning: no @param for Z [javadoc] public static DblMatrix and(DblMatrix Z,int X) [javadoc] ^ [javadoc] /home/iurt/rpmbuild/BUILD/snifflib-1.9.0/src/com/mockturtlesolutions/snifflib/datatypes/DblMatrix.java:2254: warning: no @param for X [javadoc] public static DblMatrix and(DblMatrix Z,int X) [javadoc] ^ [javadoc] /home/iurt/rpmbuild/BUILD/snifflib-1.9.0/src/com/mockturtlesolutions/snifflib/datatypes/DblMatrix.java:10401: error: bad use of '>' [javadoc] sign(X,Y) returns abs(X) if Y>=0 and -(abs(X)) if Y<0. [javadoc] ^ [javadoc] /home/iurt/rpmbuild/BUILD/snifflib-1.9.0/src/com/mockturtlesolutions/snifflib/datatypes/DblMatrix.java:10401: error: malformed HTML [javadoc] sign(X,Y) returns abs(X) if Y>=0 and -(abs(X)) if Y<0. [javadoc] ^ [javadoc] /home/iurt/rpmbuild/BUILD/snifflib-1.9.0/src/com/mockturtlesolutions/snifflib/reposconfig/database/RepositorySQLConnection.java:608: error: text not allowed in element [javadoc] Get the output from `SELECT LAST_INSERT_ID() FROM
`; [javadoc] ^ [javadoc] /home/iurt/rpmbuild/BUILD/snifflib-1.9.0/src/com/mockturtlesolutions/snifflib/reposconfig/database/RepositorySQLConnection.java:608: error: element not closed: table [javadoc] Get the output from `SELECT LAST_INSERT_ID() FROM
`; [javadoc] ^ [javadoc] /home/iurt/rpmbuild/BUILD/snifflib-1.9.0/src/com/mockturtlesolutions/snifflib/reposconfig/database/RepositorySQLiteConnection.java:638: error: text not allowed in
element [javadoc] Get the output from `SELECT LAST_INSERT_ID() FROM
`; [javadoc] ^ [javadoc] /home/iurt/rpmbuild/BUILD/snifflib-1.9.0/src/com/mockturtlesolutions/snifflib/reposconfig/database/RepositorySQLiteConnection.java:638: error: element not closed: table [javadoc] Get the output from `SELECT LAST_INSERT_ID() FROM
`; [javadoc] ^ [javadoc] /home/iurt/rpmbuild/BUILD/snifflib-1.9.0/src/com/mockturtlesolutions/snifflib/graphics/SLCamera.java:431: error: bad use of '>' [javadoc] Return the actual coordinates for the given pixel. This falls apart in >2D. [javadoc] ^ [javadoc] /home/iurt/rpmbuild/BUILD/snifflib-1.9.0/src/com/mockturtlesolutions/snifflib/graphics/SLCamera.java:550: error: bad use of '>' [javadoc] Return the actual coordinates for the given pixel. This falls apart in >2D. [javadoc] ^ [javadoc] /home/iurt/rpmbuild/BUILD/snifflib-1.9.0/src/com/mockturtlesolutions/snifflib/reposconfig/database/RepositoryPostgreSQLConnection.java:688: error: text not allowed in
element [javadoc] Get the output from `SELECT LAST_INSERT_ID() FROM
`; [javadoc] ^ [javadoc] /home/iurt/rpmbuild/BUILD/snifflib-1.9.0/src/com/mockturtlesolutions/snifflib/reposconfig/database/RepositoryPostgreSQLConnection.java:688: error: element not closed: table [javadoc] Get the output from `SELECT LAST_INSERT_ID() FROM
`; [javadoc] ^ [javadoc] /home/iurt/rpmbuild/BUILD/snifflib-1.9.0/src/com/mockturtlesolutions/snifflib/guitools/components/IconifiedDomainNameTextField.java:667: error: unknown tag: domain [javadoc] Overrides the toString method returning the . as a String. [javadoc] ^ [javadoc] /home/iurt/rpmbuild/BUILD/snifflib-1.9.0/src/com/mockturtlesolutions/snifflib/guitools/components/IconifiedDomainNameTextField.java:667: error: unknown tag: name [javadoc] Overrides the toString method returning the . as a String. [javadoc] ^ [javadoc] /home/iurt/rpmbuild/BUILD/snifflib-1.9.0/src/com/mockturtlesolutions/snifflib/invprobs/Dbracket.java:75: error: malformed HTML [javadoc] The condition attained is that B[0] <= X <= B[1] [javadoc] ^ [javadoc] /home/iurt/rpmbuild/BUILD/snifflib-1.9.0/src/com/mockturtlesolutions/snifflib/invprobs/Dbracket.java:75: error: malformed HTML [javadoc] The condition attained is that B[0] <= X <= B[1] [javadoc] ^ [javadoc] /home/iurt/rpmbuild/BUILD/snifflib-1.9.0/src/com/mockturtlesolutions/snifflib/pde/NDGrid.java:584: error: malformed HTML [javadoc] sum of the steps between the two indices is returned. If p1[ ] where POS is the intended part of speech (e.g. N, V) [javadoc] ^ [javadoc] /home/iurt/rpmbuild/BUILD/snifflib-1.9.0/src/com/mockturtlesolutions/snifflib/semantics/FillerText.java:215: error: unknown tag: N [javadoc] String str = "The quick brown [ ] jumped over the lazy [ ]."; [javadoc] ^ [javadoc] /home/iurt/rpmbuild/BUILD/snifflib-1.9.0/src/com/mockturtlesolutions/snifflib/semantics/FillerText.java:215: error: unknown tag: N [javadoc] String str = "The quick brown [ ] jumped over the lazy [ ]."; [javadoc] ^ [javadoc] /home/iurt/rpmbuild/BUILD/snifflib-1.9.0/src/com/mockturtlesolutions/snifflib/stats/ChiSqDistribution.java:122: error: malformed HTML [javadoc] For an input value C returns x such that P(X<=x) = C. [javadoc] ^ [javadoc] /home/iurt/rpmbuild/BUILD/snifflib-1.9.0/src/com/mockturtlesolutions/snifflib/stats/DiscreteUniformDistribution.java:96: error: malformed HTML [javadoc] For an input value C returns x such that P(X<=x) = C. [javadoc] ^ [javadoc] /home/iurt/rpmbuild/BUILD/snifflib-1.9.0/src/com/mockturtlesolutions/snifflib/stats/FDistribution.java:109: error: malformed HTML [javadoc] For an input value C returns x such that P(X<=x) = C. [javadoc] ^ [javadoc] /home/iurt/rpmbuild/BUILD/snifflib-1.9.0/src/com/mockturtlesolutions/snifflib/stats/GammaDistribution.java:211: error: malformed HTML [javadoc] For an input value C returns x such that P(X<=x) = C. [javadoc] ^ [javadoc] /home/iurt/rpmbuild/BUILD/snifflib-1.9.0/src/com/mockturtlesolutions/snifflib/stats/HypergeometricDistribution.java:224: error: malformed HTML [javadoc] For an input value C returns x such that P(X<=x) = C. [javadoc] ^ [javadoc] /home/iurt/rpmbuild/BUILD/snifflib-1.9.0/src/com/mockturtlesolutions/snifflib/stats/NormalDistribution.java:174: error: malformed HTML [javadoc] For an input value C returns x such that P(X<=x) = C. [javadoc] ^ [javadoc] /home/iurt/rpmbuild/BUILD/snifflib-1.9.0/src/com/mockturtlesolutions/snifflib/stats/TDistribution.java:140: error: malformed HTML [javadoc] For an input value C returns x such that P(X<=x) = C. [javadoc] ^ [javadoc] /home/iurt/rpmbuild/BUILD/snifflib-1.9.0/src/com/mockturtlesolutions/snifflib/stats/UniformDistribution.java:164: error: malformed HTML [javadoc] For an input value C returns x such that P(X<=x) = C. [javadoc] ^ [javadoc] Building index for all the packages and classes... [javadoc] Building index for all classes... [javadoc] Generating /home/iurt/rpmbuild/BUILD/snifflib-1.9.0/snifflib_release/forupload/doc/api/help-doc.html... [javadoc] 32 errors [javadoc] 100 warnings BUILD SUCCESSFUL Total time: 2 minutes 15 seconds + RPM_EC=0 ++ jobs -p + exit 0 Executing(%install): /bin/sh -e /home/iurt/rpmbuild/tmp/rpm-tmp.5tsCcd + umask 022 + cd /home/iurt/rpmbuild/BUILD + '[' 1 -eq 1 ']' + '[' /home/iurt/rpmbuild/BUILDROOT/snifflib-1.9.0-11.mga8.aarch64 '!=' / ']' + rm -rf /home/iurt/rpmbuild/BUILDROOT/snifflib-1.9.0-11.mga8.aarch64 ++ dirname /home/iurt/rpmbuild/BUILDROOT/snifflib-1.9.0-11.mga8.aarch64 + mkdir -p /home/iurt/rpmbuild/BUILDROOT + mkdir /home/iurt/rpmbuild/BUILDROOT/snifflib-1.9.0-11.mga8.aarch64 + cd snifflib-1.9.0 + '[' 1 -eq 1 ']' + install -d -m 755 /home/iurt/rpmbuild/BUILDROOT/snifflib-1.9.0-11.mga8.aarch64/usr/share/java + install -d -m 755 /home/iurt/rpmbuild/BUILDROOT/snifflib-1.9.0-11.mga8.aarch64/usr/share/snifflib + install -d -m 755 /home/iurt/rpmbuild/BUILDROOT/snifflib-1.9.0-11.mga8.aarch64/usr/share/javadoc/snifflib + install -d -m 755 /home/iurt/rpmbuild/BUILDROOT/snifflib-1.9.0-11.mga8.aarch64/usr/share/man/man1 + install -p -m 644 snifflib_release/snifflib-0.0.0.jar /home/iurt/rpmbuild/BUILDROOT/snifflib-1.9.0-11.mga8.aarch64/usr/share/java/snifflib.jar + install -p -m 644 src/com/mockturtlesolutions/snifflib/spreadsheets/images/myrtlesplash.png /home/iurt/rpmbuild/BUILDROOT/snifflib-1.9.0-11.mga8.aarch64/usr/share/snifflib/ + install -d -m 755 /home/iurt/rpmbuild/BUILDROOT/snifflib-1.9.0-11.mga8.aarch64/usr/bin + install -p -m 755 /home/iurt/rpmbuild/SOURCES/myrtle /home/iurt/rpmbuild/BUILDROOT/snifflib-1.9.0-11.mga8.aarch64/usr/bin/ + mkdir -p /home/iurt/rpmbuild/BUILDROOT/snifflib-1.9.0-11.mga8.aarch64/usr/share/icons/hicolor/64x64/apps + cp -p src/com/mockturtlesolutions/snifflib/spreadsheets/images/myrtle_logo.png /home/iurt/rpmbuild/BUILDROOT/snifflib-1.9.0-11.mga8.aarch64/usr/share/icons/hicolor/64x64/apps/ + desktop-file-install --dir=/home/iurt/rpmbuild/BUILDROOT/snifflib-1.9.0-11.mga8.aarch64/usr/share/applications /home/iurt/rpmbuild/SOURCES/myrtle.desktop + install -p -m 644 doc/man/myrtle.1 /home/iurt/rpmbuild/BUILDROOT/snifflib-1.9.0-11.mga8.aarch64/usr/share/man/man1 + cp -pr snifflib_release/forupload/doc/api/allclasses-frame.html snifflib_release/forupload/doc/api/allclasses-noframe.html snifflib_release/forupload/doc/api/com snifflib_release/forupload/doc/api/constant-values.html snifflib_release/forupload/doc/api/deprecated-list.html snifflib_release/forupload/doc/api/help-doc.html snifflib_release/forupload/doc/api/index-files snifflib_release/forupload/doc/api/index.html snifflib_release/forupload/doc/api/overview-frame.html snifflib_release/forupload/doc/api/overview-summary.html snifflib_release/forupload/doc/api/overview-tree.html snifflib_release/forupload/doc/api/package-list snifflib_release/forupload/doc/api/script.js snifflib_release/forupload/doc/api/serialized-form.html snifflib_release/forupload/doc/api/stylesheet.css /home/iurt/rpmbuild/BUILDROOT/snifflib-1.9.0-11.mga8.aarch64/usr/share/javadoc/snifflib + /usr/lib/rpm/find-debuginfo.sh -j16 --strict-build-id -m -i --build-id-seed 1.9.0-11.mga8 --unique-debug-suffix -1.9.0-11.mga8.aarch64 --unique-debug-src-base snifflib-1.9.0-11.mga8.aarch64 --run-dwz --dwz-low-mem-die-limit 10000000 --dwz-max-die-limit 50000000 -S debugsourcefiles.list /home/iurt/rpmbuild/BUILD/snifflib-1.9.0 + '[' -n '' ']' + /usr/share/spec-helper/clean_files + '[' -n '' ']' + /usr/share/spec-helper/compress_files .xz + '[' -n '' ']' + /usr/share/spec-helper/relink_symlinks + '[' -n '' ']' + /usr/share/spec-helper/clean_perl + '[' -n '' ']' + /usr/share/spec-helper/lib_symlinks + '[' -n '' ']' + /usr/share/spec-helper/gprintify + '[' -n '' ']' + /usr/share/spec-helper/fix_mo + '[' -n '' ']' + /usr/share/spec-helper/translate_menu + '[' -n '' ']' + /usr/share/spec-helper/fix_pamd + '[' -n '' ']' + /usr/share/spec-helper/remove_info_dir + '[' -n '' ']' + /usr/share/spec-helper/fix_eol + '[' -n '' ']' + /usr/share/spec-helper/check_desktop_files /home/iurt/rpmbuild/BUILDROOT/snifflib-1.9.0-11.mga8.aarch64/usr/share/applications/myrtle.desktop: hint: value "Education;Science;Math;NumericalAnalysis;" for key "Categories" in group "Desktop Entry" contains more than one main category; application might appear more than once in the application menu + '[' -n '' ']' + /usr/share/spec-helper/check_elf_files + /usr/lib/rpm/brp-python-bytecompile /usr/bin/python 1 1 + /usr/lib/rpm/brp-python-hardlink + /usr/lib/rpm/redhat/brp-mangle-shebangs mangling shebang in /usr/bin/myrtle from /bin/sh to #!/usr/bin/sh Executing(%check): /bin/sh -e /home/iurt/rpmbuild/tmp/rpm-tmp.RSTRVb + umask 022 + cd /home/iurt/rpmbuild/BUILD + cd snifflib-1.9.0 + '[' 1 -eq 1 ']' + ant -buildfile basic_build.xml testMyrtle Buildfile: /home/iurt/rpmbuild/BUILD/snifflib-1.9.0/basic_build.xml init: unhide: compile_tests: [move] Moving 1 file to /home/iurt/rpmbuild/BUILD/snifflib-1.9.0/test [javac] Compiling 39 source files to /home/iurt/rpmbuild/BUILD/snifflib-1.9.0/build [javac] warning: [options] bootstrap class path not set in conjunction with -source 1.5 [javac] warning: [options] source value 1.5 is obsolete and will be removed in a future release [javac] warning: [options] target value 1.5 is obsolete and will be removed in a future release [javac] warning: [options] To suppress warnings about obsolete options, use -Xlint:-options. [javac] Note: Some input files use unchecked or unsafe operations. [javac] Note: Recompile with -Xlint:unchecked for details. [javac] 4 warnings [move] Moving 1 file to /home/iurt/rpmbuild/BUILD/snifflib-1.9.0/test testMyrtle: [junit] Running com.mockturtlesolutions.snifflib.spreadsheets.OpenExistingSheetTest [junit] Testsuite: com.mockturtlesolutions.snifflib.spreadsheets.OpenExistingSheetTest [junit] Tests run: 1, Failures: 0, Errors: 0, Skipped: 0, Time elapsed: 0.253 sec [junit] Output: [junit] [junit] [junit] A project for testing purposes.First sheet added [junit] [junit] [junit] Tests run: 1, Failures: 0, Errors: 0, Skipped: 0, Time elapsed: 0.253 sec [junit] ------------- Standard Output --------------- [junit] [junit] [junit] A project for testing purposes.First sheet added [junit] [junit] ------------- ---------------- --------------- [junit] [junit] Testcase: testOpenExisting took 0.24 sec BUILD SUCCESSFUL Total time: 4 seconds + RPM_EC=0 ++ jobs -p + exit 0 Processing files: snifflib-1.9.0-11.mga8.noarch Executing(%doc): /bin/sh -e /home/iurt/rpmbuild/tmp/rpm-tmp.lpPgLd + umask 022 + cd /home/iurt/rpmbuild/BUILD + cd snifflib-1.9.0 + DOCDIR=/home/iurt/rpmbuild/BUILDROOT/snifflib-1.9.0-11.mga8.aarch64/usr/share/doc/snifflib + export LC_ALL=C + LC_ALL=C + export DOCDIR + /usr/bin/mkdir -p /home/iurt/rpmbuild/BUILDROOT/snifflib-1.9.0-11.mga8.aarch64/usr/share/doc/snifflib + cp -pr src/com/mockturtlesolutions/snifflib/LICENSE/LGPLv3.txt /home/iurt/rpmbuild/BUILDROOT/snifflib-1.9.0-11.mga8.aarch64/usr/share/doc/snifflib + RPM_EC=0 ++ jobs -p + exit 0 [INFO osgi.prov] input: ['/home/iurt/rpmbuild/BUILDROOT/snifflib-1.9.0-11.mga8.aarch64/usr/share/java/snifflib.jar'] [INFO osgi.req] input: ['/home/iurt/rpmbuild/BUILDROOT/snifflib-1.9.0-11.mga8.aarch64/usr/share/java/snifflib.jar'] Provides: snifflib = 1.9.0-11.mga8 Requires(rpmlib): rpmlib(CompressedFileNames) <= 3.0.4-1 rpmlib(FileDigests) <= 4.6.0-1 rpmlib(PayloadFilesHavePrefix) <= 4.0-1 Processing files: myrtle-1.9.0-11.mga8.noarch Provides: application() application(myrtle.desktop) myrtle = 1.9.0-11.mga8 Requires(rpmlib): rpmlib(CompressedFileNames) <= 3.0.4-1 rpmlib(FileDigests) <= 4.6.0-1 rpmlib(PayloadFilesHavePrefix) <= 4.0-1 Processing files: snifflib-javadoc-1.9.0-11.mga8.noarch Executing(%doc): /bin/sh -e /home/iurt/rpmbuild/tmp/rpm-tmp.0LLvic + umask 022 + cd /home/iurt/rpmbuild/BUILD + cd snifflib-1.9.0 + DOCDIR=/home/iurt/rpmbuild/BUILDROOT/snifflib-1.9.0-11.mga8.aarch64/usr/share/doc/snifflib-javadoc + export LC_ALL=C + LC_ALL=C + export DOCDIR + /usr/bin/mkdir -p /home/iurt/rpmbuild/BUILDROOT/snifflib-1.9.0-11.mga8.aarch64/usr/share/doc/snifflib-javadoc + cp -pr src/com/mockturtlesolutions/snifflib/LICENSE/LGPLv3.txt /home/iurt/rpmbuild/BUILDROOT/snifflib-1.9.0-11.mga8.aarch64/usr/share/doc/snifflib-javadoc + RPM_EC=0 ++ jobs -p + exit 0 Provides: snifflib-javadoc = 1.9.0-11.mga8 Requires(rpmlib): rpmlib(CompressedFileNames) <= 3.0.4-1 rpmlib(FileDigests) <= 4.6.0-1 rpmlib(PayloadFilesHavePrefix) <= 4.0-1 Requires: javapackages-filesystem Checking for unpackaged file(s): /usr/lib/rpm/check-files /home/iurt/rpmbuild/BUILDROOT/snifflib-1.9.0-11.mga8.aarch64 Wrote: /home/iurt/rpmbuild/RPMS/noarch/myrtle-1.9.0-11.mga8.noarch.rpm Wrote: /home/iurt/rpmbuild/RPMS/noarch/snifflib-1.9.0-11.mga8.noarch.rpm Wrote: /home/iurt/rpmbuild/RPMS/noarch/snifflib-javadoc-1.9.0-11.mga8.noarch.rpm Executing(%clean): /bin/sh -e /home/iurt/rpmbuild/tmp/rpm-tmp.s5RTQd + umask 022 + cd /home/iurt/rpmbuild/BUILD + cd snifflib-1.9.0 + /usr/bin/rm -rf /home/iurt/rpmbuild/BUILDROOT/snifflib-1.9.0-11.mga8.aarch64 + RPM_EC=0 ++ jobs -p + exit 0 Executing(--clean): /bin/sh -e /home/iurt/rpmbuild/tmp/rpm-tmp.kBnpYa + umask 022 + cd /home/iurt/rpmbuild/BUILD + rm -rf snifflib-1.9.0 + RPM_EC=0 ++ jobs -p + exit 0 D: [iurt_root_command] Success!