D: [iurt_root_command] chroot Installing /home/iurt/rpmbuild/SRPMS/apache-ivy-2.4.0-10.mga8.src.rpm Building target platforms: aarch64 Building for target aarch64 Executing(%prep): /bin/sh -e /home/iurt/rpmbuild/tmp/rpm-tmp.YYM5E3 + umask 022 + cd /home/iurt/rpmbuild/BUILD + '[' 1 -eq 1 ']' + '[' 1 -eq 1 ']' + '[' 1 -eq 1 ']' + cd /home/iurt/rpmbuild/BUILD + rm -rf apache-ivy-2.4.0 + /usr/bin/gzip -dc /home/iurt/rpmbuild/SOURCES/apache-ivy-2.4.0-src.tar.gz + /usr/bin/tar -xof - + STATUS=0 + '[' 0 -ne 0 ']' + cd apache-ivy-2.4.0 + /usr/bin/chmod -Rf a+rX,u+w,g-w,o-w . + echo 'Patch #0 (apache-ivy-global-settings.patch):' Patch #0 (apache-ivy-global-settings.patch): + /usr/bin/patch --no-backup-if-mismatch -p1 --fuzz=0 patching file src/java/org/apache/ivy/ant/IvyAntSettings.java + echo 'Patch #1 (port-to-bc-1.52.patch):' Patch #1 (port-to-bc-1.52.patch): + /usr/bin/patch --no-backup-if-mismatch -p1 --fuzz=0 patching file ivy.xml patching file src/java/org/apache/ivy/plugins/signer/bouncycastle/OpenPGPSignatureGenerator.java + sed -i s:/etc/ivy/:/etc/ivy/: src/java/org/apache/ivy/ant/IvyAntSettings.java + /usr/bin/python3 /usr/share/java-utils/pom_editor.py pom_remove_dep :jsch + /usr/bin/python3 /usr/share/java-utils/pom_editor.py pom_remove_dep :jsch.agentproxy + /usr/bin/python3 /usr/share/java-utils/pom_editor.py pom_remove_dep :jsch.agentproxy.connector-factory + /usr/bin/python3 /usr/share/java-utils/pom_editor.py pom_remove_dep :jsch.agentproxy.jsch + rm -r src/java/org/apache/ivy/plugins/repository/ssh src/java/org/apache/ivy/plugins/repository/sftp + rm src/java/org/apache/ivy/plugins/resolver/AbstractSshBasedResolver.java src/java/org/apache/ivy/plugins/resolver/SshResolver.java src/java/org/apache/ivy/plugins/resolver/SFTPResolver.java + /usr/bin/python3 /usr/share/java-utils/pom_editor.py pom_remove_dep org.bouncycastle + rm src/java/org/apache/ivy/plugins/signer/bouncycastle/OpenPGPSignatureGenerator.java + /usr/bin/python3 /usr/share/java-utils/mvn_alias.py : jayasoft:ivy + /usr/bin/python3 /usr/share/java-utils/mvn_file.py : apache-ivy/ivy ivy + for F in README LICENSE NOTICE + sed 's/\r//' README + iconv -f iso8859-1 -t utf8 + touch -r README README.utf8 + mv README.utf8 README + for F in README LICENSE NOTICE + sed 's/\r//' LICENSE + iconv -f iso8859-1 -t utf8 + touch -r LICENSE LICENSE.utf8 + mv LICENSE.utf8 LICENSE + for F in README LICENSE NOTICE + sed 's/\r//' NOTICE + iconv -f iso8859-1 -t utf8 + touch -r NOTICE NOTICE.utf8 + mv NOTICE.utf8 NOTICE + sed -i s/ant-trax/ant/ ivy.xml + sed -i /bouncycastle/s/jdk14/jdk16/ ivy.xml + sed -i /commons-vfs/d ivy.xml + rm -rf src/java/org/apache/ivy/plugins/repository/vfs + rm -rf src/java/org/apache/ivy/plugins/resolver/VfsResolver.java + rm -rf doc build/doc + sed -i /ivy:publish/s/local/xmvn/ build.xml + sed -i 's/\(\s*public void\) \(testFixedMdMultipleExtends().*\)/\1 _disabled_\2/' test/java/org/apache/ivy/core/report/ResolveReportTest.java + rm test/java/org/apache/ivy/plugins/resolver/BintrayResolverTest.java + rm test/java/org/apache/ivy/plugins/resolver/MirroredURLResolverTest.java + rm -rf test/java/org/apache/ivy/osgi/updatesite + rm test/java/org/apache/ivy/core/settings/OnlineXmlSettingsParserTest.java + rm test/java/org/apache/ivy/util/url/BasicURLHandlerTest.java + rm test/java/org/apache/ivy/util/url/HttpclientURLHandlerTest.java + rm test/java/org/apache/ivy/plugins/resolver/IBiblioResolverTest.java + rm test/java/org/apache/ivy/util/url/ArtifactoryListingTest.java + rm test/java/org/apache/ivy/plugins/repository/vfs/VfsRepositoryTest.java + rm test/java/org/apache/ivy/plugins/repository/vfs/VfsResourceTest.java + rm test/java/org/apache/ivy/plugins/repository/vfs/VfsTestHelper.java + rm test/java/org/apache/ivy/plugins/repository/vfs/VfsURI.java + rm test/java/org/apache/ivy/plugins/resolver/VfsResolverTest.java + rm test/java/org/apache/ivy/ant/IvyBuildListTest.java + sed -i 's/\(\s*public void\) \(testExtraInfosFromMaven().*\)/\1 _disabled_\2/' test/java/org/apache/ivy/plugins/parser/xml/XmlModuleDescriptorWriterTest.java + RPM_EC=0 ++ jobs -p + exit 0 Executing(%build): /bin/sh -e /home/iurt/rpmbuild/tmp/rpm-tmp.nKjFJ1 + umask 022 + cd /home/iurt/rpmbuild/BUILD + cd apache-ivy-2.4.0 + '[' 1 -eq 1 ']' + '[' 1 -eq 1 ']' + JAVA_HOME=/usr/lib/jvm/java-1.8.0-openjdk + ant -Divy.mode=local -Dtarget.ivy.bundle.version=2.4.0 -Dtarget.ivy.bundle.version.qualifier= -Dtarget.ivy.version=2.4.0 jar javadoc publish-local test Buildfile: /home/iurt/rpmbuild/BUILD/apache-ivy-2.4.0/build.xml init: prepare: [mkdir] Created dir: /home/iurt/rpmbuild/BUILD/apache-ivy-2.4.0/build/classes [mkdir] Created dir: /home/iurt/rpmbuild/BUILD/apache-ivy-2.4.0/build/classes/core [mkdir] Created dir: /home/iurt/rpmbuild/BUILD/apache-ivy-2.4.0/build/classes/bootstrap [mkdir] Created dir: /home/iurt/rpmbuild/BUILD/apache-ivy-2.4.0/build/classes/ant [mkdir] Created dir: /home/iurt/rpmbuild/BUILD/apache-ivy-2.4.0/build/classes/optional [mkdir] Created dir: /home/iurt/rpmbuild/BUILD/apache-ivy-2.4.0/build/classes/all [mkdir] Created dir: /home/iurt/rpmbuild/BUILD/apache-ivy-2.4.0/build/test [mkdir] Created dir: /home/iurt/rpmbuild/BUILD/apache-ivy-2.4.0/build/artifact [mkdir] Created dir: /home/iurt/rpmbuild/BUILD/apache-ivy-2.4.0/build/doc/reports/test [mkdir] Created dir: /home/iurt/rpmbuild/BUILD/apache-ivy-2.4.0/build/doc/reports/ivy compile-core: [javac] Compiling 402 source files to /home/iurt/rpmbuild/BUILD/apache-ivy-2.4.0/build/classes/core [javac] warning: [options] bootstrap class path not set in conjunction with -source 1.5 [javac] warning: [options] source value 1.5 is obsolete and will be removed in a future release [javac] warning: [options] target value 1.5 is obsolete and will be removed in a future release [javac] warning: [options] To suppress warnings about obsolete options, use -Xlint:-options. [javac] /home/iurt/rpmbuild/BUILD/apache-ivy-2.4.0/src/java/org/apache/ivy/util/url/IvyAuthenticator.java:126: warning: non-varargs call of varargs method with inexact argument type for last parameter; [javac] Method m = Authenticator.class.getDeclaredMethod("getRequestorType", null); [javac] ^ [javac] cast to Class> for a varargs call [javac] cast to Class>[] for a non-varargs call and to suppress this warning [javac] /home/iurt/rpmbuild/BUILD/apache-ivy-2.4.0/src/java/org/apache/ivy/util/url/IvyAuthenticator.java:127: warning: non-varargs call of varargs method with inexact argument type for last parameter; [javac] Object result = m.invoke(this, null); [javac] ^ [javac] cast to Object for a varargs call [javac] cast to Object[] for a non-varargs call and to suppress this warning [javac] Note: Some input files use or override a deprecated API. [javac] Note: Recompile with -Xlint:deprecation for details. [javac] Note: Some input files use unchecked or unsafe operations. [javac] Note: Recompile with -Xlint:unchecked for details. [javac] 6 warnings [copy] Copying 25 files to /home/iurt/rpmbuild/BUILD/apache-ivy-2.4.0/build/classes/core [copy] Copying 1 file to /home/iurt/rpmbuild/BUILD/apache-ivy-2.4.0/build/classes/core/org/apache/ivy/core/settings [copy] Copying 1 file to /home/iurt/rpmbuild/BUILD/apache-ivy-2.4.0/build/classes/core/org/apache/ivy/core/settings [copy] Copying 1 file to /home/iurt/rpmbuild/BUILD/apache-ivy-2.4.0/build/classes/core/org/apache/ivy/core/settings [copy] Copying 1 file to /home/iurt/rpmbuild/BUILD/apache-ivy-2.4.0/build/classes/core/org/apache/ivy/core/settings [copy] Copying 1 file to /home/iurt/rpmbuild/BUILD/apache-ivy-2.4.0/build/classes/core/org/apache/ivy/core/settings [copy] Copying 1 file to /home/iurt/rpmbuild/BUILD/apache-ivy-2.4.0/build/classes/core/org/apache/ivy/core/settings compile-bootstrap: [javac] Compiling 48 source files to /home/iurt/rpmbuild/BUILD/apache-ivy-2.4.0/build/classes/bootstrap [javac] warning: [options] bootstrap class path not set in conjunction with -source 1.5 [javac] warning: [options] source value 1.5 is obsolete and will be removed in a future release [javac] warning: [options] target value 1.5 is obsolete and will be removed in a future release [javac] warning: [options] To suppress warnings about obsolete options, use -Xlint:-options. [javac] Note: Some input files use unchecked or unsafe operations. [javac] Note: Recompile with -Xlint:unchecked for details. [javac] 4 warnings [copy] Copying 1 file to /home/iurt/rpmbuild/BUILD/apache-ivy-2.4.0/build/classes/bootstrap init-ivy-user-home: init-ivy-local-home: init-ivy-home: init-ivy: [ivy:configure] impossible to define new type: class not found: org.apache.ivy.plugins.resolver.SshResolver in [] nor Ivy classloader [ivy:configure] impossible to define new type: class not found: org.apache.ivy.plugins.signer.bouncycastle.OpenPGPSignatureGenerator in [] nor Ivy classloader [ivy:configure] impossible to define new type: class not found: org.apache.ivy.plugins.resolver.SFTPResolver in [] nor Ivy classloader [ivy:configure] impossible to define new type: class not found: org.apache.ivy.plugins.resolver.VfsResolver in [] nor Ivy classloader [ivy:configure] :: Apache Ivy 2.4.0-local-20190824104733 - 20190824104733 :: http://ant.apache.org/ivy/ :: [ivy:configure] :: loading settings :: file = /etc/ivy/ivysettings.xml resolve: [ivy:retrieve] :: resolving dependencies :: org.apache.ivy#ivy;2.4.0 [ivy:retrieve] confs: [default, test] [ivy:retrieve] found org.apache.ant#ant;SYSTEM in xmvn [ivy:retrieve] [SYSTEM] org.apache.ant#ant;1.7.1 (forced) [ivy:retrieve] found org.apache.ant#ant-launcher;SYSTEM in xmvn [ivy:retrieve] [SYSTEM] org.apache.ant#ant-launcher;1.10.6 (forced) [ivy:retrieve] found org.apache.ant#ant-nodeps;SYSTEM in xmvn [ivy:retrieve] [SYSTEM] org.apache.ant#ant-nodeps;1.7.1 (forced) [ivy:retrieve] found commons-httpclient#commons-httpclient;SYSTEM in xmvn [ivy:retrieve] [SYSTEM] commons-httpclient#commons-httpclient;3.0 (forced) [ivy:retrieve] found commons-logging#commons-logging;SYSTEM in xmvn [ivy:retrieve] [SYSTEM] commons-logging#commons-logging;1.0.4 (forced) [ivy:retrieve] found commons-codec#commons-codec;SYSTEM in xmvn [ivy:retrieve] [SYSTEM] commons-codec#commons-codec;1.2 (forced) [ivy:retrieve] found oro#oro;SYSTEM in xmvn [ivy:retrieve] [SYSTEM] oro#oro;2.0.8 (forced) [ivy:retrieve] found junit#junit;SYSTEM in xmvn [ivy:retrieve] [SYSTEM] junit#junit;3.8.2 (forced) [ivy:retrieve] found org.hamcrest#hamcrest-core;SYSTEM in xmvn [ivy:retrieve] [SYSTEM] org.hamcrest#hamcrest-core;1.3 (forced) [ivy:retrieve] found commons-lang#commons-lang;SYSTEM in xmvn [ivy:retrieve] [SYSTEM] commons-lang#commons-lang;2.6 (forced) [ivy:retrieve] found org.apache.ant#ant-testutil;SYSTEM in xmvn [ivy:retrieve] [SYSTEM] org.apache.ant#ant-testutil;1.7.0 (forced) [ivy:retrieve] found ant#ant-launcher;SYSTEM in xmvn [ivy:retrieve] [SYSTEM] ant#ant-launcher;1.6.2 (forced) [ivy:retrieve] found ant-contrib#ant-contrib;SYSTEM in xmvn [ivy:retrieve] [SYSTEM] ant-contrib#ant-contrib;1.0b3 (forced) [ivy:retrieve] found xerces#xercesImpl;SYSTEM in xmvn [ivy:retrieve] [SYSTEM] xerces#xercesImpl;2.6.2 (forced) [ivy:retrieve] found xml-apis#xml-apis;SYSTEM in xmvn [ivy:retrieve] [SYSTEM] xml-apis#xml-apis;1.4.01 (forced) [ivy:retrieve] found xerces#xmlParserAPIs;SYSTEM in xmvn [ivy:retrieve] [SYSTEM] xerces#xmlParserAPIs;2.6.2 (forced) [ivy:retrieve] :: resolution report :: resolve 562ms :: artifacts dl 7ms --------------------------------------------------------------------- | | modules || artifacts | | conf | number| search|dwnlded|evicted|| number|dwnlded| --------------------------------------------------------------------- | default | 7 | 7 | 0 | 0 || 7 | 7 | | test | 9 | 9 | 0 | 0 || 9 | 9 | --------------------------------------------------------------------- [ivy:retrieve] :: retrieving :: org.apache.ivy#ivy [sync] [ivy:retrieve] confs: [default, test] [ivy:retrieve] conflict on /home/iurt/rpmbuild/BUILD/apache-ivy-2.4.0/lib/ant-launcher.jar in [default, test]: SYSTEM won [ivy:retrieve] 15 artifacts copied, 0 already retrieved (8838kB/48ms) compile-ant: [javac] Compiling 48 source files to /home/iurt/rpmbuild/BUILD/apache-ivy-2.4.0/build/classes/ant [javac] warning: [options] bootstrap class path not set in conjunction with -source 1.5 [javac] warning: [options] source value 1.5 is obsolete and will be removed in a future release [javac] warning: [options] target value 1.5 is obsolete and will be removed in a future release [javac] warning: [options] To suppress warnings about obsolete options, use -Xlint:-options. [javac] Note: Some input files use unchecked or unsafe operations. [javac] Note: Recompile with -Xlint:unchecked for details. [javac] 4 warnings [copy] Copying 1 file to /home/iurt/rpmbuild/BUILD/apache-ivy-2.4.0/build/classes/ant [copy] Copying 1 file to /home/iurt/rpmbuild/BUILD/apache-ivy-2.4.0/build/classes/ant/fr/jayasoft/ivy/ant compile-optional: [javac] Compiling 57 source files to /home/iurt/rpmbuild/BUILD/apache-ivy-2.4.0/build/classes/optional [javac] warning: [options] bootstrap class path not set in conjunction with -source 1.5 [javac] warning: [options] source value 1.5 is obsolete and will be removed in a future release [javac] warning: [options] target value 1.5 is obsolete and will be removed in a future release [javac] warning: [options] To suppress warnings about obsolete options, use -Xlint:-options. [javac] Note: Some input files use or override a deprecated API. [javac] Note: Recompile with -Xlint:deprecation for details. [javac] Note: Some input files use unchecked or unsafe operations. [javac] Note: Recompile with -Xlint:unchecked for details. [javac] 4 warnings default-version: jar: [mkdir] Created dir: /home/iurt/rpmbuild/BUILD/apache-ivy-2.4.0/build/artifact/jars [copy] Copying 1 file to /home/iurt/rpmbuild/BUILD/apache-ivy-2.4.0/build/artifact [copy] Copying 828 files to /home/iurt/rpmbuild/BUILD/apache-ivy-2.4.0/build/classes/all [jar] Building jar: /home/iurt/rpmbuild/BUILD/apache-ivy-2.4.0/build/artifact/jars/ivy.jar [copy] Copying 1 file to /home/iurt/rpmbuild/BUILD/apache-ivy-2.4.0/build/artifact [delete] Deleting: /home/iurt/rpmbuild/BUILD/apache-ivy-2.4.0/build/classes/core/module.properties javadoc: [javadoc] Generating Javadoc [javadoc] Javadoc execution [javadoc] Loading source file /home/iurt/rpmbuild/BUILD/apache-ivy-2.4.0/src/java/org/apache/ivy/Ivy.java... [javadoc] Loading source file /home/iurt/rpmbuild/BUILD/apache-ivy-2.4.0/src/java/org/apache/ivy/Ivy14.java... [javadoc] Loading source file /home/iurt/rpmbuild/BUILD/apache-ivy-2.4.0/src/java/org/apache/ivy/Main.java... [javadoc] Loading source file /home/iurt/rpmbuild/BUILD/apache-ivy-2.4.0/src/java/org/apache/ivy/ant/AddPathTask.java... [javadoc] Loading source file /home/iurt/rpmbuild/BUILD/apache-ivy-2.4.0/src/java/org/apache/ivy/ant/AntBuildTrigger.java... [javadoc] Loading source file /home/iurt/rpmbuild/BUILD/apache-ivy-2.4.0/src/java/org/apache/ivy/ant/AntCallTrigger.java... [javadoc] Loading source file /home/iurt/rpmbuild/BUILD/apache-ivy-2.4.0/src/java/org/apache/ivy/ant/AntMessageLogger.java... [javadoc] Loading source file /home/iurt/rpmbuild/BUILD/apache-ivy-2.4.0/src/java/org/apache/ivy/ant/BuildOBRTask.java... [javadoc] Loading source file /home/iurt/rpmbuild/BUILD/apache-ivy-2.4.0/src/java/org/apache/ivy/ant/ConvertManifestTask.java... [javadoc] Loading source file /home/iurt/rpmbuild/BUILD/apache-ivy-2.4.0/src/java/org/apache/ivy/ant/FixDepsTask.java... [javadoc] Loading source file /home/iurt/rpmbuild/BUILD/apache-ivy-2.4.0/src/java/org/apache/ivy/ant/IvyAntSettings.java... [javadoc] Loading source file /home/iurt/rpmbuild/BUILD/apache-ivy-2.4.0/src/java/org/apache/ivy/ant/IvyAntVariableContainer.java... [javadoc] Loading source file /home/iurt/rpmbuild/BUILD/apache-ivy-2.4.0/src/java/org/apache/ivy/ant/IvyArtifactProperty.java... [javadoc] Loading source file /home/iurt/rpmbuild/BUILD/apache-ivy-2.4.0/src/java/org/apache/ivy/ant/IvyArtifactReport.java... [javadoc] Loading source file /home/iurt/rpmbuild/BUILD/apache-ivy-2.4.0/src/java/org/apache/ivy/ant/IvyBuildList.java... [javadoc] Loading source file /home/iurt/rpmbuild/BUILD/apache-ivy-2.4.0/src/java/org/apache/ivy/ant/IvyBuildNumber.java... [javadoc] Loading source file /home/iurt/rpmbuild/BUILD/apache-ivy-2.4.0/src/java/org/apache/ivy/ant/IvyCacheFileset.java... [javadoc] Loading source file /home/iurt/rpmbuild/BUILD/apache-ivy-2.4.0/src/java/org/apache/ivy/ant/IvyCachePath.java... [javadoc] Loading source file /home/iurt/rpmbuild/BUILD/apache-ivy-2.4.0/src/java/org/apache/ivy/ant/IvyCacheTask.java... [javadoc] Loading source file /home/iurt/rpmbuild/BUILD/apache-ivy-2.4.0/src/java/org/apache/ivy/ant/IvyCheck.java... [javadoc] Loading source file /home/iurt/rpmbuild/BUILD/apache-ivy-2.4.0/src/java/org/apache/ivy/ant/IvyCleanCache.java... [javadoc] Loading source file /home/iurt/rpmbuild/BUILD/apache-ivy-2.4.0/src/java/org/apache/ivy/ant/IvyConfigure.java... [javadoc] Loading source file /home/iurt/rpmbuild/BUILD/apache-ivy-2.4.0/src/java/org/apache/ivy/ant/IvyConflict.java... [javadoc] Loading source file /home/iurt/rpmbuild/BUILD/apache-ivy-2.4.0/src/java/org/apache/ivy/ant/IvyConvertPom.java... [javadoc] Loading source file /home/iurt/rpmbuild/BUILD/apache-ivy-2.4.0/src/java/org/apache/ivy/ant/IvyDeliver.java... [javadoc] Loading source file /home/iurt/rpmbuild/BUILD/apache-ivy-2.4.0/src/java/org/apache/ivy/ant/IvyDependency.java... [javadoc] Loading source file /home/iurt/rpmbuild/BUILD/apache-ivy-2.4.0/src/java/org/apache/ivy/ant/IvyDependencyArtifact.java... [javadoc] Loading source file /home/iurt/rpmbuild/BUILD/apache-ivy-2.4.0/src/java/org/apache/ivy/ant/IvyDependencyConf.java... [javadoc] Loading source file /home/iurt/rpmbuild/BUILD/apache-ivy-2.4.0/src/java/org/apache/ivy/ant/IvyDependencyExclude.java... [javadoc] Loading source file /home/iurt/rpmbuild/BUILD/apache-ivy-2.4.0/src/java/org/apache/ivy/ant/IvyDependencyInclude.java... [javadoc] Loading source file /home/iurt/rpmbuild/BUILD/apache-ivy-2.4.0/src/java/org/apache/ivy/ant/IvyDependencyTree.java... [javadoc] Loading source file /home/iurt/rpmbuild/BUILD/apache-ivy-2.4.0/src/java/org/apache/ivy/ant/IvyDependencyUpdateChecker.java... [javadoc] Loading source file /home/iurt/rpmbuild/BUILD/apache-ivy-2.4.0/src/java/org/apache/ivy/ant/IvyExclude.java... [javadoc] Loading source file /home/iurt/rpmbuild/BUILD/apache-ivy-2.4.0/src/java/org/apache/ivy/ant/IvyExtractFromSources.java... [javadoc] Loading source file /home/iurt/rpmbuild/BUILD/apache-ivy-2.4.0/src/java/org/apache/ivy/ant/IvyFindRevision.java... [javadoc] Loading source file /home/iurt/rpmbuild/BUILD/apache-ivy-2.4.0/src/java/org/apache/ivy/ant/IvyInfo.java... [javadoc] Loading source file /home/iurt/rpmbuild/BUILD/apache-ivy-2.4.0/src/java/org/apache/ivy/ant/IvyInstall.java... [javadoc] Loading source file /home/iurt/rpmbuild/BUILD/apache-ivy-2.4.0/src/java/org/apache/ivy/ant/IvyListModules.java... [javadoc] Loading source file /home/iurt/rpmbuild/BUILD/apache-ivy-2.4.0/src/java/org/apache/ivy/ant/IvyMakePom.java... [javadoc] Loading source file /home/iurt/rpmbuild/BUILD/apache-ivy-2.4.0/src/java/org/apache/ivy/ant/IvyOverride.java... [javadoc] Loading source file /home/iurt/rpmbuild/BUILD/apache-ivy-2.4.0/src/java/org/apache/ivy/ant/IvyPostResolveTask.java... [javadoc] Loading source file /home/iurt/rpmbuild/BUILD/apache-ivy-2.4.0/src/java/org/apache/ivy/ant/IvyPublish.java... [javadoc] Loading source file /home/iurt/rpmbuild/BUILD/apache-ivy-2.4.0/src/java/org/apache/ivy/ant/IvyReport.java... [javadoc] Loading source file /home/iurt/rpmbuild/BUILD/apache-ivy-2.4.0/src/java/org/apache/ivy/ant/IvyRepositoryReport.java... [javadoc] Loading source file /home/iurt/rpmbuild/BUILD/apache-ivy-2.4.0/src/java/org/apache/ivy/ant/IvyResolve.java... [javadoc] Loading source file /home/iurt/rpmbuild/BUILD/apache-ivy-2.4.0/src/java/org/apache/ivy/ant/IvyResources.java... [javadoc] Loading source file /home/iurt/rpmbuild/BUILD/apache-ivy-2.4.0/src/java/org/apache/ivy/ant/IvyRetrieve.java... [javadoc] Loading source file /home/iurt/rpmbuild/BUILD/apache-ivy-2.4.0/src/java/org/apache/ivy/ant/IvyTask.java... [javadoc] Loading source file /home/iurt/rpmbuild/BUILD/apache-ivy-2.4.0/src/java/org/apache/ivy/ant/IvyVar.java... [javadoc] Loading source file /home/iurt/rpmbuild/BUILD/apache-ivy-2.4.0/src/java/org/apache/ivy/ant/MapperAdapter.java... [javadoc] Loading source file /home/iurt/rpmbuild/BUILD/apache-ivy-2.4.0/src/java/org/apache/ivy/ant/PackageMapping.java... [javadoc] Loading source file /home/iurt/rpmbuild/BUILD/apache-ivy-2.4.0/src/java/org/apache/ivy/core/ExecutionRelativeUrlResolver.java... [javadoc] Loading source file /home/iurt/rpmbuild/BUILD/apache-ivy-2.4.0/src/java/org/apache/ivy/core/IvyContext.java... [javadoc] Loading source file /home/iurt/rpmbuild/BUILD/apache-ivy-2.4.0/src/java/org/apache/ivy/core/IvyPatternHelper.java... [javadoc] Loading source file /home/iurt/rpmbuild/BUILD/apache-ivy-2.4.0/src/java/org/apache/ivy/core/IvyThread.java... [javadoc] Loading source file /home/iurt/rpmbuild/BUILD/apache-ivy-2.4.0/src/java/org/apache/ivy/core/LogOptions.java... [javadoc] Loading source file /home/iurt/rpmbuild/BUILD/apache-ivy-2.4.0/src/java/org/apache/ivy/core/NormalRelativeUrlResolver.java... [javadoc] Loading source file /home/iurt/rpmbuild/BUILD/apache-ivy-2.4.0/src/java/org/apache/ivy/core/RelativeUrlResolver.java... [javadoc] Loading source file /home/iurt/rpmbuild/BUILD/apache-ivy-2.4.0/src/java/org/apache/ivy/core/cache/ArtifactOrigin.java... [javadoc] Loading source file /home/iurt/rpmbuild/BUILD/apache-ivy-2.4.0/src/java/org/apache/ivy/core/cache/CacheDownloadOptions.java... [javadoc] Loading source file /home/iurt/rpmbuild/BUILD/apache-ivy-2.4.0/src/java/org/apache/ivy/core/cache/CacheMetadataOptions.java... [javadoc] Loading source file /home/iurt/rpmbuild/BUILD/apache-ivy-2.4.0/src/java/org/apache/ivy/core/cache/CacheResourceOptions.java... [javadoc] Loading source file /home/iurt/rpmbuild/BUILD/apache-ivy-2.4.0/src/java/org/apache/ivy/core/cache/CacheUtil.java... [javadoc] Loading source file /home/iurt/rpmbuild/BUILD/apache-ivy-2.4.0/src/java/org/apache/ivy/core/cache/DefaultRepositoryCacheManager.java... [javadoc] Loading source file /home/iurt/rpmbuild/BUILD/apache-ivy-2.4.0/src/java/org/apache/ivy/core/cache/DefaultResolutionCacheManager.java... [javadoc] Loading source file /home/iurt/rpmbuild/BUILD/apache-ivy-2.4.0/src/java/org/apache/ivy/core/cache/DownloadListener.java... [javadoc] Loading source file /home/iurt/rpmbuild/BUILD/apache-ivy-2.4.0/src/java/org/apache/ivy/core/cache/ModuleDescriptorMemoryCache.java... [javadoc] Loading source file /home/iurt/rpmbuild/BUILD/apache-ivy-2.4.0/src/java/org/apache/ivy/core/cache/ModuleDescriptorProvider.java... [javadoc] Loading source file /home/iurt/rpmbuild/BUILD/apache-ivy-2.4.0/src/java/org/apache/ivy/core/cache/ModuleDescriptorWriter.java... [javadoc] Loading source file /home/iurt/rpmbuild/BUILD/apache-ivy-2.4.0/src/java/org/apache/ivy/core/cache/ParserSettingsMonitor.java... [javadoc] Loading source file /home/iurt/rpmbuild/BUILD/apache-ivy-2.4.0/src/java/org/apache/ivy/core/cache/RepositoryCacheManager.java... [javadoc] Loading source file /home/iurt/rpmbuild/BUILD/apache-ivy-2.4.0/src/java/org/apache/ivy/core/cache/ResolutionCacheManager.java... [javadoc] Loading source file /home/iurt/rpmbuild/BUILD/apache-ivy-2.4.0/src/java/org/apache/ivy/core/check/CheckEngine.java... [javadoc] Loading source file /home/iurt/rpmbuild/BUILD/apache-ivy-2.4.0/src/java/org/apache/ivy/core/check/CheckEngineSettings.java... [javadoc] Loading source file /home/iurt/rpmbuild/BUILD/apache-ivy-2.4.0/src/java/org/apache/ivy/core/deliver/DefaultPublishingDRResolver.java... [javadoc] Loading source file /home/iurt/rpmbuild/BUILD/apache-ivy-2.4.0/src/java/org/apache/ivy/core/deliver/DeliverEngine.java... [javadoc] Loading source file /home/iurt/rpmbuild/BUILD/apache-ivy-2.4.0/src/java/org/apache/ivy/core/deliver/DeliverEngineSettings.java... [javadoc] Loading source file /home/iurt/rpmbuild/BUILD/apache-ivy-2.4.0/src/java/org/apache/ivy/core/deliver/DeliverOptions.java... [javadoc] Loading source file /home/iurt/rpmbuild/BUILD/apache-ivy-2.4.0/src/java/org/apache/ivy/core/deliver/PublishingDependencyRevisionResolver.java... [javadoc] Loading source file /home/iurt/rpmbuild/BUILD/apache-ivy-2.4.0/src/java/org/apache/ivy/core/event/EventManager.java... [javadoc] Loading source file /home/iurt/rpmbuild/BUILD/apache-ivy-2.4.0/src/java/org/apache/ivy/core/event/FilteredIvyListener.java... [javadoc] Loading source file /home/iurt/rpmbuild/BUILD/apache-ivy-2.4.0/src/java/org/apache/ivy/core/event/IvyEvent.java... [javadoc] Loading source file /home/iurt/rpmbuild/BUILD/apache-ivy-2.4.0/src/java/org/apache/ivy/core/event/IvyEventFilter.java... [javadoc] Loading source file /home/iurt/rpmbuild/BUILD/apache-ivy-2.4.0/src/java/org/apache/ivy/core/event/IvyListener.java... [javadoc] Loading source file /home/iurt/rpmbuild/BUILD/apache-ivy-2.4.0/src/java/org/apache/ivy/core/event/download/DownloadEvent.java... [javadoc] Loading source file /home/iurt/rpmbuild/BUILD/apache-ivy-2.4.0/src/java/org/apache/ivy/core/event/download/EndArtifactDownloadEvent.java... [javadoc] Loading source file /home/iurt/rpmbuild/BUILD/apache-ivy-2.4.0/src/java/org/apache/ivy/core/event/download/NeedArtifactEvent.java... [javadoc] Loading source file /home/iurt/rpmbuild/BUILD/apache-ivy-2.4.0/src/java/org/apache/ivy/core/event/download/PrepareDownloadEvent.java... [javadoc] Loading source file /home/iurt/rpmbuild/BUILD/apache-ivy-2.4.0/src/java/org/apache/ivy/core/event/download/StartArtifactDownloadEvent.java... [javadoc] Loading source file /home/iurt/rpmbuild/BUILD/apache-ivy-2.4.0/src/java/org/apache/ivy/core/event/publish/EndArtifactPublishEvent.java... [javadoc] Loading source file /home/iurt/rpmbuild/BUILD/apache-ivy-2.4.0/src/java/org/apache/ivy/core/event/publish/PublishEvent.java... [javadoc] Loading source file /home/iurt/rpmbuild/BUILD/apache-ivy-2.4.0/src/java/org/apache/ivy/core/event/publish/StartArtifactPublishEvent.java... [javadoc] Loading source file /home/iurt/rpmbuild/BUILD/apache-ivy-2.4.0/src/java/org/apache/ivy/core/event/resolve/EndResolveDependencyEvent.java... [javadoc] Loading source file /home/iurt/rpmbuild/BUILD/apache-ivy-2.4.0/src/java/org/apache/ivy/core/event/resolve/EndResolveEvent.java... [javadoc] Loading source file /home/iurt/rpmbuild/BUILD/apache-ivy-2.4.0/src/java/org/apache/ivy/core/event/resolve/ResolveDependencyEvent.java... [javadoc] Loading source file /home/iurt/rpmbuild/BUILD/apache-ivy-2.4.0/src/java/org/apache/ivy/core/event/resolve/ResolveEvent.java... [javadoc] Loading source file /home/iurt/rpmbuild/BUILD/apache-ivy-2.4.0/src/java/org/apache/ivy/core/event/resolve/StartResolveDependencyEvent.java... [javadoc] Loading source file /home/iurt/rpmbuild/BUILD/apache-ivy-2.4.0/src/java/org/apache/ivy/core/event/resolve/StartResolveEvent.java... [javadoc] Loading source file /home/iurt/rpmbuild/BUILD/apache-ivy-2.4.0/src/java/org/apache/ivy/core/event/retrieve/EndRetrieveArtifactEvent.java... [javadoc] Loading source file /home/iurt/rpmbuild/BUILD/apache-ivy-2.4.0/src/java/org/apache/ivy/core/event/retrieve/EndRetrieveEvent.java... [javadoc] Loading source file /home/iurt/rpmbuild/BUILD/apache-ivy-2.4.0/src/java/org/apache/ivy/core/event/retrieve/RetrieveArtifactEvent.java... [javadoc] Loading source file /home/iurt/rpmbuild/BUILD/apache-ivy-2.4.0/src/java/org/apache/ivy/core/event/retrieve/RetrieveEvent.java... [javadoc] Loading source file /home/iurt/rpmbuild/BUILD/apache-ivy-2.4.0/src/java/org/apache/ivy/core/event/retrieve/StartRetrieveArtifactEvent.java... [javadoc] Loading source file /home/iurt/rpmbuild/BUILD/apache-ivy-2.4.0/src/java/org/apache/ivy/core/event/retrieve/StartRetrieveEvent.java... [javadoc] Loading source file /home/iurt/rpmbuild/BUILD/apache-ivy-2.4.0/src/java/org/apache/ivy/core/install/InstallEngine.java... [javadoc] Loading source file /home/iurt/rpmbuild/BUILD/apache-ivy-2.4.0/src/java/org/apache/ivy/core/install/InstallEngineSettings.java... [javadoc] Loading source file /home/iurt/rpmbuild/BUILD/apache-ivy-2.4.0/src/java/org/apache/ivy/core/install/InstallOptions.java... [javadoc] Loading source file /home/iurt/rpmbuild/BUILD/apache-ivy-2.4.0/src/java/org/apache/ivy/core/module/descriptor/AbstractArtifact.java... [javadoc] Loading source file /home/iurt/rpmbuild/BUILD/apache-ivy-2.4.0/src/java/org/apache/ivy/core/module/descriptor/AbstractIncludeExcludeRule.java... [javadoc] Loading source file /home/iurt/rpmbuild/BUILD/apache-ivy-2.4.0/src/java/org/apache/ivy/core/module/descriptor/Artifact.java... [javadoc] Loading source file /home/iurt/rpmbuild/BUILD/apache-ivy-2.4.0/src/java/org/apache/ivy/core/module/descriptor/Configuration.java... [javadoc] Loading source file /home/iurt/rpmbuild/BUILD/apache-ivy-2.4.0/src/java/org/apache/ivy/core/module/descriptor/ConfigurationAware.java... [javadoc] Loading source file /home/iurt/rpmbuild/BUILD/apache-ivy-2.4.0/src/java/org/apache/ivy/core/module/descriptor/ConfigurationGroup.java... [javadoc] Loading source file /home/iurt/rpmbuild/BUILD/apache-ivy-2.4.0/src/java/org/apache/ivy/core/module/descriptor/ConfigurationIntersection.java... [javadoc] Loading source file /home/iurt/rpmbuild/BUILD/apache-ivy-2.4.0/src/java/org/apache/ivy/core/module/descriptor/DefaultArtifact.java... [javadoc] Loading source file /home/iurt/rpmbuild/BUILD/apache-ivy-2.4.0/src/java/org/apache/ivy/core/module/descriptor/DefaultDependencyArtifactDescriptor.java... [javadoc] Loading source file /home/iurt/rpmbuild/BUILD/apache-ivy-2.4.0/src/java/org/apache/ivy/core/module/descriptor/DefaultDependencyDescriptor.java... [javadoc] Loading source file /home/iurt/rpmbuild/BUILD/apache-ivy-2.4.0/src/java/org/apache/ivy/core/module/descriptor/DefaultExcludeRule.java... [javadoc] Loading source file /home/iurt/rpmbuild/BUILD/apache-ivy-2.4.0/src/java/org/apache/ivy/core/module/descriptor/DefaultExtendsDescriptor.java... [javadoc] Loading source file /home/iurt/rpmbuild/BUILD/apache-ivy-2.4.0/src/java/org/apache/ivy/core/module/descriptor/DefaultIncludeRule.java... [javadoc] Loading source file /home/iurt/rpmbuild/BUILD/apache-ivy-2.4.0/src/java/org/apache/ivy/core/module/descriptor/DefaultModuleDescriptor.java... [javadoc] Loading source file /home/iurt/rpmbuild/BUILD/apache-ivy-2.4.0/src/java/org/apache/ivy/core/module/descriptor/DependencyArtifactDescriptor.java... [javadoc] Loading source file /home/iurt/rpmbuild/BUILD/apache-ivy-2.4.0/src/java/org/apache/ivy/core/module/descriptor/DependencyDescriptor.java... [javadoc] Loading source file /home/iurt/rpmbuild/BUILD/apache-ivy-2.4.0/src/java/org/apache/ivy/core/module/descriptor/DependencyDescriptorMediator.java... [javadoc] Loading source file /home/iurt/rpmbuild/BUILD/apache-ivy-2.4.0/src/java/org/apache/ivy/core/module/descriptor/ExcludeRule.java... [javadoc] Loading source file /home/iurt/rpmbuild/BUILD/apache-ivy-2.4.0/src/java/org/apache/ivy/core/module/descriptor/ExtendsDescriptor.java... [javadoc] Loading source file /home/iurt/rpmbuild/BUILD/apache-ivy-2.4.0/src/java/org/apache/ivy/core/module/descriptor/ExtraInfoHolder.java... [javadoc] Loading source file /home/iurt/rpmbuild/BUILD/apache-ivy-2.4.0/src/java/org/apache/ivy/core/module/descriptor/IncludeRule.java... [javadoc] Loading source file /home/iurt/rpmbuild/BUILD/apache-ivy-2.4.0/src/java/org/apache/ivy/core/module/descriptor/InheritableItem.java... [javadoc] Loading source file /home/iurt/rpmbuild/BUILD/apache-ivy-2.4.0/src/java/org/apache/ivy/core/module/descriptor/License.java... [javadoc] Loading source file /home/iurt/rpmbuild/BUILD/apache-ivy-2.4.0/src/java/org/apache/ivy/core/module/descriptor/MDArtifact.java... [javadoc] Loading source file /home/iurt/rpmbuild/BUILD/apache-ivy-2.4.0/src/java/org/apache/ivy/core/module/descriptor/ModuleDescriptor.java... [javadoc] Loading source file /home/iurt/rpmbuild/BUILD/apache-ivy-2.4.0/src/java/org/apache/ivy/core/module/descriptor/OverrideDependencyDescriptorMediator.java... [javadoc] Loading source file /home/iurt/rpmbuild/BUILD/apache-ivy-2.4.0/src/java/org/apache/ivy/core/module/id/ArtifactId.java... [javadoc] Loading source file /home/iurt/rpmbuild/BUILD/apache-ivy-2.4.0/src/java/org/apache/ivy/core/module/id/ArtifactRevisionId.java... [javadoc] Loading source file /home/iurt/rpmbuild/BUILD/apache-ivy-2.4.0/src/java/org/apache/ivy/core/module/id/MatcherLookup.java... [javadoc] Loading source file /home/iurt/rpmbuild/BUILD/apache-ivy-2.4.0/src/java/org/apache/ivy/core/module/id/ModuleId.java... [javadoc] Loading source file /home/iurt/rpmbuild/BUILD/apache-ivy-2.4.0/src/java/org/apache/ivy/core/module/id/ModuleRevisionId.java... [javadoc] Loading source file /home/iurt/rpmbuild/BUILD/apache-ivy-2.4.0/src/java/org/apache/ivy/core/module/id/ModuleRules.java... [javadoc] Loading source file /home/iurt/rpmbuild/BUILD/apache-ivy-2.4.0/src/java/org/apache/ivy/core/module/status/Status.java... [javadoc] Loading source file /home/iurt/rpmbuild/BUILD/apache-ivy-2.4.0/src/java/org/apache/ivy/core/module/status/StatusManager.java... [javadoc] Loading source file /home/iurt/rpmbuild/BUILD/apache-ivy-2.4.0/src/java/org/apache/ivy/core/pack/ArchivePacking.java... [javadoc] Loading source file /home/iurt/rpmbuild/BUILD/apache-ivy-2.4.0/src/java/org/apache/ivy/core/pack/OsgiBundlePacking.java... [javadoc] Loading source file /home/iurt/rpmbuild/BUILD/apache-ivy-2.4.0/src/java/org/apache/ivy/core/pack/Pack200Packing.java... [javadoc] Loading source file /home/iurt/rpmbuild/BUILD/apache-ivy-2.4.0/src/java/org/apache/ivy/core/pack/PackagingManager.java... [javadoc] Loading source file /home/iurt/rpmbuild/BUILD/apache-ivy-2.4.0/src/java/org/apache/ivy/core/pack/PackingRegistry.java... [javadoc] Loading source file /home/iurt/rpmbuild/BUILD/apache-ivy-2.4.0/src/java/org/apache/ivy/core/pack/StreamPacking.java... [javadoc] Loading source file /home/iurt/rpmbuild/BUILD/apache-ivy-2.4.0/src/java/org/apache/ivy/core/pack/ZipPacking.java... [javadoc] Loading source file /home/iurt/rpmbuild/BUILD/apache-ivy-2.4.0/src/java/org/apache/ivy/core/publish/PublishEngine.java... [javadoc] Loading source file /home/iurt/rpmbuild/BUILD/apache-ivy-2.4.0/src/java/org/apache/ivy/core/publish/PublishEngineSettings.java... [javadoc] Loading source file /home/iurt/rpmbuild/BUILD/apache-ivy-2.4.0/src/java/org/apache/ivy/core/publish/PublishOptions.java... [javadoc] Loading source file /home/iurt/rpmbuild/BUILD/apache-ivy-2.4.0/src/java/org/apache/ivy/core/report/ArtifactDownloadReport.java... [javadoc] Loading source file /home/iurt/rpmbuild/BUILD/apache-ivy-2.4.0/src/java/org/apache/ivy/core/report/ConfigurationResolveReport.java... [javadoc] Loading source file /home/iurt/rpmbuild/BUILD/apache-ivy-2.4.0/src/java/org/apache/ivy/core/report/DownloadReport.java... [javadoc] Loading source file /home/iurt/rpmbuild/BUILD/apache-ivy-2.4.0/src/java/org/apache/ivy/core/report/DownloadStatus.java... [javadoc] Loading source file /home/iurt/rpmbuild/BUILD/apache-ivy-2.4.0/src/java/org/apache/ivy/core/report/MetadataArtifactDownloadReport.java... [javadoc] Loading source file /home/iurt/rpmbuild/BUILD/apache-ivy-2.4.0/src/java/org/apache/ivy/core/report/ResolveReport.java... [javadoc] Loading source file /home/iurt/rpmbuild/BUILD/apache-ivy-2.4.0/src/java/org/apache/ivy/core/repository/RepositoryManagementEngine.java... [javadoc] Loading source file /home/iurt/rpmbuild/BUILD/apache-ivy-2.4.0/src/java/org/apache/ivy/core/repository/RepositoryManagementEngineSettings.java... [javadoc] Loading source file /home/iurt/rpmbuild/BUILD/apache-ivy-2.4.0/src/java/org/apache/ivy/core/resolve/DownloadOptions.java... [javadoc] Loading source file /home/iurt/rpmbuild/BUILD/apache-ivy-2.4.0/src/java/org/apache/ivy/core/resolve/IvyNode.java... [javadoc] Loading source file /home/iurt/rpmbuild/BUILD/apache-ivy-2.4.0/src/java/org/apache/ivy/core/resolve/IvyNodeBlacklist.java... [javadoc] Loading source file /home/iurt/rpmbuild/BUILD/apache-ivy-2.4.0/src/java/org/apache/ivy/core/resolve/IvyNodeCallers.java... [javadoc] Loading source file /home/iurt/rpmbuild/BUILD/apache-ivy-2.4.0/src/java/org/apache/ivy/core/resolve/IvyNodeEviction.java... [javadoc] Loading source file /home/iurt/rpmbuild/BUILD/apache-ivy-2.4.0/src/java/org/apache/ivy/core/resolve/IvyNodeUsage.java... [javadoc] Loading source file /home/iurt/rpmbuild/BUILD/apache-ivy-2.4.0/src/java/org/apache/ivy/core/resolve/ResolveData.java... [javadoc] Loading source file /home/iurt/rpmbuild/BUILD/apache-ivy-2.4.0/src/java/org/apache/ivy/core/resolve/ResolveEngine.java... [javadoc] Loading source file /home/iurt/rpmbuild/BUILD/apache-ivy-2.4.0/src/java/org/apache/ivy/core/resolve/ResolveEngineSettings.java... [javadoc] Loading source file /home/iurt/rpmbuild/BUILD/apache-ivy-2.4.0/src/java/org/apache/ivy/core/resolve/ResolveOptions.java... [javadoc] Loading source file /home/iurt/rpmbuild/BUILD/apache-ivy-2.4.0/src/java/org/apache/ivy/core/resolve/ResolveProcessException.java... [javadoc] Loading source file /home/iurt/rpmbuild/BUILD/apache-ivy-2.4.0/src/java/org/apache/ivy/core/resolve/ResolvedModuleRevision.java... [javadoc] Loading source file /home/iurt/rpmbuild/BUILD/apache-ivy-2.4.0/src/java/org/apache/ivy/core/resolve/RestartResolveProcess.java... [javadoc] Loading source file /home/iurt/rpmbuild/BUILD/apache-ivy-2.4.0/src/java/org/apache/ivy/core/resolve/VisitData.java... [javadoc] Loading source file /home/iurt/rpmbuild/BUILD/apache-ivy-2.4.0/src/java/org/apache/ivy/core/resolve/VisitNode.java... [javadoc] Loading source file /home/iurt/rpmbuild/BUILD/apache-ivy-2.4.0/src/java/org/apache/ivy/core/retrieve/FileNameMapper.java... [javadoc] Loading source file /home/iurt/rpmbuild/BUILD/apache-ivy-2.4.0/src/java/org/apache/ivy/core/retrieve/RetrieveEngine.java... [javadoc] Loading source file /home/iurt/rpmbuild/BUILD/apache-ivy-2.4.0/src/java/org/apache/ivy/core/retrieve/RetrieveEngineSettings.java... [javadoc] Loading source file /home/iurt/rpmbuild/BUILD/apache-ivy-2.4.0/src/java/org/apache/ivy/core/retrieve/RetrieveOptions.java... [javadoc] Loading source file /home/iurt/rpmbuild/BUILD/apache-ivy-2.4.0/src/java/org/apache/ivy/core/retrieve/RetrieveReport.java... [javadoc] Loading source file /home/iurt/rpmbuild/BUILD/apache-ivy-2.4.0/src/java/org/apache/ivy/core/search/ModuleEntry.java... [javadoc] Loading source file /home/iurt/rpmbuild/BUILD/apache-ivy-2.4.0/src/java/org/apache/ivy/core/search/OrganisationEntry.java... [javadoc] Loading source file /home/iurt/rpmbuild/BUILD/apache-ivy-2.4.0/src/java/org/apache/ivy/core/search/RevisionEntry.java... [javadoc] Loading source file /home/iurt/rpmbuild/BUILD/apache-ivy-2.4.0/src/java/org/apache/ivy/core/search/SearchEngine.java... [javadoc] Loading source file /home/iurt/rpmbuild/BUILD/apache-ivy-2.4.0/src/java/org/apache/ivy/core/settings/IvyPattern.java... [javadoc] Loading source file /home/iurt/rpmbuild/BUILD/apache-ivy-2.4.0/src/java/org/apache/ivy/core/settings/IvySettings.java... [javadoc] Loading source file /home/iurt/rpmbuild/BUILD/apache-ivy-2.4.0/src/java/org/apache/ivy/core/settings/IvyVariableContainer.java... [javadoc] Loading source file /home/iurt/rpmbuild/BUILD/apache-ivy-2.4.0/src/java/org/apache/ivy/core/settings/IvyVariableContainerImpl.java... [javadoc] Loading source file /home/iurt/rpmbuild/BUILD/apache-ivy-2.4.0/src/java/org/apache/ivy/core/settings/Validatable.java... [javadoc] Loading source file /home/iurt/rpmbuild/BUILD/apache-ivy-2.4.0/src/java/org/apache/ivy/core/settings/XmlSettingsParser.java... [javadoc] Loading source file /home/iurt/rpmbuild/BUILD/apache-ivy-2.4.0/src/java/org/apache/ivy/core/sort/CollectionOfModulesToSort.java... [javadoc] Loading source file /home/iurt/rpmbuild/BUILD/apache-ivy-2.4.0/src/java/org/apache/ivy/core/sort/MessageBasedNonMatchingVersionReporter.java... [javadoc] Loading source file /home/iurt/rpmbuild/BUILD/apache-ivy-2.4.0/src/java/org/apache/ivy/core/sort/ModuleDescriptorSorter.java... [javadoc] Loading source file /home/iurt/rpmbuild/BUILD/apache-ivy-2.4.0/src/java/org/apache/ivy/core/sort/ModuleInSort.java... [javadoc] Loading source file /home/iurt/rpmbuild/BUILD/apache-ivy-2.4.0/src/java/org/apache/ivy/core/sort/NonMatchingVersionReporter.java... [javadoc] Loading source file /home/iurt/rpmbuild/BUILD/apache-ivy-2.4.0/src/java/org/apache/ivy/core/sort/SilentNonMatchingVersionReporter.java... [javadoc] Loading source file /home/iurt/rpmbuild/BUILD/apache-ivy-2.4.0/src/java/org/apache/ivy/core/sort/SimpleSortEngineSettings.java... [javadoc] Loading source file /home/iurt/rpmbuild/BUILD/apache-ivy-2.4.0/src/java/org/apache/ivy/core/sort/SortEngine.java... [javadoc] Loading source file /home/iurt/rpmbuild/BUILD/apache-ivy-2.4.0/src/java/org/apache/ivy/core/sort/SortEngineSettings.java... [javadoc] Loading source file /home/iurt/rpmbuild/BUILD/apache-ivy-2.4.0/src/java/org/apache/ivy/core/sort/SortOptions.java... [javadoc] Loading source file /home/iurt/rpmbuild/BUILD/apache-ivy-2.4.0/src/java/org/apache/ivy/core/sort/WarningNonMatchingVersionReporter.java... [javadoc] Loading source file /home/iurt/rpmbuild/BUILD/apache-ivy-2.4.0/src/java/org/apache/ivy/osgi/core/BundleArtifact.java... [javadoc] Loading source file /home/iurt/rpmbuild/BUILD/apache-ivy-2.4.0/src/java/org/apache/ivy/osgi/core/BundleCapability.java... [javadoc] Loading source file /home/iurt/rpmbuild/BUILD/apache-ivy-2.4.0/src/java/org/apache/ivy/osgi/core/BundleInfo.java... [javadoc] Loading source file /home/iurt/rpmbuild/BUILD/apache-ivy-2.4.0/src/java/org/apache/ivy/osgi/core/BundleInfoAdapter.java... [javadoc] Loading source file /home/iurt/rpmbuild/BUILD/apache-ivy-2.4.0/src/java/org/apache/ivy/osgi/core/BundleRequirement.java... [javadoc] Loading source file /home/iurt/rpmbuild/BUILD/apache-ivy-2.4.0/src/java/org/apache/ivy/osgi/core/ExecutionEnvironmentProfile.java... [javadoc] Loading source file /home/iurt/rpmbuild/BUILD/apache-ivy-2.4.0/src/java/org/apache/ivy/osgi/core/ExecutionEnvironmentProfileProvider.java... [javadoc] Loading source file /home/iurt/rpmbuild/BUILD/apache-ivy-2.4.0/src/java/org/apache/ivy/osgi/core/ExportPackage.java... [javadoc] Loading source file /home/iurt/rpmbuild/BUILD/apache-ivy-2.4.0/src/java/org/apache/ivy/osgi/core/ManifestHeaderElement.java... [javadoc] Loading source file /home/iurt/rpmbuild/BUILD/apache-ivy-2.4.0/src/java/org/apache/ivy/osgi/core/ManifestHeaderValue.java... [javadoc] Loading source file /home/iurt/rpmbuild/BUILD/apache-ivy-2.4.0/src/java/org/apache/ivy/osgi/core/ManifestParser.java... [javadoc] Loading source file /home/iurt/rpmbuild/BUILD/apache-ivy-2.4.0/src/java/org/apache/ivy/osgi/core/OSGiManifestParser.java... [javadoc] Loading source file /home/iurt/rpmbuild/BUILD/apache-ivy-2.4.0/src/java/org/apache/ivy/osgi/core/OsgiLatestStrategy.java... [javadoc] Loading source file /home/iurt/rpmbuild/BUILD/apache-ivy-2.4.0/src/java/org/apache/ivy/osgi/filter/AndFilter.java... [javadoc] Loading source file /home/iurt/rpmbuild/BUILD/apache-ivy-2.4.0/src/java/org/apache/ivy/osgi/filter/CompareFilter.java... [javadoc] Loading source file /home/iurt/rpmbuild/BUILD/apache-ivy-2.4.0/src/java/org/apache/ivy/osgi/filter/MultiOperatorFilter.java... [javadoc] Loading source file /home/iurt/rpmbuild/BUILD/apache-ivy-2.4.0/src/java/org/apache/ivy/osgi/filter/NotFilter.java... [javadoc] Loading source file /home/iurt/rpmbuild/BUILD/apache-ivy-2.4.0/src/java/org/apache/ivy/osgi/filter/OSGiFilter.java... [javadoc] Loading source file /home/iurt/rpmbuild/BUILD/apache-ivy-2.4.0/src/java/org/apache/ivy/osgi/filter/OSGiFilterParser.java... [javadoc] Loading source file /home/iurt/rpmbuild/BUILD/apache-ivy-2.4.0/src/java/org/apache/ivy/osgi/filter/OrFilter.java... [javadoc] Loading source file /home/iurt/rpmbuild/BUILD/apache-ivy-2.4.0/src/java/org/apache/ivy/osgi/filter/UniOperatorFilter.java... [javadoc] Loading source file /home/iurt/rpmbuild/BUILD/apache-ivy-2.4.0/src/java/org/apache/ivy/osgi/obr/OBRResolver.java... [javadoc] Loading source file /home/iurt/rpmbuild/BUILD/apache-ivy-2.4.0/src/java/org/apache/ivy/osgi/obr/xml/Capability.java... [javadoc] Loading source file /home/iurt/rpmbuild/BUILD/apache-ivy-2.4.0/src/java/org/apache/ivy/osgi/obr/xml/CapabilityAdapter.java... [javadoc] Loading source file /home/iurt/rpmbuild/BUILD/apache-ivy-2.4.0/src/java/org/apache/ivy/osgi/obr/xml/CapabilityProperty.java... [javadoc] Loading source file /home/iurt/rpmbuild/BUILD/apache-ivy-2.4.0/src/java/org/apache/ivy/osgi/obr/xml/OBRXMLParser.java... [javadoc] Loading source file /home/iurt/rpmbuild/BUILD/apache-ivy-2.4.0/src/java/org/apache/ivy/osgi/obr/xml/OBRXMLWriter.java... [javadoc] Loading source file /home/iurt/rpmbuild/BUILD/apache-ivy-2.4.0/src/java/org/apache/ivy/osgi/obr/xml/Requirement.java... [javadoc] Loading source file /home/iurt/rpmbuild/BUILD/apache-ivy-2.4.0/src/java/org/apache/ivy/osgi/obr/xml/RequirementAdapter.java... [javadoc] Loading source file /home/iurt/rpmbuild/BUILD/apache-ivy-2.4.0/src/java/org/apache/ivy/osgi/obr/xml/UnsupportedFilterException.java... [javadoc] Loading source file /home/iurt/rpmbuild/BUILD/apache-ivy-2.4.0/src/java/org/apache/ivy/osgi/p2/P2Artifact.java... [javadoc] Loading source file /home/iurt/rpmbuild/BUILD/apache-ivy-2.4.0/src/java/org/apache/ivy/osgi/p2/P2ArtifactParser.java... [javadoc] Loading source file /home/iurt/rpmbuild/BUILD/apache-ivy-2.4.0/src/java/org/apache/ivy/osgi/p2/P2CompositeParser.java... [javadoc] Loading source file /home/iurt/rpmbuild/BUILD/apache-ivy-2.4.0/src/java/org/apache/ivy/osgi/p2/P2Descriptor.java... [javadoc] Loading source file /home/iurt/rpmbuild/BUILD/apache-ivy-2.4.0/src/java/org/apache/ivy/osgi/p2/P2MetadataParser.java... [javadoc] Loading source file /home/iurt/rpmbuild/BUILD/apache-ivy-2.4.0/src/java/org/apache/ivy/osgi/p2/PropertiesParser.java... [javadoc] Loading source file /home/iurt/rpmbuild/BUILD/apache-ivy-2.4.0/src/java/org/apache/ivy/osgi/p2/XMLInputParser.java... [javadoc] Loading source file /home/iurt/rpmbuild/BUILD/apache-ivy-2.4.0/src/java/org/apache/ivy/osgi/repo/AbstractFSManifestIterable.java... [javadoc] Loading source file /home/iurt/rpmbuild/BUILD/apache-ivy-2.4.0/src/java/org/apache/ivy/osgi/repo/AbstractOSGiResolver.java... [javadoc] Loading source file /home/iurt/rpmbuild/BUILD/apache-ivy-2.4.0/src/java/org/apache/ivy/osgi/repo/AggregatedOSGiResolver.java... [javadoc] Loading source file /home/iurt/rpmbuild/BUILD/apache-ivy-2.4.0/src/java/org/apache/ivy/osgi/repo/AggregatedRepoDescriptor.java... [javadoc] Loading source file /home/iurt/rpmbuild/BUILD/apache-ivy-2.4.0/src/java/org/apache/ivy/osgi/repo/ArtifactReportManifestIterable.java... [javadoc] Loading source file /home/iurt/rpmbuild/BUILD/apache-ivy-2.4.0/src/java/org/apache/ivy/osgi/repo/BundleCapabilityAndLocation.java... [javadoc] Loading source file /home/iurt/rpmbuild/BUILD/apache-ivy-2.4.0/src/java/org/apache/ivy/osgi/repo/BundleRepoDescriptor.java... [javadoc] Loading source file /home/iurt/rpmbuild/BUILD/apache-ivy-2.4.0/src/java/org/apache/ivy/osgi/repo/EditableRepoDescriptor.java... [javadoc] Loading source file /home/iurt/rpmbuild/BUILD/apache-ivy-2.4.0/src/java/org/apache/ivy/osgi/repo/FSManifestIterable.java... [javadoc] Loading source file /home/iurt/rpmbuild/BUILD/apache-ivy-2.4.0/src/java/org/apache/ivy/osgi/repo/ManifestAndLocation.java... [javadoc] Loading source file /home/iurt/rpmbuild/BUILD/apache-ivy-2.4.0/src/java/org/apache/ivy/osgi/repo/ModuleDescriptorWrapper.java... [javadoc] Loading source file /home/iurt/rpmbuild/BUILD/apache-ivy-2.4.0/src/java/org/apache/ivy/osgi/repo/RelativeURLRepository.java... [javadoc] Loading source file /home/iurt/rpmbuild/BUILD/apache-ivy-2.4.0/src/java/org/apache/ivy/osgi/repo/RepoDescriptor.java... [javadoc] Loading source file /home/iurt/rpmbuild/BUILD/apache-ivy-2.4.0/src/java/org/apache/ivy/osgi/repo/RepositoryManifestIterable.java... [javadoc] Loading source file /home/iurt/rpmbuild/BUILD/apache-ivy-2.4.0/src/java/org/apache/ivy/osgi/repo/ResolverManifestIterable.java... [javadoc] Loading source file /home/iurt/rpmbuild/BUILD/apache-ivy-2.4.0/src/java/org/apache/ivy/osgi/updatesite/PluginAdapter.java... [javadoc] Loading source file /home/iurt/rpmbuild/BUILD/apache-ivy-2.4.0/src/java/org/apache/ivy/osgi/updatesite/UpdateSiteDescriptor.java... [javadoc] Loading source file /home/iurt/rpmbuild/BUILD/apache-ivy-2.4.0/src/java/org/apache/ivy/osgi/updatesite/UpdateSiteLoader.java... [javadoc] Loading source file /home/iurt/rpmbuild/BUILD/apache-ivy-2.4.0/src/java/org/apache/ivy/osgi/updatesite/UpdateSiteResolver.java... [javadoc] Loading source file /home/iurt/rpmbuild/BUILD/apache-ivy-2.4.0/src/java/org/apache/ivy/osgi/updatesite/xml/Archive.java... [javadoc] Loading source file /home/iurt/rpmbuild/BUILD/apache-ivy-2.4.0/src/java/org/apache/ivy/osgi/updatesite/xml/CategoryDef.java... [javadoc] Loading source file /home/iurt/rpmbuild/BUILD/apache-ivy-2.4.0/src/java/org/apache/ivy/osgi/updatesite/xml/EclipseFeature.java... [javadoc] Loading source file /home/iurt/rpmbuild/BUILD/apache-ivy-2.4.0/src/java/org/apache/ivy/osgi/updatesite/xml/EclipsePlugin.java... [javadoc] Loading source file /home/iurt/rpmbuild/BUILD/apache-ivy-2.4.0/src/java/org/apache/ivy/osgi/updatesite/xml/EclipseUpdateSiteParser.java... [javadoc] Loading source file /home/iurt/rpmbuild/BUILD/apache-ivy-2.4.0/src/java/org/apache/ivy/osgi/updatesite/xml/FeatureParser.java... [javadoc] Loading source file /home/iurt/rpmbuild/BUILD/apache-ivy-2.4.0/src/java/org/apache/ivy/osgi/updatesite/xml/Require.java... [javadoc] Loading source file /home/iurt/rpmbuild/BUILD/apache-ivy-2.4.0/src/java/org/apache/ivy/osgi/updatesite/xml/UpdateSite.java... [javadoc] Loading source file /home/iurt/rpmbuild/BUILD/apache-ivy-2.4.0/src/java/org/apache/ivy/osgi/updatesite/xml/UpdateSiteDigestParser.java... [javadoc] Loading source file /home/iurt/rpmbuild/BUILD/apache-ivy-2.4.0/src/java/org/apache/ivy/osgi/util/DelegatingHandler.java... [javadoc] Loading source file /home/iurt/rpmbuild/BUILD/apache-ivy-2.4.0/src/java/org/apache/ivy/osgi/util/ParseUtil.java... [javadoc] Loading source file /home/iurt/rpmbuild/BUILD/apache-ivy-2.4.0/src/java/org/apache/ivy/osgi/util/Version.java... [javadoc] Loading source file /home/iurt/rpmbuild/BUILD/apache-ivy-2.4.0/src/java/org/apache/ivy/osgi/util/VersionComparator.java... [javadoc] Loading source file /home/iurt/rpmbuild/BUILD/apache-ivy-2.4.0/src/java/org/apache/ivy/osgi/util/VersionRange.java... [javadoc] Loading source file /home/iurt/rpmbuild/BUILD/apache-ivy-2.4.0/src/java/org/apache/ivy/osgi/util/ZipUtil.java... [javadoc] Loading source file /home/iurt/rpmbuild/BUILD/apache-ivy-2.4.0/src/java/org/apache/ivy/plugins/IvySettingsAware.java... [javadoc] Loading source file /home/iurt/rpmbuild/BUILD/apache-ivy-2.4.0/src/java/org/apache/ivy/plugins/circular/AbstractCircularDependencyStrategy.java... [javadoc] Loading source file /home/iurt/rpmbuild/BUILD/apache-ivy-2.4.0/src/java/org/apache/ivy/plugins/circular/AbstractLogCircularDependencyStrategy.java... [javadoc] Loading source file /home/iurt/rpmbuild/BUILD/apache-ivy-2.4.0/src/java/org/apache/ivy/plugins/circular/CircularDependencyException.java... [javadoc] Loading source file /home/iurt/rpmbuild/BUILD/apache-ivy-2.4.0/src/java/org/apache/ivy/plugins/circular/CircularDependencyHelper.java... [javadoc] Loading source file /home/iurt/rpmbuild/BUILD/apache-ivy-2.4.0/src/java/org/apache/ivy/plugins/circular/CircularDependencyStrategy.java... [javadoc] Loading source file /home/iurt/rpmbuild/BUILD/apache-ivy-2.4.0/src/java/org/apache/ivy/plugins/circular/ErrorCircularDependencyStrategy.java... [javadoc] Loading source file /home/iurt/rpmbuild/BUILD/apache-ivy-2.4.0/src/java/org/apache/ivy/plugins/circular/IgnoreCircularDependencyStrategy.java... [javadoc] Loading source file /home/iurt/rpmbuild/BUILD/apache-ivy-2.4.0/src/java/org/apache/ivy/plugins/circular/WarnCircularDependencyStrategy.java... [javadoc] Loading source file /home/iurt/rpmbuild/BUILD/apache-ivy-2.4.0/src/java/org/apache/ivy/plugins/conflict/AbstractConflictManager.java... [javadoc] Loading source file /home/iurt/rpmbuild/BUILD/apache-ivy-2.4.0/src/java/org/apache/ivy/plugins/conflict/ConflictManager.java... [javadoc] Loading source file /home/iurt/rpmbuild/BUILD/apache-ivy-2.4.0/src/java/org/apache/ivy/plugins/conflict/FixedConflictManager.java... [javadoc] Loading source file /home/iurt/rpmbuild/BUILD/apache-ivy-2.4.0/src/java/org/apache/ivy/plugins/conflict/LatestCompatibleConflictManager.java... [javadoc] Loading source file /home/iurt/rpmbuild/BUILD/apache-ivy-2.4.0/src/java/org/apache/ivy/plugins/conflict/LatestConflictManager.java... [javadoc] Loading source file /home/iurt/rpmbuild/BUILD/apache-ivy-2.4.0/src/java/org/apache/ivy/plugins/conflict/NoConflictManager.java... [javadoc] Loading source file /home/iurt/rpmbuild/BUILD/apache-ivy-2.4.0/src/java/org/apache/ivy/plugins/conflict/RegexpConflictManager.java... [javadoc] Loading source file /home/iurt/rpmbuild/BUILD/apache-ivy-2.4.0/src/java/org/apache/ivy/plugins/conflict/StrictConflictException.java... [javadoc] Loading source file /home/iurt/rpmbuild/BUILD/apache-ivy-2.4.0/src/java/org/apache/ivy/plugins/conflict/StrictConflictManager.java... [javadoc] Loading source file /home/iurt/rpmbuild/BUILD/apache-ivy-2.4.0/src/java/org/apache/ivy/plugins/latest/AbstractLatestStrategy.java... [javadoc] Loading source file /home/iurt/rpmbuild/BUILD/apache-ivy-2.4.0/src/java/org/apache/ivy/plugins/latest/ArtifactInfo.java... [javadoc] Loading source file /home/iurt/rpmbuild/BUILD/apache-ivy-2.4.0/src/java/org/apache/ivy/plugins/latest/ComparatorLatestStrategy.java... [javadoc] Loading source file /home/iurt/rpmbuild/BUILD/apache-ivy-2.4.0/src/java/org/apache/ivy/plugins/latest/LatestLexicographicStrategy.java... [javadoc] Loading source file /home/iurt/rpmbuild/BUILD/apache-ivy-2.4.0/src/java/org/apache/ivy/plugins/latest/LatestRevisionStrategy.java... [javadoc] Loading source file /home/iurt/rpmbuild/BUILD/apache-ivy-2.4.0/src/java/org/apache/ivy/plugins/latest/LatestStrategy.java... [javadoc] Loading source file /home/iurt/rpmbuild/BUILD/apache-ivy-2.4.0/src/java/org/apache/ivy/plugins/latest/LatestTimeStrategy.java... [javadoc] Loading source file /home/iurt/rpmbuild/BUILD/apache-ivy-2.4.0/src/java/org/apache/ivy/plugins/lock/AbstractLockStrategy.java... [javadoc] Loading source file /home/iurt/rpmbuild/BUILD/apache-ivy-2.4.0/src/java/org/apache/ivy/plugins/lock/ArtifactLockStrategy.java... [javadoc] Loading source file /home/iurt/rpmbuild/BUILD/apache-ivy-2.4.0/src/java/org/apache/ivy/plugins/lock/CreateFileLockStrategy.java... [javadoc] Loading source file /home/iurt/rpmbuild/BUILD/apache-ivy-2.4.0/src/java/org/apache/ivy/plugins/lock/DeleteOnExitHook.java... [javadoc] Loading source file /home/iurt/rpmbuild/BUILD/apache-ivy-2.4.0/src/java/org/apache/ivy/plugins/lock/FileBasedLockStrategy.java... [javadoc] Loading source file /home/iurt/rpmbuild/BUILD/apache-ivy-2.4.0/src/java/org/apache/ivy/plugins/lock/LockStrategy.java... [javadoc] Loading source file /home/iurt/rpmbuild/BUILD/apache-ivy-2.4.0/src/java/org/apache/ivy/plugins/lock/NIOFileLockStrategy.java... [javadoc] Loading source file /home/iurt/rpmbuild/BUILD/apache-ivy-2.4.0/src/java/org/apache/ivy/plugins/lock/NoLockStrategy.java... [javadoc] Loading source file /home/iurt/rpmbuild/BUILD/apache-ivy-2.4.0/src/java/org/apache/ivy/plugins/matcher/AbstractPatternMatcher.java... [javadoc] Loading source file /home/iurt/rpmbuild/BUILD/apache-ivy-2.4.0/src/java/org/apache/ivy/plugins/matcher/AnyMatcher.java... [javadoc] Loading source file /home/iurt/rpmbuild/BUILD/apache-ivy-2.4.0/src/java/org/apache/ivy/plugins/matcher/ExactOrRegexpPatternMatcher.java... [javadoc] Loading source file /home/iurt/rpmbuild/BUILD/apache-ivy-2.4.0/src/java/org/apache/ivy/plugins/matcher/ExactPatternMatcher.java... [javadoc] Loading source file /home/iurt/rpmbuild/BUILD/apache-ivy-2.4.0/src/java/org/apache/ivy/plugins/matcher/GlobPatternMatcher.java... [javadoc] Loading source file /home/iurt/rpmbuild/BUILD/apache-ivy-2.4.0/src/java/org/apache/ivy/plugins/matcher/MapMatcher.java... [javadoc] Loading source file /home/iurt/rpmbuild/BUILD/apache-ivy-2.4.0/src/java/org/apache/ivy/plugins/matcher/Matcher.java... [javadoc] Loading source file /home/iurt/rpmbuild/BUILD/apache-ivy-2.4.0/src/java/org/apache/ivy/plugins/matcher/MatcherHelper.java... [javadoc] Loading source file /home/iurt/rpmbuild/BUILD/apache-ivy-2.4.0/src/java/org/apache/ivy/plugins/matcher/NoMatcher.java... [javadoc] Loading source file /home/iurt/rpmbuild/BUILD/apache-ivy-2.4.0/src/java/org/apache/ivy/plugins/matcher/PatternMatcher.java... [javadoc] Loading source file /home/iurt/rpmbuild/BUILD/apache-ivy-2.4.0/src/java/org/apache/ivy/plugins/matcher/RegexpPatternMatcher.java... [javadoc] Loading source file /home/iurt/rpmbuild/BUILD/apache-ivy-2.4.0/src/java/org/apache/ivy/plugins/namespace/MRIDRule.java... [javadoc] Loading source file /home/iurt/rpmbuild/BUILD/apache-ivy-2.4.0/src/java/org/apache/ivy/plugins/namespace/MRIDTransformationRule.java... [javadoc] Loading source file /home/iurt/rpmbuild/BUILD/apache-ivy-2.4.0/src/java/org/apache/ivy/plugins/namespace/NameSpaceHelper.java... [javadoc] Loading source file /home/iurt/rpmbuild/BUILD/apache-ivy-2.4.0/src/java/org/apache/ivy/plugins/namespace/Namespace.java... [javadoc] Loading source file /home/iurt/rpmbuild/BUILD/apache-ivy-2.4.0/src/java/org/apache/ivy/plugins/namespace/NamespaceRule.java... [javadoc] Loading source file /home/iurt/rpmbuild/BUILD/apache-ivy-2.4.0/src/java/org/apache/ivy/plugins/namespace/NamespaceTransformer.java... [javadoc] Loading source file /home/iurt/rpmbuild/BUILD/apache-ivy-2.4.0/src/java/org/apache/ivy/plugins/parser/AbstractModuleDescriptorParser.java... [javadoc] Loading source file /home/iurt/rpmbuild/BUILD/apache-ivy-2.4.0/src/java/org/apache/ivy/plugins/parser/ModuleDescriptorParser.java... [javadoc] Loading source file /home/iurt/rpmbuild/BUILD/apache-ivy-2.4.0/src/java/org/apache/ivy/plugins/parser/ModuleDescriptorParserRegistry.java... [javadoc] Loading source file /home/iurt/rpmbuild/BUILD/apache-ivy-2.4.0/src/java/org/apache/ivy/plugins/parser/ParserSettings.java... [javadoc] Loading source file /home/iurt/rpmbuild/BUILD/apache-ivy-2.4.0/src/java/org/apache/ivy/plugins/parser/m2/DefaultPomDependencyMgt.java... [javadoc] Loading source file /home/iurt/rpmbuild/BUILD/apache-ivy-2.4.0/src/java/org/apache/ivy/plugins/parser/m2/PomDependencyMgt.java... [javadoc] Loading source file /home/iurt/rpmbuild/BUILD/apache-ivy-2.4.0/src/java/org/apache/ivy/plugins/parser/m2/PomModuleDescriptorBuilder.java... [javadoc] Loading source file /home/iurt/rpmbuild/BUILD/apache-ivy-2.4.0/src/java/org/apache/ivy/plugins/parser/m2/PomModuleDescriptorParser.java... [javadoc] Loading source file /home/iurt/rpmbuild/BUILD/apache-ivy-2.4.0/src/java/org/apache/ivy/plugins/parser/m2/PomModuleDescriptorWriter.java... [javadoc] Loading source file /home/iurt/rpmbuild/BUILD/apache-ivy-2.4.0/src/java/org/apache/ivy/plugins/parser/m2/PomReader.java... [javadoc] Loading source file /home/iurt/rpmbuild/BUILD/apache-ivy-2.4.0/src/java/org/apache/ivy/plugins/parser/m2/PomWriterOptions.java... [javadoc] Loading source file /home/iurt/rpmbuild/BUILD/apache-ivy-2.4.0/src/java/org/apache/ivy/plugins/parser/xml/UpdateOptions.java... [javadoc] Loading source file /home/iurt/rpmbuild/BUILD/apache-ivy-2.4.0/src/java/org/apache/ivy/plugins/parser/xml/XmlModuleDescriptorParser.java... [javadoc] Loading source file /home/iurt/rpmbuild/BUILD/apache-ivy-2.4.0/src/java/org/apache/ivy/plugins/parser/xml/XmlModuleDescriptorUpdater.java... [javadoc] Loading source file /home/iurt/rpmbuild/BUILD/apache-ivy-2.4.0/src/java/org/apache/ivy/plugins/parser/xml/XmlModuleDescriptorWriter.java... [javadoc] Loading source file /home/iurt/rpmbuild/BUILD/apache-ivy-2.4.0/src/java/org/apache/ivy/plugins/report/LogReportOutputter.java... [javadoc] Loading source file /home/iurt/rpmbuild/BUILD/apache-ivy-2.4.0/src/java/org/apache/ivy/plugins/report/ReportOutputter.java... [javadoc] Loading source file /home/iurt/rpmbuild/BUILD/apache-ivy-2.4.0/src/java/org/apache/ivy/plugins/report/XmlReportOutputter.java... [javadoc] Loading source file /home/iurt/rpmbuild/BUILD/apache-ivy-2.4.0/src/java/org/apache/ivy/plugins/report/XmlReportParser.java... [javadoc] Loading source file /home/iurt/rpmbuild/BUILD/apache-ivy-2.4.0/src/java/org/apache/ivy/plugins/report/XmlReportWriter.java... [javadoc] Loading source file /home/iurt/rpmbuild/BUILD/apache-ivy-2.4.0/src/java/org/apache/ivy/plugins/repository/AbstractRepository.java... [javadoc] Loading source file /home/iurt/rpmbuild/BUILD/apache-ivy-2.4.0/src/java/org/apache/ivy/plugins/repository/ArtifactResourceResolver.java... [javadoc] Loading source file /home/iurt/rpmbuild/BUILD/apache-ivy-2.4.0/src/java/org/apache/ivy/plugins/repository/BasicResource.java... [javadoc] Loading source file /home/iurt/rpmbuild/BUILD/apache-ivy-2.4.0/src/java/org/apache/ivy/plugins/repository/LazyResource.java... [javadoc] Loading source file /home/iurt/rpmbuild/BUILD/apache-ivy-2.4.0/src/java/org/apache/ivy/plugins/repository/LocalizableResource.java... [javadoc] Loading source file /home/iurt/rpmbuild/BUILD/apache-ivy-2.4.0/src/java/org/apache/ivy/plugins/repository/Repository.java... [javadoc] Loading source file /home/iurt/rpmbuild/BUILD/apache-ivy-2.4.0/src/java/org/apache/ivy/plugins/repository/RepositoryCopyProgressListener.java... [javadoc] Loading source file /home/iurt/rpmbuild/BUILD/apache-ivy-2.4.0/src/java/org/apache/ivy/plugins/repository/Resource.java... [javadoc] Loading source file /home/iurt/rpmbuild/BUILD/apache-ivy-2.4.0/src/java/org/apache/ivy/plugins/repository/ResourceDownloader.java... [javadoc] Loading source file /home/iurt/rpmbuild/BUILD/apache-ivy-2.4.0/src/java/org/apache/ivy/plugins/repository/ResourceHelper.java... [javadoc] Loading source file /home/iurt/rpmbuild/BUILD/apache-ivy-2.4.0/src/java/org/apache/ivy/plugins/repository/TransferEvent.java... [javadoc] Loading source file /home/iurt/rpmbuild/BUILD/apache-ivy-2.4.0/src/java/org/apache/ivy/plugins/repository/TransferListener.java... [javadoc] Loading source file /home/iurt/rpmbuild/BUILD/apache-ivy-2.4.0/src/java/org/apache/ivy/plugins/repository/file/FileRepository.java... [javadoc] Loading source file /home/iurt/rpmbuild/BUILD/apache-ivy-2.4.0/src/java/org/apache/ivy/plugins/repository/file/FileResource.java... [javadoc] Loading source file /home/iurt/rpmbuild/BUILD/apache-ivy-2.4.0/src/java/org/apache/ivy/plugins/repository/jar/JarRepository.java... [javadoc] Loading source file /home/iurt/rpmbuild/BUILD/apache-ivy-2.4.0/src/java/org/apache/ivy/plugins/repository/jar/JarResource.java... [javadoc] Loading source file /home/iurt/rpmbuild/BUILD/apache-ivy-2.4.0/src/java/org/apache/ivy/plugins/repository/url/ChainedRepository.java... [javadoc] Loading source file /home/iurt/rpmbuild/BUILD/apache-ivy-2.4.0/src/java/org/apache/ivy/plugins/repository/url/URLRepository.java... [javadoc] Loading source file /home/iurt/rpmbuild/BUILD/apache-ivy-2.4.0/src/java/org/apache/ivy/plugins/repository/url/URLResource.java... [javadoc] Loading source file /home/iurt/rpmbuild/BUILD/apache-ivy-2.4.0/src/java/org/apache/ivy/plugins/repository/vsftp/VsftpRepository.java... [javadoc] Loading source file /home/iurt/rpmbuild/BUILD/apache-ivy-2.4.0/src/java/org/apache/ivy/plugins/repository/vsftp/VsftpResource.java... [javadoc] Loading source file /home/iurt/rpmbuild/BUILD/apache-ivy-2.4.0/src/java/org/apache/ivy/plugins/resolver/AbstractPatternsBasedResolver.java... [javadoc] Loading source file /home/iurt/rpmbuild/BUILD/apache-ivy-2.4.0/src/java/org/apache/ivy/plugins/resolver/AbstractResolver.java... [javadoc] Loading source file /home/iurt/rpmbuild/BUILD/apache-ivy-2.4.0/src/java/org/apache/ivy/plugins/resolver/BasicResolver.java... [javadoc] Loading source file /home/iurt/rpmbuild/BUILD/apache-ivy-2.4.0/src/java/org/apache/ivy/plugins/resolver/BintrayResolver.java... [javadoc] Loading source file /home/iurt/rpmbuild/BUILD/apache-ivy-2.4.0/src/java/org/apache/ivy/plugins/resolver/CacheResolver.java... [javadoc] Loading source file /home/iurt/rpmbuild/BUILD/apache-ivy-2.4.0/src/java/org/apache/ivy/plugins/resolver/ChainResolver.java... [javadoc] Loading source file /home/iurt/rpmbuild/BUILD/apache-ivy-2.4.0/src/java/org/apache/ivy/plugins/resolver/DependencyResolver.java... [javadoc] Loading source file /home/iurt/rpmbuild/BUILD/apache-ivy-2.4.0/src/java/org/apache/ivy/plugins/resolver/DualResolver.java... [javadoc] Loading source file /home/iurt/rpmbuild/BUILD/apache-ivy-2.4.0/src/java/org/apache/ivy/plugins/resolver/FileSystemResolver.java... [javadoc] Loading source file /home/iurt/rpmbuild/BUILD/apache-ivy-2.4.0/src/java/org/apache/ivy/plugins/resolver/IBiblioResolver.java... [javadoc] Loading source file /home/iurt/rpmbuild/BUILD/apache-ivy-2.4.0/src/java/org/apache/ivy/plugins/resolver/IvyRepResolver.java... [javadoc] Loading source file /home/iurt/rpmbuild/BUILD/apache-ivy-2.4.0/src/java/org/apache/ivy/plugins/resolver/JarResolver.java... [javadoc] Loading source file /home/iurt/rpmbuild/BUILD/apache-ivy-2.4.0/src/java/org/apache/ivy/plugins/resolver/MirroredURLResolver.java... [javadoc] Loading source file /home/iurt/rpmbuild/BUILD/apache-ivy-2.4.0/src/java/org/apache/ivy/plugins/resolver/RepositoryResolver.java... [javadoc] Loading source file /home/iurt/rpmbuild/BUILD/apache-ivy-2.4.0/src/java/org/apache/ivy/plugins/resolver/ResolverSettings.java... [javadoc] Loading source file /home/iurt/rpmbuild/BUILD/apache-ivy-2.4.0/src/java/org/apache/ivy/plugins/resolver/URLResolver.java... [javadoc] Loading source file /home/iurt/rpmbuild/BUILD/apache-ivy-2.4.0/src/java/org/apache/ivy/plugins/resolver/VsftpResolver.java... [javadoc] Loading source file /home/iurt/rpmbuild/BUILD/apache-ivy-2.4.0/src/java/org/apache/ivy/plugins/resolver/packager/BuiltFileResource.java... [javadoc] Loading source file /home/iurt/rpmbuild/BUILD/apache-ivy-2.4.0/src/java/org/apache/ivy/plugins/resolver/packager/PackagerCacheEntry.java... [javadoc] Loading source file /home/iurt/rpmbuild/BUILD/apache-ivy-2.4.0/src/java/org/apache/ivy/plugins/resolver/packager/PackagerResolver.java... [javadoc] Loading source file /home/iurt/rpmbuild/BUILD/apache-ivy-2.4.0/src/java/org/apache/ivy/plugins/resolver/util/ApacheHttpURLLister.java... [javadoc] Loading source file /home/iurt/rpmbuild/BUILD/apache-ivy-2.4.0/src/java/org/apache/ivy/plugins/resolver/util/FileURLLister.java... [javadoc] Loading source file /home/iurt/rpmbuild/BUILD/apache-ivy-2.4.0/src/java/org/apache/ivy/plugins/resolver/util/HasLatestStrategy.java... [javadoc] Loading source file /home/iurt/rpmbuild/BUILD/apache-ivy-2.4.0/src/java/org/apache/ivy/plugins/resolver/util/MDResolvedResource.java... [javadoc] Loading source file /home/iurt/rpmbuild/BUILD/apache-ivy-2.4.0/src/java/org/apache/ivy/plugins/resolver/util/ResolvedResource.java... [javadoc] Loading source file /home/iurt/rpmbuild/BUILD/apache-ivy-2.4.0/src/java/org/apache/ivy/plugins/resolver/util/ResolverHelper.java... [javadoc] Loading source file /home/iurt/rpmbuild/BUILD/apache-ivy-2.4.0/src/java/org/apache/ivy/plugins/resolver/util/ResourceMDParser.java... [javadoc] Loading source file /home/iurt/rpmbuild/BUILD/apache-ivy-2.4.0/src/java/org/apache/ivy/plugins/resolver/util/URLLister.java... [javadoc] Loading source file /home/iurt/rpmbuild/BUILD/apache-ivy-2.4.0/src/java/org/apache/ivy/plugins/signer/SignatureGenerator.java... [javadoc] Loading source file /home/iurt/rpmbuild/BUILD/apache-ivy-2.4.0/src/java/org/apache/ivy/plugins/trigger/AbstractTrigger.java... [javadoc] Loading source file /home/iurt/rpmbuild/BUILD/apache-ivy-2.4.0/src/java/org/apache/ivy/plugins/trigger/LogTrigger.java... [javadoc] Loading source file /home/iurt/rpmbuild/BUILD/apache-ivy-2.4.0/src/java/org/apache/ivy/plugins/trigger/Trigger.java... [javadoc] Loading source file /home/iurt/rpmbuild/BUILD/apache-ivy-2.4.0/src/java/org/apache/ivy/plugins/version/AbstractVersionMatcher.java... [javadoc] Loading source file /home/iurt/rpmbuild/BUILD/apache-ivy-2.4.0/src/java/org/apache/ivy/plugins/version/ChainVersionMatcher.java... [javadoc] Loading source file /home/iurt/rpmbuild/BUILD/apache-ivy-2.4.0/src/java/org/apache/ivy/plugins/version/ExactVersionMatcher.java... [javadoc] Loading source file /home/iurt/rpmbuild/BUILD/apache-ivy-2.4.0/src/java/org/apache/ivy/plugins/version/LatestVersionMatcher.java... [javadoc] Loading source file /home/iurt/rpmbuild/BUILD/apache-ivy-2.4.0/src/java/org/apache/ivy/plugins/version/Match.java... [javadoc] Loading source file /home/iurt/rpmbuild/BUILD/apache-ivy-2.4.0/src/java/org/apache/ivy/plugins/version/PatternVersionMatcher.java... [javadoc] Loading source file /home/iurt/rpmbuild/BUILD/apache-ivy-2.4.0/src/java/org/apache/ivy/plugins/version/SubVersionMatcher.java... [javadoc] Loading source file /home/iurt/rpmbuild/BUILD/apache-ivy-2.4.0/src/java/org/apache/ivy/plugins/version/VersionMatcher.java... [javadoc] Loading source file /home/iurt/rpmbuild/BUILD/apache-ivy-2.4.0/src/java/org/apache/ivy/plugins/version/VersionRangeMatcher.java... [javadoc] Loading source file /home/iurt/rpmbuild/BUILD/apache-ivy-2.4.0/src/java/org/apache/ivy/tools/analyser/DependencyAnalyser.java... [javadoc] Loading source file /home/iurt/rpmbuild/BUILD/apache-ivy-2.4.0/src/java/org/apache/ivy/tools/analyser/JarJarDependencyAnalyser.java... [javadoc] Loading source file /home/iurt/rpmbuild/BUILD/apache-ivy-2.4.0/src/java/org/apache/ivy/tools/analyser/JarModule.java... [javadoc] Loading source file /home/iurt/rpmbuild/BUILD/apache-ivy-2.4.0/src/java/org/apache/ivy/tools/analyser/JarModuleFinder.java... [javadoc] Loading source file /home/iurt/rpmbuild/BUILD/apache-ivy-2.4.0/src/java/org/apache/ivy/tools/analyser/RepositoryAnalyser.java... [javadoc] Loading source file /home/iurt/rpmbuild/BUILD/apache-ivy-2.4.0/src/java/org/apache/ivy/util/AbstractMessageLogger.java... [javadoc] Loading source file /home/iurt/rpmbuild/BUILD/apache-ivy-2.4.0/src/java/org/apache/ivy/util/Checks.java... [javadoc] Loading source file /home/iurt/rpmbuild/BUILD/apache-ivy-2.4.0/src/java/org/apache/ivy/util/ChecksumHelper.java... [javadoc] Loading source file /home/iurt/rpmbuild/BUILD/apache-ivy-2.4.0/src/java/org/apache/ivy/util/CollectionUtils.java... [javadoc] Loading source file /home/iurt/rpmbuild/BUILD/apache-ivy-2.4.0/src/java/org/apache/ivy/util/ConfigurationUtils.java... [javadoc] Loading source file /home/iurt/rpmbuild/BUILD/apache-ivy-2.4.0/src/java/org/apache/ivy/util/Configurator.java... [javadoc] Loading source file /home/iurt/rpmbuild/BUILD/apache-ivy-2.4.0/src/java/org/apache/ivy/util/ContextualSAXHandler.java... [javadoc] Loading source file /home/iurt/rpmbuild/BUILD/apache-ivy-2.4.0/src/java/org/apache/ivy/util/CopyProgressEvent.java... [javadoc] Loading source file /home/iurt/rpmbuild/BUILD/apache-ivy-2.4.0/src/java/org/apache/ivy/util/CopyProgressListener.java... [javadoc] Loading source file /home/iurt/rpmbuild/BUILD/apache-ivy-2.4.0/src/java/org/apache/ivy/util/Credentials.java... [javadoc] Loading source file /home/iurt/rpmbuild/BUILD/apache-ivy-2.4.0/src/java/org/apache/ivy/util/CredentialsUtil.java... [javadoc] Loading source file /home/iurt/rpmbuild/BUILD/apache-ivy-2.4.0/src/java/org/apache/ivy/util/DateUtil.java... [javadoc] Loading source file /home/iurt/rpmbuild/BUILD/apache-ivy-2.4.0/src/java/org/apache/ivy/util/DefaultMessageLogger.java... [javadoc] Loading source file /home/iurt/rpmbuild/BUILD/apache-ivy-2.4.0/src/java/org/apache/ivy/util/EncrytedProperties.java... [javadoc] Loading source file /home/iurt/rpmbuild/BUILD/apache-ivy-2.4.0/src/java/org/apache/ivy/util/FileResolver.java... [javadoc] Loading source file /home/iurt/rpmbuild/BUILD/apache-ivy-2.4.0/src/java/org/apache/ivy/util/FileUtil.java... [javadoc] Loading source file /home/iurt/rpmbuild/BUILD/apache-ivy-2.4.0/src/java/org/apache/ivy/util/HexEncoder.java... [javadoc] Loading source file /home/iurt/rpmbuild/BUILD/apache-ivy-2.4.0/src/java/org/apache/ivy/util/HostUtil.java... [javadoc] Loading source file /home/iurt/rpmbuild/BUILD/apache-ivy-2.4.0/src/java/org/apache/ivy/util/MemoryUtil.java... [javadoc] Loading source file /home/iurt/rpmbuild/BUILD/apache-ivy-2.4.0/src/java/org/apache/ivy/util/Message.java... [javadoc] Loading source file /home/iurt/rpmbuild/BUILD/apache-ivy-2.4.0/src/java/org/apache/ivy/util/MessageLogger.java... [javadoc] Loading source file /home/iurt/rpmbuild/BUILD/apache-ivy-2.4.0/src/java/org/apache/ivy/util/MessageLoggerEngine.java... [javadoc] Loading source file /home/iurt/rpmbuild/BUILD/apache-ivy-2.4.0/src/java/org/apache/ivy/util/MessageLoggerHelper.java... [javadoc] Loading source file /home/iurt/rpmbuild/BUILD/apache-ivy-2.4.0/src/java/org/apache/ivy/util/PropertiesFile.java... [javadoc] Loading source file /home/iurt/rpmbuild/BUILD/apache-ivy-2.4.0/src/java/org/apache/ivy/util/StringUtils.java... [javadoc] Loading source file /home/iurt/rpmbuild/BUILD/apache-ivy-2.4.0/src/java/org/apache/ivy/util/XMLHelper.java... [javadoc] Loading source file /home/iurt/rpmbuild/BUILD/apache-ivy-2.4.0/src/java/org/apache/ivy/util/cli/CommandLine.java... [javadoc] Loading source file /home/iurt/rpmbuild/BUILD/apache-ivy-2.4.0/src/java/org/apache/ivy/util/cli/CommandLineParser.java... [javadoc] Loading source file /home/iurt/rpmbuild/BUILD/apache-ivy-2.4.0/src/java/org/apache/ivy/util/cli/Option.java... [javadoc] Loading source file /home/iurt/rpmbuild/BUILD/apache-ivy-2.4.0/src/java/org/apache/ivy/util/cli/OptionBuilder.java... [javadoc] Loading source file /home/iurt/rpmbuild/BUILD/apache-ivy-2.4.0/src/java/org/apache/ivy/util/cli/ParseException.java... [javadoc] Loading source file /home/iurt/rpmbuild/BUILD/apache-ivy-2.4.0/src/java/org/apache/ivy/util/extendable/DefaultExtendableItem.java... [javadoc] Loading source file /home/iurt/rpmbuild/BUILD/apache-ivy-2.4.0/src/java/org/apache/ivy/util/extendable/ExtendableItem.java... [javadoc] Loading source file /home/iurt/rpmbuild/BUILD/apache-ivy-2.4.0/src/java/org/apache/ivy/util/extendable/ExtendableItemHelper.java... [javadoc] Loading source file /home/iurt/rpmbuild/BUILD/apache-ivy-2.4.0/src/java/org/apache/ivy/util/extendable/UnmodifiableExtendableItem.java... [javadoc] Loading source file /home/iurt/rpmbuild/BUILD/apache-ivy-2.4.0/src/java/org/apache/ivy/util/filter/AndFilter.java... [javadoc] Loading source file /home/iurt/rpmbuild/BUILD/apache-ivy-2.4.0/src/java/org/apache/ivy/util/filter/ArtifactTypeFilter.java... [javadoc] Loading source file /home/iurt/rpmbuild/BUILD/apache-ivy-2.4.0/src/java/org/apache/ivy/util/filter/Filter.java... [javadoc] Loading source file /home/iurt/rpmbuild/BUILD/apache-ivy-2.4.0/src/java/org/apache/ivy/util/filter/FilterHelper.java... [javadoc] Loading source file /home/iurt/rpmbuild/BUILD/apache-ivy-2.4.0/src/java/org/apache/ivy/util/filter/NoFilter.java... [javadoc] Loading source file /home/iurt/rpmbuild/BUILD/apache-ivy-2.4.0/src/java/org/apache/ivy/util/filter/NotFilter.java... [javadoc] Loading source file /home/iurt/rpmbuild/BUILD/apache-ivy-2.4.0/src/java/org/apache/ivy/util/filter/OrFilter.java... [javadoc] Loading source file /home/iurt/rpmbuild/BUILD/apache-ivy-2.4.0/src/java/org/apache/ivy/util/url/AbstractURLHandler.java... [javadoc] Loading source file /home/iurt/rpmbuild/BUILD/apache-ivy-2.4.0/src/java/org/apache/ivy/util/url/ApacheURLLister.java... [javadoc] Loading source file /home/iurt/rpmbuild/BUILD/apache-ivy-2.4.0/src/java/org/apache/ivy/util/url/BasicURLHandler.java... [javadoc] Loading source file /home/iurt/rpmbuild/BUILD/apache-ivy-2.4.0/src/java/org/apache/ivy/util/url/CredentialsStore.java... [javadoc] Loading source file /home/iurt/rpmbuild/BUILD/apache-ivy-2.4.0/src/java/org/apache/ivy/util/url/HttpClientHandler.java... [javadoc] Loading source file /home/iurt/rpmbuild/BUILD/apache-ivy-2.4.0/src/java/org/apache/ivy/util/url/IvyAuthenticator.java... [javadoc] Loading source file /home/iurt/rpmbuild/BUILD/apache-ivy-2.4.0/src/java/org/apache/ivy/util/url/URLHandler.java... [javadoc] Loading source file /home/iurt/rpmbuild/BUILD/apache-ivy-2.4.0/src/java/org/apache/ivy/util/url/URLHandlerDispatcher.java... [javadoc] Loading source file /home/iurt/rpmbuild/BUILD/apache-ivy-2.4.0/src/java/org/apache/ivy/util/url/URLHandlerRegistry.java... [javadoc] Constructing Javadoc information... [javadoc] /home/iurt/rpmbuild/BUILD/apache-ivy-2.4.0/src/java/org/apache/ivy/plugins/matcher/GlobPatternMatcher.java:22: error: package org.apache.oro.text does not exist [javadoc] import org.apache.oro.text.GlobCompiler; [javadoc] ^ [javadoc] /home/iurt/rpmbuild/BUILD/apache-ivy-2.4.0/src/java/org/apache/ivy/plugins/matcher/GlobPatternMatcher.java:23: error: package org.apache.oro.text.regex does not exist [javadoc] import org.apache.oro.text.regex.MalformedPatternException; [javadoc] ^ [javadoc] /home/iurt/rpmbuild/BUILD/apache-ivy-2.4.0/src/java/org/apache/ivy/plugins/matcher/GlobPatternMatcher.java:24: error: package org.apache.oro.text.regex does not exist [javadoc] import org.apache.oro.text.regex.Pattern; [javadoc] ^ [javadoc] /home/iurt/rpmbuild/BUILD/apache-ivy-2.4.0/src/java/org/apache/ivy/plugins/matcher/GlobPatternMatcher.java:25: error: package org.apache.oro.text.regex does not exist [javadoc] import org.apache.oro.text.regex.Perl5Matcher; [javadoc] ^ [javadoc] /home/iurt/rpmbuild/BUILD/apache-ivy-2.4.0/src/java/org/apache/ivy/plugins/matcher/GlobPatternMatcher.java:59: error: cannot find symbol [javadoc] private Pattern pattern; [javadoc] ^ [javadoc] symbol: class Pattern [javadoc] location: class GlobMatcher [javadoc] /home/iurt/rpmbuild/BUILD/apache-ivy-2.4.0/src/java/org/apache/ivy/util/url/HttpClientHandler.java:33: error: package org.apache.commons.httpclient does not exist [javadoc] import org.apache.commons.httpclient.Credentials; [javadoc] ^ [javadoc] /home/iurt/rpmbuild/BUILD/apache-ivy-2.4.0/src/java/org/apache/ivy/util/url/HttpClientHandler.java:34: error: package org.apache.commons.httpclient does not exist [javadoc] import org.apache.commons.httpclient.Header; [javadoc] ^ [javadoc] /home/iurt/rpmbuild/BUILD/apache-ivy-2.4.0/src/java/org/apache/ivy/util/url/HttpClientHandler.java:35: error: package org.apache.commons.httpclient does not exist [javadoc] import org.apache.commons.httpclient.HttpClient; [javadoc] ^ [javadoc] /home/iurt/rpmbuild/BUILD/apache-ivy-2.4.0/src/java/org/apache/ivy/util/url/HttpClientHandler.java:36: error: package org.apache.commons.httpclient does not exist [javadoc] import org.apache.commons.httpclient.HttpException; [javadoc] ^ [javadoc] /home/iurt/rpmbuild/BUILD/apache-ivy-2.4.0/src/java/org/apache/ivy/util/url/HttpClientHandler.java:37: error: package org.apache.commons.httpclient does not exist [javadoc] import org.apache.commons.httpclient.HttpMethodBase; [javadoc] ^ [javadoc] /home/iurt/rpmbuild/BUILD/apache-ivy-2.4.0/src/java/org/apache/ivy/util/url/HttpClientHandler.java:38: error: package org.apache.commons.httpclient does not exist [javadoc] import org.apache.commons.httpclient.HttpStatus; [javadoc] ^ [javadoc] /home/iurt/rpmbuild/BUILD/apache-ivy-2.4.0/src/java/org/apache/ivy/util/url/HttpClientHandler.java:39: error: package org.apache.commons.httpclient does not exist [javadoc] import org.apache.commons.httpclient.MultiThreadedHttpConnectionManager; [javadoc] ^ [javadoc] /home/iurt/rpmbuild/BUILD/apache-ivy-2.4.0/src/java/org/apache/ivy/util/url/HttpClientHandler.java:40: error: package org.apache.commons.httpclient does not exist [javadoc] import org.apache.commons.httpclient.NTCredentials; [javadoc] ^ [javadoc] /home/iurt/rpmbuild/BUILD/apache-ivy-2.4.0/src/java/org/apache/ivy/util/url/HttpClientHandler.java:41: error: package org.apache.commons.httpclient.auth does not exist [javadoc] import org.apache.commons.httpclient.auth.AuthPolicy; [javadoc] ^ [javadoc] /home/iurt/rpmbuild/BUILD/apache-ivy-2.4.0/src/java/org/apache/ivy/util/url/HttpClientHandler.java:42: error: package org.apache.commons.httpclient.auth does not exist [javadoc] import org.apache.commons.httpclient.auth.AuthScheme; [javadoc] ^ [javadoc] /home/iurt/rpmbuild/BUILD/apache-ivy-2.4.0/src/java/org/apache/ivy/util/url/HttpClientHandler.java:43: error: package org.apache.commons.httpclient.auth does not exist [javadoc] import org.apache.commons.httpclient.auth.AuthScope; [javadoc] ^ [javadoc] /home/iurt/rpmbuild/BUILD/apache-ivy-2.4.0/src/java/org/apache/ivy/util/url/HttpClientHandler.java:44: error: package org.apache.commons.httpclient.auth does not exist [javadoc] import org.apache.commons.httpclient.auth.CredentialsNotAvailableException; [javadoc] ^ [javadoc] /home/iurt/rpmbuild/BUILD/apache-ivy-2.4.0/src/java/org/apache/ivy/util/url/HttpClientHandler.java:45: error: package org.apache.commons.httpclient.auth does not exist [javadoc] import org.apache.commons.httpclient.auth.CredentialsProvider; [javadoc] ^ [javadoc] /home/iurt/rpmbuild/BUILD/apache-ivy-2.4.0/src/java/org/apache/ivy/util/url/HttpClientHandler.java:46: error: package org.apache.commons.httpclient.methods does not exist [javadoc] import org.apache.commons.httpclient.methods.GetMethod; [javadoc] ^ [javadoc] /home/iurt/rpmbuild/BUILD/apache-ivy-2.4.0/src/java/org/apache/ivy/util/url/HttpClientHandler.java:47: error: package org.apache.commons.httpclient.methods does not exist [javadoc] import org.apache.commons.httpclient.methods.HeadMethod; [javadoc] ^ [javadoc] /home/iurt/rpmbuild/BUILD/apache-ivy-2.4.0/src/java/org/apache/ivy/util/url/HttpClientHandler.java:48: error: package org.apache.commons.httpclient.methods does not exist [javadoc] import org.apache.commons.httpclient.methods.PutMethod; [javadoc] ^ [javadoc] /home/iurt/rpmbuild/BUILD/apache-ivy-2.4.0/src/java/org/apache/ivy/util/url/HttpClientHandler.java:49: error: package org.apache.commons.httpclient.methods does not exist [javadoc] import org.apache.commons.httpclient.methods.RequestEntity; [javadoc] ^ [javadoc] /home/iurt/rpmbuild/BUILD/apache-ivy-2.4.0/src/java/org/apache/ivy/util/url/HttpClientHandler.java:50: error: package org.apache.commons.httpclient.params does not exist [javadoc] import org.apache.commons.httpclient.params.HttpMethodParams; [javadoc] ^ [javadoc] /home/iurt/rpmbuild/BUILD/apache-ivy-2.4.0/src/java/org/apache/ivy/util/url/HttpClientHandler.java:75: error: cannot find symbol [javadoc] private static HttpClient httpClient; [javadoc] ^ [javadoc] symbol: class HttpClient [javadoc] location: class HttpClientHandler [javadoc] /home/iurt/rpmbuild/BUILD/apache-ivy-2.4.0/src/java/org/apache/ivy/util/url/HttpClientHandler.java:180: error: cannot find symbol [javadoc] private boolean checkStatusCode(URL url, HttpMethodBase method) throws IOException { [javadoc] ^ [javadoc] symbol: class HttpMethodBase [javadoc] location: class HttpClientHandler [javadoc] /home/iurt/rpmbuild/BUILD/apache-ivy-2.4.0/src/java/org/apache/ivy/util/url/HttpClientHandler.java:203: error: cannot find symbol [javadoc] private long getLastModified(HttpMethodBase method) { [javadoc] ^ [javadoc] symbol: class HttpMethodBase [javadoc] location: class HttpClientHandler [javadoc] /home/iurt/rpmbuild/BUILD/apache-ivy-2.4.0/src/java/org/apache/ivy/util/url/HttpClientHandler.java:218: error: cannot find symbol [javadoc] private long getResponseContentLength(HttpMethodBase head) { [javadoc] ^ [javadoc] symbol: class HttpMethodBase [javadoc] location: class HttpClientHandler [javadoc] /home/iurt/rpmbuild/BUILD/apache-ivy-2.4.0/src/java/org/apache/ivy/util/url/HttpClientHandler.java:249: error: cannot find symbol [javadoc] private GetMethod doGet(URL url, int timeout) throws IOException { [javadoc] ^ [javadoc] symbol: class GetMethod [javadoc] location: class HttpClientHandler [javadoc] /home/iurt/rpmbuild/BUILD/apache-ivy-2.4.0/src/java/org/apache/ivy/util/url/HttpClientHandler.java:260: error: cannot find symbol [javadoc] private HeadMethod doHead(URL url, int timeout) throws IOException { [javadoc] ^ [javadoc] symbol: class HeadMethod [javadoc] location: class HttpClientHandler [javadoc] /home/iurt/rpmbuild/BUILD/apache-ivy-2.4.0/src/java/org/apache/ivy/util/url/HttpClientHandler.java:270: error: cannot find symbol [javadoc] private HttpClient getClient() { [javadoc] ^ [javadoc] symbol: class HttpClient [javadoc] location: class HttpClientHandler [javadoc] /home/iurt/rpmbuild/BUILD/apache-ivy-2.4.0/src/java/org/apache/ivy/util/url/HttpClientHandler.java:386: error: cannot find symbol [javadoc] private static Credentials createCredentials(String username, String password) { [javadoc] ^ [javadoc] symbol: class Credentials [javadoc] location: class HttpClientHandler [javadoc] /home/iurt/rpmbuild/BUILD/apache-ivy-2.4.0/src/java/org/apache/ivy/util/url/HttpClientHandler.java:365: error: cannot find symbol [javadoc] long getResponseContentLength(HttpMethodBase method); [javadoc] ^ [javadoc] symbol: class HttpMethodBase [javadoc] location: interface HttpClientHelper [javadoc] /home/iurt/rpmbuild/BUILD/apache-ivy-2.4.0/src/java/org/apache/ivy/util/url/HttpClientHandler.java:326: error: cannot find symbol [javadoc] public long getResponseContentLength(HttpMethodBase method) { [javadoc] ^ [javadoc] symbol: class HttpMethodBase [javadoc] location: class HttpClientHelper3x [javadoc] /home/iurt/rpmbuild/BUILD/apache-ivy-2.4.0/src/java/org/apache/ivy/util/url/HttpClientHandler.java:344: error: cannot find symbol [javadoc] public long getResponseContentLength(HttpMethodBase method) { [javadoc] ^ [javadoc] symbol: class HttpMethodBase [javadoc] location: class HttpClientHelper2x [javadoc] /home/iurt/rpmbuild/BUILD/apache-ivy-2.4.0/src/java/org/apache/ivy/util/url/HttpClientHandler.java:370: error: cannot find symbol [javadoc] private static class IvyCredentialsProvider implements CredentialsProvider { [javadoc] ^ [javadoc] symbol: class CredentialsProvider [javadoc] location: class HttpClientHandler [javadoc] /home/iurt/rpmbuild/BUILD/apache-ivy-2.4.0/src/java/org/apache/ivy/util/url/HttpClientHandler.java:372: error: cannot find symbol [javadoc] public Credentials getCredentials(AuthScheme scheme, String host, int port, boolean proxy) [javadoc] ^ [javadoc] symbol: class AuthScheme [javadoc] location: class IvyCredentialsProvider [javadoc] /home/iurt/rpmbuild/BUILD/apache-ivy-2.4.0/src/java/org/apache/ivy/util/url/HttpClientHandler.java:372: error: cannot find symbol [javadoc] public Credentials getCredentials(AuthScheme scheme, String host, int port, boolean proxy) [javadoc] ^ [javadoc] symbol: class Credentials [javadoc] location: class IvyCredentialsProvider [javadoc] /home/iurt/rpmbuild/BUILD/apache-ivy-2.4.0/src/java/org/apache/ivy/util/url/HttpClientHandler.java:373: error: cannot find symbol [javadoc] throws CredentialsNotAvailableException { [javadoc] ^ [javadoc] symbol: class CredentialsNotAvailableException [javadoc] location: class IvyCredentialsProvider [javadoc] /home/iurt/rpmbuild/BUILD/apache-ivy-2.4.0/src/java/org/apache/ivy/util/url/HttpClientHandler.java:402: error: cannot find symbol [javadoc] private static class FileRequestEntity implements RequestEntity { [javadoc] ^ [javadoc] symbol: class RequestEntity [javadoc] location: class HttpClientHandler [javadoc] Creating destination directory: "/home/iurt/rpmbuild/BUILD/apache-ivy-2.4.0/build/doc/reports/api/" [javadoc] Standard Doclet version 1.8.0_242 [javadoc] Building tree for all the packages and classes... [javadoc] /home/iurt/rpmbuild/BUILD/apache-ivy-2.4.0/src/java/org/apache/ivy/core/event/IvyEvent.java:55: warning: no description for @param [javadoc] * @param key [javadoc] ^ [javadoc] /home/iurt/rpmbuild/BUILD/apache-ivy-2.4.0/src/java/org/apache/ivy/core/event/IvyEvent.java:56: warning: no description for @param [javadoc] * @param value [javadoc] ^ [javadoc] /home/iurt/rpmbuild/BUILD/apache-ivy-2.4.0/src/java/org/apache/ivy/core/event/IvyEvent.java:96: error: bad use of '>' [javadoc] * Returns the attributes of this event, as a Map(String->String) [javadoc] ^ [javadoc] /home/iurt/rpmbuild/BUILD/apache-ivy-2.4.0/src/java/org/apache/ivy/core/event/IvyEvent.java:98: error: bad use of '>' [javadoc] * @return the attributes of this event, as a Map(String->String) [javadoc] ^ [javadoc] /home/iurt/rpmbuild/BUILD/apache-ivy-2.4.0/src/java/org/apache/ivy/core/sort/ModuleDescriptorSorter.java:59: warning: no description for @throws [javadoc] * @throws CircularDependencyException [javadoc] ^ [javadoc] /home/iurt/rpmbuild/BUILD/apache-ivy-2.4.0/src/java/org/apache/ivy/core/publish/PublishEngine.java:78: warning: no @param for mrid [javadoc] public Collection publish(ModuleRevisionId mrid, Collection srcArtifactPattern, [javadoc] ^ [javadoc] /home/iurt/rpmbuild/BUILD/apache-ivy-2.4.0/src/java/org/apache/ivy/core/publish/PublishEngine.java:78: warning: no @param for srcArtifactPattern [javadoc] public Collection publish(ModuleRevisionId mrid, Collection srcArtifactPattern, [javadoc] ^ [javadoc] /home/iurt/rpmbuild/BUILD/apache-ivy-2.4.0/src/java/org/apache/ivy/core/publish/PublishEngine.java:78: warning: no @param for resolverName [javadoc] public Collection publish(ModuleRevisionId mrid, Collection srcArtifactPattern, [javadoc] ^ [javadoc] /home/iurt/rpmbuild/BUILD/apache-ivy-2.4.0/src/java/org/apache/ivy/core/publish/PublishEngine.java:78: warning: no @param for options [javadoc] public Collection publish(ModuleRevisionId mrid, Collection srcArtifactPattern, [javadoc] ^ [javadoc] /home/iurt/rpmbuild/BUILD/apache-ivy-2.4.0/src/java/org/apache/ivy/core/publish/PublishEngine.java:78: warning: no @return [javadoc] public Collection publish(ModuleRevisionId mrid, Collection srcArtifactPattern, [javadoc] ^ [javadoc] /home/iurt/rpmbuild/BUILD/apache-ivy-2.4.0/src/java/org/apache/ivy/core/publish/PublishEngine.java:78: warning: no @throws for java.io.IOException [javadoc] public Collection publish(ModuleRevisionId mrid, Collection srcArtifactPattern, [javadoc] ^ [javadoc] /home/iurt/rpmbuild/BUILD/apache-ivy-2.4.0/src/java/org/apache/ivy/plugins/parser/ParserSettings.java:60: warning: no @return [javadoc] Namespace getContextNamespace(); [javadoc] ^ [javadoc] /home/iurt/rpmbuild/BUILD/apache-ivy-2.4.0/src/java/org/apache/ivy/osgi/util/DelegatingHandler.java:161: warning: no description for @throws [javadoc] * @throws SAXException [javadoc] ^ [javadoc] /home/iurt/rpmbuild/BUILD/apache-ivy-2.4.0/src/java/org/apache/ivy/osgi/util/DelegatingHandler.java:179: warning: no description for @throws [javadoc] * @throws SAXException [javadoc] ^ [javadoc] /home/iurt/rpmbuild/BUILD/apache-ivy-2.4.0/src/java/org/apache/ivy/osgi/util/DelegatingHandler.java:242: warning: no description for @throws [javadoc] * @throws SAXException [javadoc] ^ [javadoc] /home/iurt/rpmbuild/BUILD/apache-ivy-2.4.0/src/java/org/apache/ivy/osgi/util/DelegatingHandler.java:244: warning: no @param for uri [javadoc] protected void doStartElement(String uri, String localName, String name, Attributes atts) [javadoc] ^ [javadoc] /home/iurt/rpmbuild/BUILD/apache-ivy-2.4.0/src/java/org/apache/ivy/osgi/util/DelegatingHandler.java:244: warning: no @param for localName [javadoc] protected void doStartElement(String uri, String localName, String name, Attributes atts) [javadoc] ^ [javadoc] /home/iurt/rpmbuild/BUILD/apache-ivy-2.4.0/src/java/org/apache/ivy/osgi/util/DelegatingHandler.java:244: warning: no @param for name [javadoc] protected void doStartElement(String uri, String localName, String name, Attributes atts) [javadoc] ^ [javadoc] /home/iurt/rpmbuild/BUILD/apache-ivy-2.4.0/src/java/org/apache/ivy/osgi/util/DelegatingHandler.java:244: warning: no @param for atts [javadoc] protected void doStartElement(String uri, String localName, String name, Attributes atts) [javadoc] ^ [javadoc] /home/iurt/rpmbuild/BUILD/apache-ivy-2.4.0/src/java/org/apache/ivy/osgi/util/DelegatingHandler.java:282: warning: no description for @throws [javadoc] * @throws SAXException [javadoc] ^ [javadoc] /home/iurt/rpmbuild/BUILD/apache-ivy-2.4.0/src/java/org/apache/ivy/osgi/util/DelegatingHandler.java:284: warning: no @param for uri [javadoc] protected void doEndElement(String uri, String localName, String name) throws SAXException { [javadoc] ^ [javadoc] /home/iurt/rpmbuild/BUILD/apache-ivy-2.4.0/src/java/org/apache/ivy/osgi/util/DelegatingHandler.java:284: warning: no @param for localName [javadoc] protected void doEndElement(String uri, String localName, String name) throws SAXException { [javadoc] ^ [javadoc] /home/iurt/rpmbuild/BUILD/apache-ivy-2.4.0/src/java/org/apache/ivy/osgi/util/DelegatingHandler.java:284: warning: no @param for name [javadoc] protected void doEndElement(String uri, String localName, String name) throws SAXException { [javadoc] ^ [javadoc] /home/iurt/rpmbuild/BUILD/apache-ivy-2.4.0/src/java/org/apache/ivy/osgi/util/DelegatingHandler.java:312: warning: no description for @throws [javadoc] * @throws SAXException [javadoc] ^ [javadoc] /home/iurt/rpmbuild/BUILD/apache-ivy-2.4.0/src/java/org/apache/ivy/osgi/util/DelegatingHandler.java:314: warning: no @param for ch [javadoc] protected void doCharacters(char[] ch, int start, int length) throws SAXException { [javadoc] ^ [javadoc] /home/iurt/rpmbuild/BUILD/apache-ivy-2.4.0/src/java/org/apache/ivy/osgi/util/DelegatingHandler.java:314: warning: no @param for start [javadoc] protected void doCharacters(char[] ch, int start, int length) throws SAXException { [javadoc] ^ [javadoc] /home/iurt/rpmbuild/BUILD/apache-ivy-2.4.0/src/java/org/apache/ivy/osgi/util/DelegatingHandler.java:314: warning: no @param for length [javadoc] protected void doCharacters(char[] ch, int start, int length) throws SAXException { [javadoc] ^ [javadoc] /home/iurt/rpmbuild/BUILD/apache-ivy-2.4.0/src/java/org/apache/ivy/osgi/util/DelegatingHandler.java:332: warning: no description for @throws [javadoc] * @throws SAXException [javadoc] ^ [javadoc] /home/iurt/rpmbuild/BUILD/apache-ivy-2.4.0/src/java/org/apache/ivy/osgi/util/DelegatingHandler.java:334: warning: no @param for prefix [javadoc] protected void doStartPrefixMapping(String prefix, String uri) throws SAXException { [javadoc] ^ [javadoc] /home/iurt/rpmbuild/BUILD/apache-ivy-2.4.0/src/java/org/apache/ivy/osgi/util/DelegatingHandler.java:334: warning: no @param for uri [javadoc] protected void doStartPrefixMapping(String prefix, String uri) throws SAXException { [javadoc] ^ [javadoc] /home/iurt/rpmbuild/BUILD/apache-ivy-2.4.0/src/java/org/apache/ivy/osgi/util/DelegatingHandler.java:350: warning: no description for @throws [javadoc] * @throws SAXException [javadoc] ^ [javadoc] /home/iurt/rpmbuild/BUILD/apache-ivy-2.4.0/src/java/org/apache/ivy/osgi/util/DelegatingHandler.java:352: warning: no @param for prefix [javadoc] protected void doEndPrefixMapping(String prefix) throws SAXException { [javadoc] ^ [javadoc] /home/iurt/rpmbuild/BUILD/apache-ivy-2.4.0/src/java/org/apache/ivy/osgi/util/DelegatingHandler.java:368: warning: no description for @throws [javadoc] * @throws SAXException [javadoc] ^ [javadoc] /home/iurt/rpmbuild/BUILD/apache-ivy-2.4.0/src/java/org/apache/ivy/osgi/util/DelegatingHandler.java:370: warning: no @param for ch [javadoc] protected void doIgnorableWhitespace(char[] ch, int start, int length) throws SAXException { [javadoc] ^ [javadoc] /home/iurt/rpmbuild/BUILD/apache-ivy-2.4.0/src/java/org/apache/ivy/osgi/util/DelegatingHandler.java:370: warning: no @param for start [javadoc] protected void doIgnorableWhitespace(char[] ch, int start, int length) throws SAXException { [javadoc] ^ [javadoc] /home/iurt/rpmbuild/BUILD/apache-ivy-2.4.0/src/java/org/apache/ivy/osgi/util/DelegatingHandler.java:370: warning: no @param for length [javadoc] protected void doIgnorableWhitespace(char[] ch, int start, int length) throws SAXException { [javadoc] ^ [javadoc] /home/iurt/rpmbuild/BUILD/apache-ivy-2.4.0/src/java/org/apache/ivy/osgi/util/DelegatingHandler.java:387: warning: no description for @throws [javadoc] * @throws SAXException [javadoc] ^ [javadoc] /home/iurt/rpmbuild/BUILD/apache-ivy-2.4.0/src/java/org/apache/ivy/osgi/util/DelegatingHandler.java:389: warning: no @param for name [javadoc] protected void doNotationDecl(String name, String publicId, String systemId) [javadoc] ^ [javadoc] /home/iurt/rpmbuild/BUILD/apache-ivy-2.4.0/src/java/org/apache/ivy/osgi/util/DelegatingHandler.java:389: warning: no @param for publicId [javadoc] protected void doNotationDecl(String name, String publicId, String systemId) [javadoc] ^ [javadoc] /home/iurt/rpmbuild/BUILD/apache-ivy-2.4.0/src/java/org/apache/ivy/osgi/util/DelegatingHandler.java:389: warning: no @param for systemId [javadoc] protected void doNotationDecl(String name, String publicId, String systemId) [javadoc] ^ [javadoc] /home/iurt/rpmbuild/BUILD/apache-ivy-2.4.0/src/java/org/apache/ivy/osgi/util/DelegatingHandler.java:406: warning: no description for @throws [javadoc] * @throws SAXException [javadoc] ^ [javadoc] /home/iurt/rpmbuild/BUILD/apache-ivy-2.4.0/src/java/org/apache/ivy/osgi/util/DelegatingHandler.java:408: warning: no @param for target [javadoc] protected void doProcessingInstruction(String target, String data) throws SAXException { [javadoc] ^ [javadoc] /home/iurt/rpmbuild/BUILD/apache-ivy-2.4.0/src/java/org/apache/ivy/osgi/util/DelegatingHandler.java:408: warning: no @param for data [javadoc] protected void doProcessingInstruction(String target, String data) throws SAXException { [javadoc] ^ [javadoc] /home/iurt/rpmbuild/BUILD/apache-ivy-2.4.0/src/java/org/apache/ivy/osgi/util/DelegatingHandler.java:424: warning: no description for @throws [javadoc] * @throws SAXException [javadoc] ^ [javadoc] /home/iurt/rpmbuild/BUILD/apache-ivy-2.4.0/src/java/org/apache/ivy/osgi/util/DelegatingHandler.java:426: warning: no @param for name [javadoc] protected void doSkippedEntity(String name) throws SAXException { [javadoc] ^ [javadoc] /home/iurt/rpmbuild/BUILD/apache-ivy-2.4.0/src/java/org/apache/ivy/osgi/util/DelegatingHandler.java:431: warning: no description for @throws [javadoc] * @throws SAXException [javadoc] ^ [javadoc] /home/iurt/rpmbuild/BUILD/apache-ivy-2.4.0/src/java/org/apache/ivy/osgi/util/DelegatingHandler.java:446: warning: no description for @throws [javadoc] * @throws SAXException [javadoc] ^ [javadoc] /home/iurt/rpmbuild/BUILD/apache-ivy-2.4.0/src/java/org/apache/ivy/osgi/util/DelegatingHandler.java:448: warning: no @param for name [javadoc] protected void doUnparsedEntityDecl(String name, String publicId, String systemId, [javadoc] ^ [javadoc] /home/iurt/rpmbuild/BUILD/apache-ivy-2.4.0/src/java/org/apache/ivy/osgi/util/DelegatingHandler.java:448: warning: no @param for publicId [javadoc] protected void doUnparsedEntityDecl(String name, String publicId, String systemId, [javadoc] ^ [javadoc] /home/iurt/rpmbuild/BUILD/apache-ivy-2.4.0/src/java/org/apache/ivy/osgi/util/DelegatingHandler.java:448: warning: no @param for systemId [javadoc] protected void doUnparsedEntityDecl(String name, String publicId, String systemId, [javadoc] ^ [javadoc] /home/iurt/rpmbuild/BUILD/apache-ivy-2.4.0/src/java/org/apache/ivy/osgi/util/DelegatingHandler.java:448: warning: no @param for notationName [javadoc] protected void doUnparsedEntityDecl(String name, String publicId, String systemId, [javadoc] ^ [javadoc] /home/iurt/rpmbuild/BUILD/apache-ivy-2.4.0/src/java/org/apache/ivy/osgi/util/DelegatingHandler.java:467: warning: no description for @throws [javadoc] * @throws SAXException [javadoc] ^ [javadoc] /home/iurt/rpmbuild/BUILD/apache-ivy-2.4.0/src/java/org/apache/ivy/osgi/util/DelegatingHandler.java:469: warning: no @param for exception [javadoc] protected void doWarning(SAXParseException exception) throws SAXException { [javadoc] ^ [javadoc] /home/iurt/rpmbuild/BUILD/apache-ivy-2.4.0/src/java/org/apache/ivy/osgi/util/DelegatingHandler.java:485: warning: no description for @throws [javadoc] * @throws SAXException [javadoc] ^ [javadoc] /home/iurt/rpmbuild/BUILD/apache-ivy-2.4.0/src/java/org/apache/ivy/osgi/util/DelegatingHandler.java:487: warning: no @param for exception [javadoc] protected void doError(SAXParseException exception) throws SAXException { [javadoc] ^ [javadoc] /home/iurt/rpmbuild/BUILD/apache-ivy-2.4.0/src/java/org/apache/ivy/osgi/util/DelegatingHandler.java:503: warning: no description for @throws [javadoc] * @throws SAXException [javadoc] ^ [javadoc] /home/iurt/rpmbuild/BUILD/apache-ivy-2.4.0/src/java/org/apache/ivy/osgi/util/DelegatingHandler.java:505: warning: no @param for exception [javadoc] protected void doFatalError(SAXParseException exception) throws SAXException { [javadoc] ^ [javadoc] /home/iurt/rpmbuild/BUILD/apache-ivy-2.4.0/src/java/org/apache/ivy/osgi/util/Version.java:65: warning: no description for @param [javadoc] * @param baseVersion [javadoc] ^ [javadoc] /home/iurt/rpmbuild/BUILD/apache-ivy-2.4.0/src/java/org/apache/ivy/osgi/util/Version.java:66: error: @param name not found [javadoc] * @param qualifier [javadoc] ^ [javadoc] /home/iurt/rpmbuild/BUILD/apache-ivy-2.4.0/src/java/org/apache/ivy/osgi/util/Version.java:66: warning: no description for @param [javadoc] * @param qualifier [javadoc] ^ [javadoc] /home/iurt/rpmbuild/BUILD/apache-ivy-2.4.0/src/java/org/apache/ivy/osgi/util/Version.java:68: warning: no @param for extraQualifier [javadoc] public Version(Version baseVersion, String extraQualifier) { [javadoc] ^ [javadoc] /home/iurt/rpmbuild/BUILD/apache-ivy-2.4.0/src/java/org/apache/ivy/plugins/latest/LatestStrategy.java:29: warning: no description for @param [javadoc] * @param infos [javadoc] ^ [javadoc] /home/iurt/rpmbuild/BUILD/apache-ivy-2.4.0/src/java/org/apache/ivy/plugins/latest/LatestStrategy.java:30: warning: no description for @param [javadoc] * @param date [javadoc] ^ [javadoc] /home/iurt/rpmbuild/BUILD/apache-ivy-2.4.0/src/java/org/apache/ivy/plugins/latest/LatestStrategy.java:39: warning: no description for @param [javadoc] * @param infos [javadoc] ^ [javadoc] /home/iurt/rpmbuild/BUILD/apache-ivy-2.4.0/src/java/org/apache/ivy/util/MessageLogger.java:53: error: reference not found [javadoc] * @see Message#MSG_ERROR [javadoc] ^ [javadoc] /home/iurt/rpmbuild/BUILD/apache-ivy-2.4.0/src/java/org/apache/ivy/util/FileResolver.java:36: error: @param name not found [javadoc] * @param fileName [javadoc] ^ [javadoc] /home/iurt/rpmbuild/BUILD/apache-ivy-2.4.0/src/java/org/apache/ivy/util/FileUtil.java:461: error: bad use of '>' [javadoc] * File("test/dir1/dir2/file.txt")) => {new File("test/dir1"), new File("test/dir1/dir2"), new [javadoc] ^ [javadoc] /home/iurt/rpmbuild/BUILD/apache-ivy-2.4.0/src/java/org/apache/ivy/util/StringUtils.java:92: error: bad use of '>' [javadoc] * join(new String[] {"one", "two", "three"}, ", ") -> "one, two, three" [javadoc] ^ [javadoc] /home/iurt/rpmbuild/BUILD/apache-ivy-2.4.0/src/java/org/apache/ivy/util/StringUtils.java:133: error: malformed HTML [javadoc] * (char < 256). [javadoc] ^ [javadoc] /home/iurt/rpmbuild/BUILD/apache-ivy-2.4.0/src/java/org/apache/ivy/util/XMLHelper.java:180: error: malformed HTML [javadoc] * moment, only the following characters are being escaped: (<), (&), (') and ("). [javadoc] ^ [javadoc] /home/iurt/rpmbuild/BUILD/apache-ivy-2.4.0/src/java/org/apache/ivy/util/XMLHelper.java:180: error: bad HTML entity [javadoc] * moment, only the following characters are being escaped: (<), (&), (') and ("). [javadoc] ^ [javadoc] /home/iurt/rpmbuild/BUILD/apache-ivy-2.4.0/src/java/org/apache/ivy/util/XMLHelper.java:182: error: bad use of '>' [javadoc] * Remark: we don't escape the (>) character to keep the readability of the configuration [javadoc] ^ [javadoc] /home/iurt/rpmbuild/BUILD/apache-ivy-2.4.0/src/java/org/apache/ivy/util/XMLHelper.java:183: error: bad HTML entity [javadoc] * mapping! The XML spec only requires that the (&) and (<) characters are being escaped inside [javadoc] ^ [javadoc] /home/iurt/rpmbuild/BUILD/apache-ivy-2.4.0/src/java/org/apache/ivy/util/XMLHelper.java:183: error: malformed HTML [javadoc] * mapping! The XML spec only requires that the (&) and (<) characters are being escaped inside [javadoc] ^ [javadoc] /home/iurt/rpmbuild/BUILD/apache-ivy-2.4.0/src/java/org/apache/ivy/plugins/repository/Resource.java:71: error: unexpected end tag:
[javadoc] * Determine if the resource is available. Note that this method only checks for [javadoc] ^ [javadoc] /home/iurt/rpmbuild/BUILD/apache-ivy-2.4.0/src/java/org/apache/ivy/plugins/resolver/DependencyResolver.java:164: error: bad use of '>' [javadoc] * "organisation"->"foo" "module"->"bar" The results will be the list of revisions of the module [javadoc] ^ [javadoc] /home/iurt/rpmbuild/BUILD/apache-ivy-2.4.0/src/java/org/apache/ivy/plugins/resolver/DependencyResolver.java:164: error: bad use of '>' [javadoc] * "organisation"->"foo" "module"->"bar" The results will be the list of revisions of the module [javadoc] ^ [javadoc] /home/iurt/rpmbuild/BUILD/apache-ivy-2.4.0/src/java/org/apache/ivy/plugins/resolver/DependencyResolver.java:181: error: malformed HTML [javadoc] * @return the list of token values (Mapnull
[javadoc] ^
[javadoc] /home/iurt/rpmbuild/BUILD/apache-ivy-2.4.0/src/java/org/apache/ivy/plugins/resolver/DependencyResolver.java:181: error: bad use of '>'
[javadoc] * @return the list of token values (Mapnull
[javadoc] ^
[javadoc] /home/iurt/rpmbuild/BUILD/apache-ivy-2.4.0/src/java/org/apache/ivy/osgi/repo/RepositoryManifestIterable.java:40: error: @param name not found
[javadoc] * @param root
[javadoc] ^
[javadoc] /home/iurt/rpmbuild/BUILD/apache-ivy-2.4.0/src/java/org/apache/ivy/plugins/repository/Repository.java:29: error: unexpected end tag:
[javadoc] * generated by Ivy enabled build systems.
[javadoc] ^
[javadoc] /home/iurt/rpmbuild/BUILD/apache-ivy-2.4.0/src/java/org/apache/ivy/plugins/repository/Repository.java:37: error: unexpected end tag:
[javadoc] *
[javadoc] ^
[javadoc] /home/iurt/rpmbuild/BUILD/apache-ivy-2.4.0/src/java/org/apache/ivy/plugins/repository/Repository.java:38: error: header used out of sequence: TransferEvent.REQUEST_GET or TransferEvent.REQUEST_PUT
[javadoc] ^
[javadoc] /home/iurt/rpmbuild/BUILD/apache-ivy-2.4.0/src/java/org/apache/ivy/plugins/repository/TransferEvent.java:189: error: element not closed: code
[javadoc] * TransferEvent.REQUEST_GET or TransferEvent.REQUEST_PUT
[javadoc] ^
[javadoc] /home/iurt/rpmbuild/BUILD/apache-ivy-2.4.0/src/java/org/apache/ivy/plugins/repository/TransferEvent.java:189: error: element not closed: code
[javadoc] * TransferEvent.REQUEST_GET or TransferEvent.REQUEST_PUT
[javadoc] ^
[javadoc] /home/iurt/rpmbuild/BUILD/apache-ivy-2.4.0/src/java/org/apache/ivy/plugins/repository/TransferEvent.java:189: error: element not closed: code
[javadoc] * TransferEvent.REQUEST_GET or TransferEvent.REQUEST_PUT
[javadoc] ^
[javadoc] /home/iurt/rpmbuild/BUILD/apache-ivy-2.4.0/src/java/org/apache/ivy/plugins/repository/TransferEvent.java:200: error: element not closed: code
[javadoc] * TransferEvent.REQUEST_GET or TransferEvent.REQUEST_PUT.
[javadoc] ^
[javadoc] /home/iurt/rpmbuild/BUILD/apache-ivy-2.4.0/src/java/org/apache/ivy/plugins/repository/TransferEvent.java:200: error: element not closed: code
[javadoc] * TransferEvent.REQUEST_GET or TransferEvent.REQUEST_PUT.
[javadoc] ^
[javadoc] /home/iurt/rpmbuild/BUILD/apache-ivy-2.4.0/src/java/org/apache/ivy/plugins/repository/TransferEvent.java:200: error: element not closed: code
[javadoc] * TransferEvent.REQUEST_GET or TransferEvent.REQUEST_PUT.
[javadoc] ^
[javadoc] /home/iurt/rpmbuild/BUILD/apache-ivy-2.4.0/src/java/org/apache/ivy/plugins/repository/TransferEvent.java:200: error: element not closed: code
[javadoc] * TransferEvent.REQUEST_GET or TransferEvent.REQUEST_PUT.
[javadoc] ^
[javadoc] /home/iurt/rpmbuild/BUILD/apache-ivy-2.4.0/src/java/org/apache/ivy/plugins/repository/TransferEvent.java:313: error: unexpected end tag:
[javadoc] *
[javadoc] ^
[javadoc] /home/iurt/rpmbuild/BUILD/apache-ivy-2.4.0/src/java/org/apache/ivy/plugins/repository/TransferEvent.java:320: error: unexpected end tag:
[javadoc] *
[javadoc] ^
[javadoc] /home/iurt/rpmbuild/BUILD/apache-ivy-2.4.0/src/java/org/apache/ivy/plugins/circular/CircularDependencyException.java:31: error: @param name not found
[javadoc] * @param descriptors
[javadoc] ^
[javadoc] /home/iurt/rpmbuild/BUILD/apache-ivy-2.4.0/src/java/org/apache/ivy/plugins/circular/CircularDependencyHelper.java:38: error: @param name not found
[javadoc] * @param descriptors
[javadoc] ^
[javadoc] /home/iurt/rpmbuild/BUILD/apache-ivy-2.4.0/src/java/org/apache/ivy/plugins/circular/CircularDependencyHelper.java:65: error: unknown tag: ModuleDescriptor
[javadoc] * a List
[javadoc] ^
[javadoc] /home/iurt/rpmbuild/BUILD/apache-ivy-2.4.0/src/java/org/apache/ivy/core/retrieve/RetrieveEngine.java:297: error: malformed HTML
[javadoc] * @return Map>
[javadoc] ^
[javadoc] /home/iurt/rpmbuild/BUILD/apache-ivy-2.4.0/src/java/org/apache/ivy/core/retrieve/RetrieveEngine.java:297: error: unknown tag: String
[javadoc] * @return Map>
[javadoc] ^
[javadoc] /home/iurt/rpmbuild/BUILD/apache-ivy-2.4.0/src/java/org/apache/ivy/core/retrieve/RetrieveEngine.java:297: error: bad use of '>'
[javadoc] * @return Map>
[javadoc] ^
[javadoc] /home/iurt/rpmbuild/BUILD/apache-ivy-2.4.0/src/java/org/apache/ivy/plugins/lock/LockStrategy.java:34: error: unexpected end tag:
[javadoc] * the strategy.
[javadoc] ^
[javadoc] /home/iurt/rpmbuild/BUILD/apache-ivy-2.4.0/src/java/org/apache/ivy/Ivy.java:358: error: unexpected end tag:
[javadoc] *
[javadoc] ^
[javadoc] /home/iurt/rpmbuild/BUILD/apache-ivy-2.4.0/src/java/org/apache/ivy/Ivy.java:92: error: unexpected end tag:
[javadoc] *
[javadoc] ^
[javadoc] /home/iurt/rpmbuild/BUILD/apache-ivy-2.4.0/src/java/org/apache/ivy/Ivy.java:97: error: self-closing element not allowed
[javadoc] * the {@link Ivy} instance you use.
[javadoc] ^
[javadoc] /home/iurt/rpmbuild/BUILD/apache-ivy-2.4.0/src/java/org/apache/ivy/Ivy.java:114: error: unexpected end tag:
[javadoc] *
[javadoc] ^
[javadoc] /home/iurt/rpmbuild/BUILD/apache-ivy-2.4.0/src/java/org/apache/ivy/core/module/descriptor/ConfigurationGroup.java:40: error: reference not found
[javadoc] * {@link #getIntersectedConfiguration(String)}.
[javadoc] ^
[javadoc] /home/iurt/rpmbuild/BUILD/apache-ivy-2.4.0/src/java/org/apache/ivy/core/module/descriptor/DefaultModuleDescriptor.java:611: error: @param name not found
[javadoc] * @param resolverName
[javadoc] ^
[javadoc] /home/iurt/rpmbuild/BUILD/apache-ivy-2.4.0/src/java/org/apache/ivy/core/module/descriptor/ModuleDescriptor.java:128: error: unknown tag: retun
[javadoc] * @retun The dependencies of the module. If there is no dependencies return an empty array (non
[javadoc] ^
[javadoc] /home/iurt/rpmbuild/BUILD/apache-ivy-2.4.0/src/java/org/apache/ivy/core/module/descriptor/ModuleDescriptor.java:261: error: self-closing element not allowed
[javadoc] * given. The key is the name of the tag, the value is its content.
[javadoc] ^
[javadoc] /home/iurt/rpmbuild/BUILD/apache-ivy-2.4.0/src/java/org/apache/ivy/core/event/IvyEventFilter.java:61: error: no summary or caption for table
[javadoc] *
[javadoc] ^
[javadoc] /home/iurt/rpmbuild/BUILD/apache-ivy-2.4.0/src/java/org/apache/ivy/core/cache/DefaultRepositoryCacheManager.java:426: error: @param name not found
[javadoc] * @param name
[javadoc] ^
[javadoc] /home/iurt/rpmbuild/BUILD/apache-ivy-2.4.0/src/java/org/apache/ivy/core/cache/RepositoryCacheManager.java:47: error: reference not found
[javadoc] * {@link #findModuleInCache(DependencyDescriptor, CacheMetadataOptions, String)}.
[javadoc] ^
[javadoc] /home/iurt/rpmbuild/BUILD/apache-ivy-2.4.0/src/java/org/apache/ivy/core/cache/RepositoryCacheManager.java:49: error: @param name not found
[javadoc] * @param md
[javadoc] ^
[javadoc] /home/iurt/rpmbuild/BUILD/apache-ivy-2.4.0/src/java/org/apache/ivy/plugins/matcher/ExactOrRegexpPatternMatcher.java:23: error: self-closing element not allowed
[javadoc] *
[javadoc] ^
[javadoc] /home/iurt/rpmbuild/BUILD/apache-ivy-2.4.0/src/java/org/apache/ivy/plugins/matcher/ExactPatternMatcher.java:22: error: self-closing element not allowed
[javadoc] *
[javadoc] ^
[javadoc] /home/iurt/rpmbuild/BUILD/apache-ivy-2.4.0/src/java/org/apache/ivy/plugins/matcher/GlobPatternMatcher.java:33: error: self-closing element not allowed
[javadoc] *
[javadoc] ^
[javadoc] /home/iurt/rpmbuild/BUILD/apache-ivy-2.4.0/src/java/org/apache/ivy/plugins/matcher/GlobPatternMatcher.java:34: error: malformed HTML
[javadoc] * Note that this matcher is available only with
[javadoc] * Jakarta Oro 2.0.8 in your classpath.
[javadoc] ^
[javadoc] /home/iurt/rpmbuild/BUILD/apache-ivy-2.4.0/src/java/org/apache/ivy/plugins/matcher/PatternMatcher.java:22: error: self-closing element not allowed
[javadoc] *
[javadoc] ^
[javadoc] /home/iurt/rpmbuild/BUILD/apache-ivy-2.4.0/src/java/org/apache/ivy/core/report/ConfigurationResolveReport.java:81: error: self-closing element not allowed
[javadoc] * Check if the set of dependencies has changed since the previous execution of a resolution.
[javadoc] ^
[javadoc] /home/iurt/rpmbuild/BUILD/apache-ivy-2.4.0/src/java/org/apache/ivy/core/report/ConfigurationResolveReport.java:83: error: invalid end tag:
[javadoc] * the new report is serialized there. This function also use the internal dependencies
[javadoc] ^
[javadoc] /home/iurt/rpmbuild/BUILD/apache-ivy-2.4.0/src/java/org/apache/ivy/core/report/ConfigurationResolveReport.java:87: error: invalid use of @return
[javadoc] * @return
[javadoc] ^
[javadoc] /home/iurt/rpmbuild/BUILD/apache-ivy-2.4.0/src/java/org/apache/ivy/core/report/ConfigurationResolveReport.java:113: error: unknown tag: pre
[javadoc] * @pre checkIfChanged has been called.
[javadoc] ^
[javadoc] /home/iurt/rpmbuild/BUILD/apache-ivy-2.4.0/src/java/org/apache/ivy/util/filter/FilterHelper.java:64: error: self-closing element not allowed
[javadoc] *
[javadoc] ^
[javadoc] /home/iurt/rpmbuild/BUILD/apache-ivy-2.4.0/src/java/org/apache/ivy/core/search/SearchEngine.java:187: error: @param name not found
[javadoc] * @param criteria
[javadoc] ^
[javadoc] /home/iurt/rpmbuild/BUILD/apache-ivy-2.4.0/src/java/org/apache/ivy/core/search/SearchEngine.java:224: error: @param name not found
[javadoc] * @param criteria
[javadoc] ^
[javadoc] /home/iurt/rpmbuild/BUILD/apache-ivy-2.4.0/src/java/org/apache/ivy/plugins/conflict/LatestConflictManager.java:158: error: @param name not found
[javadoc] * @param latestStrategy
[javadoc] ^
[javadoc] /home/iurt/rpmbuild/BUILD/apache-ivy-2.4.0/src/java/org/apache/ivy/plugins/conflict/LatestCompatibleConflictManager.java:49: error: self-closing element not allowed
[javadoc] * Here is an example of what this conflict manager is able to do:
[javadoc] ^
[javadoc] /home/iurt/rpmbuild/BUILD/apache-ivy-2.4.0/src/java/org/apache/ivy/plugins/conflict/LatestCompatibleConflictManager.java:59: error: self-closing element not allowed
[javadoc] * Result: #B;1.4, #C;2.5, #D;1.5
[javadoc] ^
[javadoc] /home/iurt/rpmbuild/BUILD/apache-ivy-2.4.0/src/java/org/apache/ivy/plugins/conflict/LatestCompatibleConflictManager.java:64: error: unexpected end tag:
[javadoc] *
[javadoc] ^
[javadoc] /home/iurt/rpmbuild/BUILD/apache-ivy-2.4.0/src/java/org/apache/ivy/plugins/parser/xml/XmlModuleDescriptorParser.java:103: error: @param name not found
[javadoc] * @param settings
[javadoc] ^
[javadoc] /home/iurt/rpmbuild/BUILD/apache-ivy-2.4.0/src/java/org/apache/ivy/plugins/parser/xml/XmlModuleDescriptorParser.java:590: error: @param name not found
[javadoc] * @param sourceMrid
[javadoc] ^
[javadoc] /home/iurt/rpmbuild/BUILD/apache-ivy-2.4.0/src/java/org/apache/ivy/plugins/parser/xml/XmlModuleDescriptorParser.java:592: error: @param name not found
[javadoc] * @param configurations
[javadoc] ^
[javadoc] /home/iurt/rpmbuild/BUILD/apache-ivy-2.4.0/src/java/org/apache/ivy/core/resolve/IvyNode.java:1232: error: @param name not found
[javadoc] * @param rootModuleConf
[javadoc] ^
[javadoc] /home/iurt/rpmbuild/BUILD/apache-ivy-2.4.0/src/java/org/apache/ivy/core/resolve/IvyNode.java:1277: error: reference not found
[javadoc] * @see #blacklist(String)
[javadoc] ^
[javadoc] /home/iurt/rpmbuild/BUILD/apache-ivy-2.4.0/src/java/org/apache/ivy/core/resolve/IvyNode.java:1287: error: reference not found
[javadoc] * @see #blacklist(String)
[javadoc] ^
[javadoc] /home/iurt/rpmbuild/BUILD/apache-ivy-2.4.0/src/java/org/apache/ivy/core/resolve/IvyNodeCallers.java:154: error: @param name not found
[javadoc] * @param mrid
[javadoc] ^
[javadoc] /home/iurt/rpmbuild/BUILD/apache-ivy-2.4.0/src/java/org/apache/ivy/core/resolve/IvyNodeUsage.java:281: error: reference not found
[javadoc] * @see #blacklist(String)
[javadoc] ^
[javadoc] /home/iurt/rpmbuild/BUILD/apache-ivy-2.4.0/src/java/org/apache/ivy/core/resolve/ResolveEngine.java:501: error: @param name not found
[javadoc] * @param confs
[javadoc] ^
[javadoc] /home/iurt/rpmbuild/BUILD/apache-ivy-2.4.0/src/java/org/apache/ivy/core/resolve/ResolveEngine.java:503: error: @param name not found
[javadoc] * @param getCache
[javadoc] ^
[javadoc] /home/iurt/rpmbuild/BUILD/apache-ivy-2.4.0/src/java/org/apache/ivy/core/resolve/ResolveEngine.java:505: error: @param name not found
[javadoc] * @param date
[javadoc] ^
[javadoc] /home/iurt/rpmbuild/BUILD/apache-ivy-2.4.0/src/java/org/apache/ivy/core/resolve/ResolveOptions.java:185: error: unknown tag: pre
[javadoc] * @pre can only be called if useSpecialConfs()==false. When it is true, you have to provide a
[javadoc] ^
[javadoc] /home/iurt/rpmbuild/BUILD/apache-ivy-2.4.0/src/java/org/apache/ivy/core/resolve/VisitNode.java:246: error: @param name not found
[javadoc] * @param node
[javadoc] ^
[javadoc] /home/iurt/rpmbuild/BUILD/apache-ivy-2.4.0/src/java/org/apache/ivy/core/resolve/VisitNode.java:45: error: text not allowed in element
[javadoc] * - parent
[javadoc] ^
[javadoc] /home/iurt/rpmbuild/BUILD/apache-ivy-2.4.0/src/java/org/apache/ivy/core/resolve/VisitNode.java:47: error: text not allowed in element
[javadoc] * - parentConf
[javadoc] ^
[javadoc] /home/iurt/rpmbuild/BUILD/apache-ivy-2.4.0/src/java/org/apache/ivy/core/resolve/VisitNode.java:49: error: text not allowed in element
[javadoc] * - rootModuleConf
[javadoc] ^
[javadoc] /home/iurt/rpmbuild/BUILD/apache-ivy-2.4.0/src/java/org/apache/ivy/ant/AntBuildTrigger.java:51: error: unexpected end tag:
[javadoc] *
[javadoc] ^
[javadoc] /home/iurt/rpmbuild/BUILD/apache-ivy-2.4.0/src/java/org/apache/ivy/ant/AntMessageLogger.java:111: error: @param name not found
[javadoc] * @param antProjectComponent
[javadoc] ^
[javadoc] /home/iurt/rpmbuild/BUILD/apache-ivy-2.4.0/src/java/org/apache/ivy/ant/IvyAntSettings.java:109: error: @param name not found
[javadoc] * @param project
[javadoc] ^
[javadoc] /home/iurt/rpmbuild/BUILD/apache-ivy-2.4.0/src/java/org/apache/ivy/plugins/parser/m2/PomModuleDescriptorParser.java:61: error: self-closing element not allowed
[javadoc] * scopes, as documented here:
[javadoc] ^
[javadoc] Building index for all the packages and classes...
[javadoc] Building index for all classes...
[javadoc] Generating /home/iurt/rpmbuild/BUILD/apache-ivy-2.4.0/build/doc/reports/api/help-doc.html...
[javadoc] 97 errors
[javadoc] 100 warnings
init:
prepare:
compile-core:
compile-bootstrap:
init-ivy-user-home:
init-ivy-local-home:
init-ivy-home:
init-ivy:
[ivy:configure] impossible to define new type: class not found: org.apache.ivy.plugins.resolver.SshResolver in [] nor Ivy classloader
[ivy:configure] impossible to define new type: class not found: org.apache.ivy.plugins.signer.bouncycastle.OpenPGPSignatureGenerator in [] nor Ivy classloader
[ivy:configure] impossible to define new type: class not found: org.apache.ivy.plugins.resolver.SFTPResolver in [] nor Ivy classloader
[ivy:configure] impossible to define new type: class not found: org.apache.ivy.plugins.resolver.VfsResolver in [] nor Ivy classloader
[ivy:configure] DEPRECATED: 'ivy.conf.file' is deprecated, use 'ivy.settings.file' instead
[ivy:configure] :: loading settings :: file = /etc/ivy/ivysettings.xml
resolve:
[ivy:retrieve] :: retrieving :: org.apache.ivy#ivy [sync]
[ivy:retrieve] confs: [default, test]
[ivy:retrieve] conflict on /home/iurt/rpmbuild/BUILD/apache-ivy-2.4.0/lib/ant-launcher.jar in [default, test]: SYSTEM won
[ivy:retrieve] 0 artifacts copied, 15 already retrieved (0kB/9ms)
compile-ant:
compile-optional:
default-version:
jar:
[copy] Copying 1 file to /home/iurt/rpmbuild/BUILD/apache-ivy-2.4.0/build/classes/all
[jar] Building jar: /home/iurt/rpmbuild/BUILD/apache-ivy-2.4.0/build/artifact/jars/ivy.jar
[copy] Copying 1 file to /home/iurt/rpmbuild/BUILD/apache-ivy-2.4.0/build/artifact
[delete] Deleting: /home/iurt/rpmbuild/BUILD/apache-ivy-2.4.0/build/classes/core/module.properties
sources:
[mkdir] Created dir: /home/iurt/rpmbuild/BUILD/apache-ivy-2.4.0/build/artifact/sources
[jar] Building jar: /home/iurt/rpmbuild/BUILD/apache-ivy-2.4.0/build/artifact/sources/ivy.jar
publish-local:
[ivy:publish] :: delivering :: org.apache.ivy#ivy;2.4.0 :: 2.4.0-local-20200128231501 :: integration :: Tue Jan 28 23:15:15 UTC 2020
[ivy:publish] delivering ivy file to /home/iurt/rpmbuild/BUILD/apache-ivy-2.4.0/build/artifact/ivys/ivy.xml
[ivy:publish] :: publishing :: org.apache.ivy#ivy
init:
prepare:
compile-core:
compile-bootstrap:
init-ivy-user-home:
init-ivy-local-home:
init-ivy-home:
init-ivy:
[ivy:configure] impossible to define new type: class not found: org.apache.ivy.plugins.resolver.SshResolver in [] nor Ivy classloader
[ivy:configure] impossible to define new type: class not found: org.apache.ivy.plugins.signer.bouncycastle.OpenPGPSignatureGenerator in [] nor Ivy classloader
[ivy:configure] impossible to define new type: class not found: org.apache.ivy.plugins.resolver.SFTPResolver in [] nor Ivy classloader
[ivy:configure] impossible to define new type: class not found: org.apache.ivy.plugins.resolver.VfsResolver in [] nor Ivy classloader
[ivy:configure] DEPRECATED: 'ivy.conf.file' is deprecated, use 'ivy.settings.file' instead
[ivy:configure] :: loading settings :: file = /etc/ivy/ivysettings.xml
resolve:
[ivy:retrieve] :: retrieving :: org.apache.ivy#ivy [sync]
[ivy:retrieve] confs: [default, test]
[ivy:retrieve] conflict on /home/iurt/rpmbuild/BUILD/apache-ivy-2.4.0/lib/ant-launcher.jar in [default, test]: SYSTEM won
[ivy:retrieve] 0 artifacts copied, 15 already retrieved (0kB/27ms)
compile-ant:
compile-optional:
default-version:
jar:
[copy] Copying 1 file to /home/iurt/rpmbuild/BUILD/apache-ivy-2.4.0/build/classes/all
[delete] Deleting: /home/iurt/rpmbuild/BUILD/apache-ivy-2.4.0/build/classes/core/module.properties
build-test:
[javac] Compiling 125 source files to /home/iurt/rpmbuild/BUILD/apache-ivy-2.4.0/build/test
[javac] warning: [options] bootstrap class path not set in conjunction with -source 1.5
[javac] warning: [options] source value 1.5 is obsolete and will be removed in a future release
[javac] warning: [options] target value 1.5 is obsolete and will be removed in a future release
[javac] warning: [options] To suppress warnings about obsolete options, use -Xlint:-options.
[javac] Note: Some input files use or override a deprecated API.
[javac] Note: Recompile with -Xlint:deprecation for details.
[javac] Note: Some input files use unchecked or unsafe operations.
[javac] Note: Recompile with -Xlint:unchecked for details.
[javac] 4 warnings
[copy] Copying 276 files to /home/iurt/rpmbuild/BUILD/apache-ivy-2.4.0/build/test
[copy] Copied 4 empty directories to 2 empty directories under /home/iurt/rpmbuild/BUILD/apache-ivy-2.4.0/build/test
init-tests-offline:
init-tests-online:
init-tests:
prepare-osgi-tests:
generate-bundles:
generate-bundle:
[jar] Building MANIFEST-only jar: /home/iurt/rpmbuild/BUILD/apache-ivy-2.4.0/test/test-repo/bundlerepo/org.apache.ivy.osgi.testbundle.exporting.ambiguity_3.3.3.jar
[copy] Copying 1 file to /home/iurt/rpmbuild/BUILD/apache-ivy-2.4.0/test/test-repo/ivyrepo/org.apache.ivy.osgi/testbundle-exporting-ambiguity/3.3.3/jars
generate-bundle:
[jar] Building MANIFEST-only jar: /home/iurt/rpmbuild/BUILD/apache-ivy-2.4.0/test/test-repo/bundlerepo/org.apache.ivy.osgi.testbundle.importing.ambiguity_3.2.1.jar
[copy] Copying 1 file to /home/iurt/rpmbuild/BUILD/apache-ivy-2.4.0/test/test-repo/ivyrepo/org.apache.ivy.osgi/testbundle-importing-ambiguity/3.2.1/jars
generate-bundle:
[jar] Building MANIFEST-only jar: /home/iurt/rpmbuild/BUILD/apache-ivy-2.4.0/test/test-repo/bundlerepo/org.apache.ivy.osgi.testbundle.importing.jrepackage_1.2.3.jar
[copy] Copying 1 file to /home/iurt/rpmbuild/BUILD/apache-ivy-2.4.0/test/test-repo/ivyrepo/org.apache.ivy.osgi/testbundle-importing-jrepackage/1.2.3/jars
generate-bundle:
[jar] Building MANIFEST-only jar: /home/iurt/rpmbuild/BUILD/apache-ivy-2.4.0/test/test-repo/bundlerepo/org.apache.ivy.osgi.testbundle.importing.optional_3.2.1.jar
[copy] Copying 1 file to /home/iurt/rpmbuild/BUILD/apache-ivy-2.4.0/test/test-repo/ivyrepo/org.apache.ivy.osgi/testbundle-importing-optional/3.2.1/jars
generate-bundle:
[jar] Building MANIFEST-only jar: /home/iurt/rpmbuild/BUILD/apache-ivy-2.4.0/test/test-repo/bundlerepo/org.apache.ivy.osgi.testbundle.importing.rangeversion_3.2.1.jar
[copy] Copying 1 file to /home/iurt/rpmbuild/BUILD/apache-ivy-2.4.0/test/test-repo/ivyrepo/org.apache.ivy.osgi/testbundle-importing-rangeversion/3.2.1/jars
generate-bundle:
[jar] Building MANIFEST-only jar: /home/iurt/rpmbuild/BUILD/apache-ivy-2.4.0/test/test-repo/bundlerepo/org.apache.ivy.osgi.testbundle.importing.transitiveoptional_3.2.1.jar
[copy] Copying 1 file to /home/iurt/rpmbuild/BUILD/apache-ivy-2.4.0/test/test-repo/ivyrepo/org.apache.ivy.osgi/testbundle-importing-transitiveoptional/3.2.1/jars
generate-bundle:
[jar] Building MANIFEST-only jar: /home/iurt/rpmbuild/BUILD/apache-ivy-2.4.0/test/test-repo/bundlerepo/org.apache.ivy.osgi.testbundle.importing.use_3.2.1.jar
[copy] Copying 1 file to /home/iurt/rpmbuild/BUILD/apache-ivy-2.4.0/test/test-repo/ivyrepo/org.apache.ivy.osgi/testbundle-importing-use/3.2.1/jars
generate-bundle:
[jar] Building MANIFEST-only jar: /home/iurt/rpmbuild/BUILD/apache-ivy-2.4.0/test/test-repo/bundlerepo/org.apache.ivy.osgi.testbundle.importing.version_3.2.1.jar
[copy] Copying 1 file to /home/iurt/rpmbuild/BUILD/apache-ivy-2.4.0/test/test-repo/ivyrepo/org.apache.ivy.osgi/testbundle-importing-version/3.2.1/jars
generate-bundle:
[jar] Building MANIFEST-only jar: /home/iurt/rpmbuild/BUILD/apache-ivy-2.4.0/test/test-repo/bundlerepo/org.apache.ivy.osgi.testbundle.importing_3.2.1.jar
[copy] Copying 1 file to /home/iurt/rpmbuild/BUILD/apache-ivy-2.4.0/test/test-repo/ivyrepo/org.apache.ivy.osgi/testbundle-importing/3.2.1/jars
generate-bundle:
[jar] Building MANIFEST-only jar: /home/iurt/rpmbuild/BUILD/apache-ivy-2.4.0/test/test-repo/bundlerepo/org.apache.ivy.osgi.testbundle.require.ambiguity_1.1.1.jar
[copy] Copying 1 file to /home/iurt/rpmbuild/BUILD/apache-ivy-2.4.0/test/test-repo/ivyrepo/org.apache.ivy.osgi/testbundle-require-ambiguity/1.1.1/jars
generate-bundle:
[jar] Building MANIFEST-only jar: /home/iurt/rpmbuild/BUILD/apache-ivy-2.4.0/test/test-repo/bundlerepo/org.apache.ivy.osgi.testbundle.require_1.1.1.jar
[copy] Copying 1 file to /home/iurt/rpmbuild/BUILD/apache-ivy-2.4.0/test/test-repo/ivyrepo/org.apache.ivy.osgi/testbundle-require/1.1.1/jars
generate-bundle:
[jar] Building MANIFEST-only jar: /home/iurt/rpmbuild/BUILD/apache-ivy-2.4.0/test/test-repo/bundlerepo/org.apache.ivy.osgi.testbundle.requirejre_2.2.2.jar
[copy] Copying 1 file to /home/iurt/rpmbuild/BUILD/apache-ivy-2.4.0/test/test-repo/ivyrepo/org.apache.ivy.osgi/testbundle-requirejre/2.2.2/jars
generate-bundle:
[jar] Building MANIFEST-only jar: /home/iurt/rpmbuild/BUILD/apache-ivy-2.4.0/test/test-repo/bundlerepo/org.apache.ivy.osgi.testbundle.use_2.2.2.jar
[copy] Copying 1 file to /home/iurt/rpmbuild/BUILD/apache-ivy-2.4.0/test/test-repo/ivyrepo/org.apache.ivy.osgi/testbundle-use/2.2.2/jars
generate-bundle:
[jar] Building MANIFEST-only jar: /home/iurt/rpmbuild/BUILD/apache-ivy-2.4.0/test/test-repo/bundlerepo/org.apache.ivy.osgi.testbundle_1.2.3.jar
[copy] Copying 1 file to /home/iurt/rpmbuild/BUILD/apache-ivy-2.4.0/test/test-repo/ivyrepo/org.apache.ivy.osgi/testbundle/1.2.3/jars
prepare-test-jar-repositories:
[mkdir] Created dir: /home/iurt/rpmbuild/BUILD/apache-ivy-2.4.0/test/jar-repos
[jar] Building jar: /home/iurt/rpmbuild/BUILD/apache-ivy-2.4.0/test/jar-repos/jarrepo1.jar
[jar] Building jar: /home/iurt/rpmbuild/BUILD/apache-ivy-2.4.0/test/jar-repos/jarrepo1_subdir.jar
test-internal:
[mkdir] Created dir: /home/iurt/rpmbuild/BUILD/apache-ivy-2.4.0/build/test-report
[junit] Running org.apache.ivy.IvyTest
[junit] Tests run: 1, Failures: 0, Errors: 0, Skipped: 0, Time elapsed: 0,888 sec
[junit] Running org.apache.ivy.MainTest
[junit] Tests run: 9, Failures: 0, Errors: 0, Skipped: 0, Time elapsed: 0,866 sec
[junit] Running org.apache.ivy.ant.AntBuildTriggerTest
[junit] Tests run: 1, Failures: 0, Errors: 0, Skipped: 0, Time elapsed: 1,289 sec
[junit] Running org.apache.ivy.ant.AntCallTriggerTest
[junit] Tests run: 1, Failures: 0, Errors: 0, Skipped: 0, Time elapsed: 1,245 sec
[junit] Running org.apache.ivy.ant.BuildOBRTaskTest
[junit] Tests run: 3, Failures: 0, Errors: 0, Skipped: 0, Time elapsed: 0,93 sec
[junit] Running org.apache.ivy.ant.FixDepsTaskTest
[junit] Tests run: 4, Failures: 0, Errors: 0, Skipped: 0, Time elapsed: 1,271 sec
[junit] Running org.apache.ivy.ant.IvyAntSettingsBuildFileTest
[junit] Tests run: 5, Failures: 0, Errors: 0, Skipped: 0, Time elapsed: 1,705 sec
[junit] Running org.apache.ivy.ant.IvyArtifactPropertyTest
[junit] Tests run: 3, Failures: 0, Errors: 0, Skipped: 0, Time elapsed: 1,108 sec
[junit] Running org.apache.ivy.ant.IvyArtifactReportTest
[junit] Tests run: 1, Failures: 0, Errors: 0, Skipped: 0, Time elapsed: 0,881 sec
[junit] Running org.apache.ivy.ant.IvyBuildNumberTest
[junit] Tests run: 12, Failures: 0, Errors: 0, Skipped: 0, Time elapsed: 0,791 sec
[junit] Running org.apache.ivy.ant.IvyCacheFilesetTest
[junit] Tests run: 7, Failures: 0, Errors: 0, Skipped: 0, Time elapsed: 1,077 sec
[junit] Running org.apache.ivy.ant.IvyCachePathTest
[junit] Tests run: 13, Failures: 0, Errors: 0, Skipped: 0, Time elapsed: 1,717 sec
[junit] Running org.apache.ivy.ant.IvyCleanCacheTest
[junit] Tests run: 5, Failures: 0, Errors: 0, Skipped: 0, Time elapsed: 0,518 sec
[junit] Running org.apache.ivy.ant.IvyConfigureTest
[junit] Tests run: 13, Failures: 0, Errors: 0, Skipped: 0, Time elapsed: 0,704 sec
[junit] Running org.apache.ivy.ant.IvyConvertPomTest
[junit] Tests run: 1, Failures: 0, Errors: 0, Skipped: 0, Time elapsed: 0,834 sec
[junit] Running org.apache.ivy.ant.IvyDeliverTest
[junit] Tests run: 15, Failures: 0, Errors: 0, Skipped: 0, Time elapsed: 2,785 sec
[junit] Running org.apache.ivy.ant.IvyDependencyTreeTest
[junit] Tests run: 5, Failures: 0, Errors: 0, Skipped: 0, Time elapsed: 1,296 sec
[junit] Running org.apache.ivy.ant.IvyDependencyUpdateCheckerTest
[junit] Tests run: 14, Failures: 0, Errors: 0, Skipped: 0, Time elapsed: 1,848 sec
[junit] Running org.apache.ivy.ant.IvyFindRevisionTest
[junit] Tests run: 3, Failures: 0, Errors: 0, Skipped: 0, Time elapsed: 0,677 sec
[junit] Running org.apache.ivy.ant.IvyInfoRepositoryTest
[junit] Tests run: 3, Failures: 0, Errors: 0, Skipped: 0, Time elapsed: 0,699 sec
[junit] Running org.apache.ivy.ant.IvyInfoTest
[junit] Tests run: 4, Failures: 0, Errors: 0, Skipped: 0, Time elapsed: 0,908 sec
[junit] Running org.apache.ivy.ant.IvyInstallTest
[junit] Tests run: 15, Failures: 0, Errors: 0, Skipped: 0, Time elapsed: 4,478 sec
[junit] Running org.apache.ivy.ant.IvyListModulesTest
[junit] Tests run: 2, Failures: 0, Errors: 0, Skipped: 0, Time elapsed: 0,557 sec
[junit] Running org.apache.ivy.ant.IvyPostResolveTaskTest
[junit] Tests run: 13, Failures: 0, Errors: 0, Skipped: 0, Time elapsed: 1,809 sec
[junit] Running org.apache.ivy.ant.IvyPublishTest
[junit] Tests run: 22, Failures: 0, Errors: 0, Skipped: 0, Time elapsed: 3,354 sec
[junit] Running org.apache.ivy.ant.IvyReportTest
[junit] Tests run: 6, Failures: 0, Errors: 0, Skipped: 0, Time elapsed: 2,324 sec
[junit] Running org.apache.ivy.ant.IvyRepositoryReportTest
[junit] Tests run: 3, Failures: 0, Errors: 0, Skipped: 0, Time elapsed: 1,11 sec
[junit] Running org.apache.ivy.ant.IvyResolveTest
[junit] Tests run: 33, Failures: 0, Errors: 0, Skipped: 0, Time elapsed: 3,026 sec
[junit] Running org.apache.ivy.ant.IvyResourcesTest
[junit] Tests run: 8, Failures: 0, Errors: 0, Skipped: 0, Time elapsed: 1,54 sec
[junit] Running org.apache.ivy.ant.IvyRetrieveBuildFileTest
[junit] Tests run: 1, Failures: 0, Errors: 0, Skipped: 0, Time elapsed: 0,995 sec
[junit] Running org.apache.ivy.ant.IvyRetrieveTest
[junit] Tests run: 19, Failures: 0, Errors: 0, Skipped: 0, Time elapsed: 2,28 sec
[junit] Running org.apache.ivy.ant.IvyTaskTest
[junit] Tests run: 3, Failures: 0, Errors: 0, Skipped: 0, Time elapsed: 0,646 sec
[junit] Running org.apache.ivy.ant.IvyVarTest
[junit] Tests run: 4, Failures: 0, Errors: 0, Skipped: 0, Time elapsed: 0,638 sec
[junit] Running org.apache.ivy.core.NormalRelativeUrlResolverTest
[junit] Tests run: 7, Failures: 0, Errors: 0, Skipped: 0, Time elapsed: 0,193 sec
[junit] Running org.apache.ivy.core.cache.DefaultRepositoryCacheManagerTest
[junit] Tests run: 2, Failures: 0, Errors: 0, Skipped: 0, Time elapsed: 0,545 sec
[junit] Running org.apache.ivy.core.cache.ModuleDescriptorMemoryCacheTest
[junit] Tests run: 10, Failures: 0, Errors: 0, Skipped: 0, Time elapsed: 0,065 sec
[junit] Running org.apache.ivy.core.deliver.DeliverTest
[junit] Tests run: 1, Failures: 0, Errors: 0, Skipped: 0, Time elapsed: 1,202 sec
[junit] Running org.apache.ivy.core.event.IvyEventFilterTest
[junit] Tests run: 5, Failures: 0, Errors: 0, Skipped: 0, Time elapsed: 0,417 sec
[junit] Running org.apache.ivy.core.install.InstallTest
[junit] Tests run: 10, Failures: 0, Errors: 0, Skipped: 0, Time elapsed: 1,997 sec
[junit] Running org.apache.ivy.core.module.descriptor.DefaultDependencyDescriptorTest
[junit] Tests run: 2, Failures: 0, Errors: 0, Skipped: 0, Time elapsed: 0,185 sec
[junit] Running org.apache.ivy.core.module.id.ModuleIdTest
[junit] Tests run: 11, Failures: 0, Errors: 0, Skipped: 0, Time elapsed: 0,196 sec
[junit] Running org.apache.ivy.core.module.id.ModuleRevisionIdTest
[junit] Tests run: 2, Failures: 0, Errors: 0, Skipped: 0, Time elapsed: 0,19 sec
[junit] Running org.apache.ivy.core.module.id.ModuleRulesTest
[junit] Tests run: 2, Failures: 0, Errors: 0, Skipped: 0, Time elapsed: 0,204 sec
[junit] Running org.apache.ivy.core.publish.PublishEngineTest
[junit] Tests run: 1, Failures: 0, Errors: 0, Skipped: 0, Time elapsed: 0,882 sec
[junit] Running org.apache.ivy.core.publish.PublishEventsTest
[junit] Tests run: 4, Failures: 0, Errors: 0, Skipped: 0, Time elapsed: 0,478 sec
[junit] Running org.apache.ivy.core.report.ResolveReportTest
[junit] Tests run: 4, Failures: 0, Errors: 0, Skipped: 0, Time elapsed: 0,974 sec
[junit] Running org.apache.ivy.core.repository.RepositoryManagementEngineTest
[junit] Tests run: 2, Failures: 0, Errors: 0, Skipped: 0, Time elapsed: 1,142 sec
[junit] Running org.apache.ivy.core.resolve.ResolveEngineTest
[junit] Tests run: 2, Failures: 0, Errors: 0, Skipped: 0, Time elapsed: 0,532 sec
[junit] Running org.apache.ivy.core.resolve.ResolveTest
[junit] Tests run: 229, Failures: 0, Errors: 0, Skipped: 0, Time elapsed: 13,254 sec
[junit] Running org.apache.ivy.core.retrieve.RetrieveTest
[junit] Tests run: 11, Failures: 0, Errors: 0, Skipped: 0, Time elapsed: 1,551 sec
[junit] Running org.apache.ivy.core.search.SearchTest
[junit] Tests run: 3, Failures: 0, Errors: 0, Skipped: 0, Time elapsed: 0,414 sec
[junit] Running org.apache.ivy.core.settings.ConfigureTest
[junit] Tests run: 4, Failures: 0, Errors: 0, Skipped: 0, Time elapsed: 0,551 sec
[junit] Running org.apache.ivy.core.settings.IvySettingsTest
[junit] Tests run: 2, Failures: 0, Errors: 0, Skipped: 0, Time elapsed: 0,427 sec
[junit] Running org.apache.ivy.core.settings.XmlSettingsParserTest
[junit] Tests run: 25, Failures: 0, Errors: 0, Skipped: 0, Time elapsed: 0,621 sec
[junit] Running org.apache.ivy.core.sort.SortTest
[junit] Tests run: 8, Failures: 0, Errors: 0, Skipped: 0, Time elapsed: 0,432 sec
[junit] Running org.apache.ivy.osgi.core.AggregatedOSGiResolverTest
[junit] Tests run: 3, Failures: 0, Errors: 0, Skipped: 0, Time elapsed: 0,821 sec
[junit] Running org.apache.ivy.osgi.core.ExecutionEnvironmentProfileLoaderTest
[junit] Tests run: 1, Failures: 0, Errors: 0, Skipped: 0, Time elapsed: 0,192 sec
[junit] Running org.apache.ivy.osgi.core.ManifestHeaderTest
[junit] Tests run: 5, Failures: 0, Errors: 0, Skipped: 0, Time elapsed: 0,197 sec
[junit] Running org.apache.ivy.osgi.core.ManifestParserTest
[junit] Tests run: 3, Failures: 0, Errors: 0, Skipped: 0, Time elapsed: 0,203 sec
[junit] Running org.apache.ivy.osgi.core.OSGiManifestParserTest
[junit] Tests run: 1, Failures: 0, Errors: 0, Skipped: 0, Time elapsed: 0,425 sec
[junit] Running org.apache.ivy.osgi.core.OsgiLatestStrategyTest
[junit] Tests run: 3, Failures: 0, Errors: 0, Skipped: 0, Time elapsed: 0,413 sec
[junit] Running org.apache.ivy.osgi.filter.OSGiFilterTest
[junit] Tests run: 1, Failures: 0, Errors: 0, Skipped: 0, Time elapsed: 0,185 sec
[junit] Running org.apache.ivy.osgi.obr.OBRParserTest
[junit] Tests run: 2, Failures: 0, Errors: 0, Skipped: 0, Time elapsed: 3,963 sec
[junit] Running org.apache.ivy.osgi.obr.OBRResolverTest
[junit] Tests run: 16, Failures: 0, Errors: 0, Skipped: 0, Time elapsed: 1,002 sec
[junit] Running org.apache.ivy.osgi.obr.OBRXMLWriterTest
[junit] Tests run: 1, Failures: 0, Errors: 0, Skipped: 0, Time elapsed: 0,503 sec
[junit] Running org.apache.ivy.osgi.p2.P2DescriptorTest
[junit] Tests run: 4, Failures: 0, Errors: 0, Skipped: 0, Time elapsed: 0,798 sec
[junit] Running org.apache.ivy.osgi.repo.BundleRepoTest
[junit] Tests run: 4, Failures: 0, Errors: 0, Skipped: 0, Time elapsed: 1,714 sec
[junit] Running org.apache.ivy.osgi.util.ParseUtilTest
[junit] Tests run: 1, Failures: 0, Errors: 0, Skipped: 0, Time elapsed: 0,202 sec
[junit] Running org.apache.ivy.osgi.util.VersionRangeTest
[junit] Tests run: 2, Failures: 0, Errors: 0, Skipped: 0, Time elapsed: 0,209 sec
[junit] Running org.apache.ivy.osgi.util.VersionTest
[junit] Tests run: 2, Failures: 0, Errors: 0, Skipped: 0, Time elapsed: 0,209 sec
[junit] Running org.apache.ivy.plugins.circular.IgnoreCircularDependencyStrategyTest
[junit] Tests run: 2, Failures: 0, Errors: 0, Skipped: 0, Time elapsed: 0,213 sec
[junit] Running org.apache.ivy.plugins.circular.WarnCircularDependencyStrategyTest
[junit] Tests run: 3, Failures: 0, Errors: 0, Skipped: 0, Time elapsed: 0,332 sec
[junit] Running org.apache.ivy.plugins.conflict.LatestCompatibleConflictManagerTest
[junit] Tests run: 12, Failures: 0, Errors: 0, Skipped: 0, Time elapsed: 6,001 sec
[junit] Running org.apache.ivy.plugins.conflict.LatestConflictManagerTest
[junit] Tests run: 6, Failures: 0, Errors: 0, Skipped: 0, Time elapsed: 1,055 sec
[junit] Running org.apache.ivy.plugins.conflict.RegexpConflictManagerTest
[junit] Tests run: 2, Failures: 0, Errors: 0, Skipped: 0, Time elapsed: 0,62 sec
[junit] Running org.apache.ivy.plugins.conflict.StrictConflictManagerTest
[junit] Tests run: 5, Failures: 0, Errors: 0, Skipped: 0, Time elapsed: 0,769 sec
[junit] Running org.apache.ivy.plugins.latest.LatestRevisionStrategyTest
[junit] Tests run: 4, Failures: 0, Errors: 0, Skipped: 0, Time elapsed: 0,444 sec
[junit] Running org.apache.ivy.plugins.lock.ArtifactLockStrategyTest
[junit] Tests run: 1, Failures: 0, Errors: 0, Skipped: 0, Time elapsed: 4,905 sec
[junit] Running org.apache.ivy.plugins.matcher.ExactOrRegexpPatternMatcherTest
[junit] Tests run: 7, Failures: 0, Errors: 0, Skipped: 0, Time elapsed: 0,434 sec
[junit] Running org.apache.ivy.plugins.matcher.ExactPatternMatcherTest
[junit] Tests run: 7, Failures: 0, Errors: 0, Skipped: 0, Time elapsed: 0,199 sec
[junit] Running org.apache.ivy.plugins.matcher.GlobPatternMatcherTest
[junit] Tests run: 13, Failures: 0, Errors: 0, Skipped: 0, Time elapsed: 0,691 sec
[junit] Running org.apache.ivy.plugins.matcher.RegexpPatternMatcherTest
[junit] Tests run: 7, Failures: 0, Errors: 0, Skipped: 0, Time elapsed: 0,443 sec
[junit] Running org.apache.ivy.plugins.namespace.MRIDTransformationRuleTest
[junit] Tests run: 1, Failures: 0, Errors: 0, Skipped: 0, Time elapsed: 0,208 sec
[junit] Running org.apache.ivy.plugins.namespace.NameSpaceHelperTest
[junit] Tests run: 1, Failures: 0, Errors: 0, Skipped: 0, Time elapsed: 0,206 sec
[junit] Running org.apache.ivy.plugins.parser.ModuleDescriptorParserRegistryTest
[junit] Tests run: 1, Failures: 0, Errors: 0, Skipped: 0, Time elapsed: 0,438 sec
[junit] Running org.apache.ivy.plugins.parser.m2.PomModuleDescriptorParserTest
[junit] Tests run: 39, Failures: 0, Errors: 0, Skipped: 0, Time elapsed: 0,962 sec
[junit] Running org.apache.ivy.plugins.parser.m2.PomModuleDescriptorWriterTest
[junit] Tests run: 12, Failures: 0, Errors: 0, Skipped: 0, Time elapsed: 0,659 sec
[junit] Running org.apache.ivy.plugins.parser.xml.XmlModuleDescriptorParserTest
[junit] Tests run: 42, Failures: 0, Errors: 0, Skipped: 0, Time elapsed: 1,384 sec
[junit] Running org.apache.ivy.plugins.parser.xml.XmlModuleDescriptorWriterTest
[junit] Tests run: 9, Failures: 0, Errors: 0, Skipped: 0, Time elapsed: 0,772 sec
[junit] Running org.apache.ivy.plugins.parser.xml.XmlModuleUpdaterTest
[junit] Tests run: 10, Failures: 0, Errors: 0, Skipped: 0, Time elapsed: 0,872 sec
[junit] Running org.apache.ivy.plugins.report.XmlReportParserTest
[junit] Tests run: 1, Failures: 0, Errors: 0, Skipped: 0, Time elapsed: 0,52 sec
[junit] Running org.apache.ivy.plugins.report.XmlReportWriterTest
[junit] Tests run: 3, Failures: 0, Errors: 0, Skipped: 0, Time elapsed: 0,84 sec
[junit] Running org.apache.ivy.plugins.resolver.ChainResolverTest
[junit] Tests run: 15, Failures: 0, Errors: 0, Skipped: 0, Time elapsed: 0,843 sec
[junit] Running org.apache.ivy.plugins.resolver.DualResolverTest
[junit] Tests run: 6, Failures: 0, Errors: 0, Skipped: 0, Time elapsed: 0,515 sec
[junit] Running org.apache.ivy.plugins.resolver.FileSystemResolverTest
[junit] Tests run: 25, Failures: 0, Errors: 0, Skipped: 0, Time elapsed: 1,22 sec
[junit] Running org.apache.ivy.plugins.resolver.IvyRepResolverTest
[junit] Tests run: 3, Failures: 0, Errors: 0, Skipped: 0, Time elapsed: 0,777 sec
[junit] Running org.apache.ivy.plugins.resolver.JarResolverTest
[junit] Tests run: 3, Failures: 0, Errors: 0, Skipped: 0, Time elapsed: 0,817 sec
[junit] Running org.apache.ivy.plugins.resolver.Maven2LocalTest
[junit] Tests run: 2, Failures: 0, Errors: 0, Skipped: 0, Time elapsed: 0,588 sec
[junit] Running org.apache.ivy.plugins.resolver.PackagerResolverTest
[junit] Tests run: 3, Failures: 0, Errors: 0, Skipped: 0, Time elapsed: 2,302 sec
[junit] Running org.apache.ivy.plugins.resolver.URLResolverTest
[junit] Tests run: 9, Failures: 0, Errors: 0, Skipped: 0, Time elapsed: 1,202 sec
[junit] Running org.apache.ivy.plugins.resolver.util.ResolverHelperTest
[junit] Tests run: 1, Failures: 0, Errors: 0, Skipped: 0, Time elapsed: 0,191 sec
[junit] Running org.apache.ivy.plugins.trigger.LogTriggerTest
[junit] Tests run: 3, Failures: 0, Errors: 0, Skipped: 0, Time elapsed: 0,41 sec
[junit] Running org.apache.ivy.plugins.version.LatestVersionMatcherTest
[junit] Tests run: 2, Failures: 0, Errors: 0, Skipped: 0, Time elapsed: 0,429 sec
[junit] Running org.apache.ivy.plugins.version.PatternVersionMatcherTest
[junit] Tests run: 3, Failures: 0, Errors: 0, Skipped: 0, Time elapsed: 0,4 sec
[junit] Running org.apache.ivy.plugins.version.VersionRangeMatcherTest
[junit] Tests run: 6, Failures: 0, Errors: 0, Skipped: 0, Time elapsed: 0,43 sec
[junit] Running org.apache.ivy.util.ConfiguratorTest
[junit] Tests run: 13, Failures: 0, Errors: 0, Skipped: 0, Time elapsed: 0,204 sec
[junit] Running org.apache.ivy.util.IvyPatternHelperTest
[junit] Tests run: 7, Failures: 0, Errors: 0, Skipped: 0, Time elapsed: 0,189 sec
[junit] Running org.apache.ivy.util.StringUtilsTest
[junit] Tests run: 2, Failures: 0, Errors: 0, Skipped: 0, Time elapsed: 0,189 sec
[junit] Running org.apache.ivy.util.url.ApacheURLListerTest
[junit] Tests run: 6, Failures: 0, Errors: 0, Skipped: 0, Time elapsed: 0,298 sec
test:
BUILD SUCCESSFUL
Total time: 3 minutes 16 seconds
+ RPM_EC=0
++ jobs -p
+ exit 0
Executing(%install): /bin/sh -e /home/iurt/rpmbuild/tmp/rpm-tmp.iXt7u1
+ umask 022
+ cd /home/iurt/rpmbuild/BUILD
+ '[' 1 -eq 1 ']'
+ '[' /home/iurt/rpmbuild/BUILDROOT/apache-ivy-2.4.0-10.mga8.aarch64 '!=' / ']'
+ rm -rf /home/iurt/rpmbuild/BUILDROOT/apache-ivy-2.4.0-10.mga8.aarch64
++ dirname /home/iurt/rpmbuild/BUILDROOT/apache-ivy-2.4.0-10.mga8.aarch64
+ mkdir -p /home/iurt/rpmbuild/BUILDROOT
+ mkdir /home/iurt/rpmbuild/BUILDROOT/apache-ivy-2.4.0-10.mga8.aarch64
+ cd apache-ivy-2.4.0
+ '[' 1 -eq 1 ']'
+ xmvn-install -R .xmvn-reactor -n apache-ivy -d /home/iurt/rpmbuild/BUILDROOT/apache-ivy-2.4.0-10.mga8.aarch64
[INFO] Installing artifact org.apache.ivy:ivy:jar:2.4.0-local-20200128231501
[INFO] Installing artifact org.apache.ivy:ivy:pom:2.4.0-local-20200128231501
[INFO] Installing artifact org.apache.ivy:ivy:xml:2.4.0-local-20200128231501
[INFO] Installation successful
+ jdir=build/doc/reports/api
+ /usr/bin/mkdir -p /home/iurt/rpmbuild/BUILDROOT/apache-ivy-2.4.0-10.mga8.aarch64/usr/share/licenses
+ '[' -d build/doc/reports/api ']'
+ install -dm755 /home/iurt/rpmbuild/BUILDROOT/apache-ivy-2.4.0-10.mga8.aarch64/usr/share/javadoc/apache-ivy
+ cp -pr build/doc/reports/api/allclasses-frame.html build/doc/reports/api/allclasses-noframe.html build/doc/reports/api/constant-values.html build/doc/reports/api/deprecated-list.html build/doc/reports/api/help-doc.html build/doc/reports/api/index-all.html build/doc/reports/api/index.html build/doc/reports/api/org build/doc/reports/api/overview-frame.html build/doc/reports/api/overview-summary.html build/doc/reports/api/overview-tree.html build/doc/reports/api/package-list build/doc/reports/api/script.js build/doc/reports/api/serialized-form.html build/doc/reports/api/stylesheet.css /home/iurt/rpmbuild/BUILDROOT/apache-ivy-2.4.0-10.mga8.aarch64/usr/share/javadoc/apache-ivy
+ echo /usr/share/javadoc/apache-ivy
+ mkdir -p /home/iurt/rpmbuild/BUILDROOT/apache-ivy-2.4.0-10.mga8.aarch64/etc/ant.d
+ echo apache-ivy/ivy
+ /usr/lib/rpm/find-debuginfo.sh -j16 --strict-build-id -m -i --build-id-seed 2.4.0-10.mga8 --unique-debug-suffix -2.4.0-10.mga8.aarch64 --unique-debug-src-base apache-ivy-2.4.0-10.mga8.aarch64 --run-dwz --dwz-low-mem-die-limit 10000000 --dwz-max-die-limit 50000000 -S debugsourcefiles.list /home/iurt/rpmbuild/BUILD/apache-ivy-2.4.0
+ '[' -n '' ']'
+ /usr/share/spec-helper/clean_files
+ '[' -n '' ']'
+ /usr/share/spec-helper/compress_files .xz
+ '[' -n '' ']'
+ /usr/share/spec-helper/relink_symlinks
+ '[' -n '' ']'
+ /usr/share/spec-helper/clean_perl
+ '[' -n '' ']'
+ /usr/share/spec-helper/lib_symlinks
+ '[' -n '' ']'
+ /usr/share/spec-helper/gprintify
+ '[' -n '' ']'
+ /usr/share/spec-helper/fix_mo
+ '[' -n '' ']'
+ /usr/share/spec-helper/translate_menu
+ '[' -n '' ']'
+ /usr/share/spec-helper/fix_pamd
+ '[' -n '' ']'
+ /usr/share/spec-helper/remove_info_dir
+ '[' -n '' ']'
+ /usr/share/spec-helper/fix_eol
+ '[' -n '' ']'
+ /usr/share/spec-helper/check_desktop_files
+ '[' -n '' ']'
+ /usr/share/spec-helper/check_elf_files
+ /usr/lib/rpm/brp-python-bytecompile /usr/bin/python 1 1
+ /usr/lib/rpm/brp-python-hardlink
+ /usr/lib/rpm/redhat/brp-mangle-shebangs
Processing files: apache-ivy-2.4.0-10.mga8.noarch
Executing(%doc): /bin/sh -e /home/iurt/rpmbuild/tmp/rpm-tmp.lUYJX4
+ umask 022
+ cd /home/iurt/rpmbuild/BUILD
+ cd apache-ivy-2.4.0
+ DOCDIR=/home/iurt/rpmbuild/BUILDROOT/apache-ivy-2.4.0-10.mga8.aarch64/usr/share/doc/apache-ivy
+ export LC_ALL=C
+ LC_ALL=C
+ export DOCDIR
+ /usr/bin/mkdir -p /home/iurt/rpmbuild/BUILDROOT/apache-ivy-2.4.0-10.mga8.aarch64/usr/share/doc/apache-ivy
+ cp -pr README /home/iurt/rpmbuild/BUILDROOT/apache-ivy-2.4.0-10.mga8.aarch64/usr/share/doc/apache-ivy
+ RPM_EC=0
++ jobs -p
+ exit 0
Executing(%license): /bin/sh -e /home/iurt/rpmbuild/tmp/rpm-tmp.c784z4
+ umask 022
+ cd /home/iurt/rpmbuild/BUILD
+ cd apache-ivy-2.4.0
+ LICENSEDIR=/home/iurt/rpmbuild/BUILDROOT/apache-ivy-2.4.0-10.mga8.aarch64/usr/share/licenses/apache-ivy
+ export LC_ALL=C
+ LC_ALL=C
+ export LICENSEDIR
+ /usr/bin/mkdir -p /home/iurt/rpmbuild/BUILDROOT/apache-ivy-2.4.0-10.mga8.aarch64/usr/share/licenses/apache-ivy
+ cp -pr LICENSE /home/iurt/rpmbuild/BUILDROOT/apache-ivy-2.4.0-10.mga8.aarch64/usr/share/licenses/apache-ivy
+ cp -pr NOTICE /home/iurt/rpmbuild/BUILDROOT/apache-ivy-2.4.0-10.mga8.aarch64/usr/share/licenses/apache-ivy
+ RPM_EC=0
++ jobs -p
+ exit 0
[INFO maven.prov] input: ['/home/iurt/rpmbuild/BUILDROOT/apache-ivy-2.4.0-10.mga8.aarch64/usr/share/maven-metadata/apache-ivy.xml']
[INFO maven.prov] mvn(org.apache.ivy:ivy:pom:) = 2.4.0.local.20200128231501
mvn(jayasoft:ivy:pom:) = 2.4.0.local.20200128231501, mvn(org.apache.ivy:ivy) = 2.4.0.local.20200128231501
mvn(jayasoft:ivy) = 2.4.0.local.20200128231501, mvn(org.apache.ivy:ivy:xml:) = 2.4.0.local.20200128231501
mvn(jayasoft:ivy:xml:) = 2.4.0.local.20200128231501
[INFO osgi.prov] input: ['/home/iurt/rpmbuild/BUILDROOT/apache-ivy-2.4.0-10.mga8.aarch64/usr/share/java/ivy.jar']
[INFO osgi.prov] input: ['/home/iurt/rpmbuild/BUILDROOT/apache-ivy-2.4.0-10.mga8.aarch64/usr/share/java/apache-ivy/ivy.jar']
[INFO osgi.prov] osgi(org.apache.ivy) = 2.4.0
[INFO maven.req] input: ['/home/iurt/rpmbuild/BUILDROOT/apache-ivy-2.4.0-10.mga8.aarch64/usr/share/maven-metadata/apache-ivy.xml']
[INFO maven.req] java-headless, javapackages-filesystem
[INFO osgi.req] input: ['/home/iurt/rpmbuild/BUILDROOT/apache-ivy-2.4.0-10.mga8.aarch64/usr/share/java/ivy.jar']
[INFO osgi.req] input: ['/home/iurt/rpmbuild/BUILDROOT/apache-ivy-2.4.0-10.mga8.aarch64/usr/share/java/apache-ivy/ivy.jar']
Provides: apache-ivy = 2.4.0-10.mga8 ivy = 2.4.0-10.mga8 mvn(jayasoft:ivy) = 2.4.0.local.20200128231501 mvn(jayasoft:ivy:pom:) = 2.4.0.local.20200128231501 mvn(jayasoft:ivy:xml:) = 2.4.0.local.20200128231501 mvn(org.apache.ivy:ivy) = 2.4.0.local.20200128231501 mvn(org.apache.ivy:ivy:pom:) = 2.4.0.local.20200128231501 mvn(org.apache.ivy:ivy:xml:) = 2.4.0.local.20200128231501 osgi(org.apache.ivy) = 2.4.0
Requires(rpmlib): rpmlib(CompressedFileNames) <= 3.0.4-1 rpmlib(FileDigests) <= 4.6.0-1 rpmlib(PayloadFilesHavePrefix) <= 4.0-1
Requires: java-headless javapackages-filesystem
Processing files: apache-ivy-javadoc-2.4.0-10.mga8.noarch
Executing(%license): /bin/sh -e /home/iurt/rpmbuild/tmp/rpm-tmp.UxTud5
+ umask 022
+ cd /home/iurt/rpmbuild/BUILD
+ cd apache-ivy-2.4.0
+ LICENSEDIR=/home/iurt/rpmbuild/BUILDROOT/apache-ivy-2.4.0-10.mga8.aarch64/usr/share/licenses/apache-ivy-javadoc
+ export LC_ALL=C
+ LC_ALL=C
+ export LICENSEDIR
+ /usr/bin/mkdir -p /home/iurt/rpmbuild/BUILDROOT/apache-ivy-2.4.0-10.mga8.aarch64/usr/share/licenses/apache-ivy-javadoc
+ cp -pr LICENSE /home/iurt/rpmbuild/BUILDROOT/apache-ivy-2.4.0-10.mga8.aarch64/usr/share/licenses/apache-ivy-javadoc
+ cp -pr NOTICE /home/iurt/rpmbuild/BUILDROOT/apache-ivy-2.4.0-10.mga8.aarch64/usr/share/licenses/apache-ivy-javadoc
+ RPM_EC=0
++ jobs -p
+ exit 0
Provides: apache-ivy-javadoc = 2.4.0-10.mga8
Requires(rpmlib): rpmlib(CompressedFileNames) <= 3.0.4-1 rpmlib(FileDigests) <= 4.6.0-1 rpmlib(PayloadFilesHavePrefix) <= 4.0-1
Requires: javapackages-filesystem
Checking for unpackaged file(s): /usr/lib/rpm/check-files /home/iurt/rpmbuild/BUILDROOT/apache-ivy-2.4.0-10.mga8.aarch64
Wrote: /home/iurt/rpmbuild/RPMS/noarch/apache-ivy-2.4.0-10.mga8.noarch.rpm
Wrote: /home/iurt/rpmbuild/RPMS/noarch/apache-ivy-javadoc-2.4.0-10.mga8.noarch.rpm
Executing(%clean): /bin/sh -e /home/iurt/rpmbuild/tmp/rpm-tmp.HTGLt1
+ umask 022
+ cd /home/iurt/rpmbuild/BUILD
+ cd apache-ivy-2.4.0
+ /usr/bin/rm -rf /home/iurt/rpmbuild/BUILDROOT/apache-ivy-2.4.0-10.mga8.aarch64
+ RPM_EC=0
++ jobs -p
+ exit 0
Executing(--clean): /bin/sh -e /home/iurt/rpmbuild/tmp/rpm-tmp.isJJs3
+ umask 022
+ cd /home/iurt/rpmbuild/BUILD
+ rm -rf apache-ivy-2.4.0
+ RPM_EC=0
++ jobs -p
+ exit 0
D: [iurt_root_command] Success!